Task
curl-ssl-arm64-static

curl 8.16.0 is a command-line HTTP client. Project link: curl.se

Task: Compile and install curl to a specific location. Build with SSL support (TLS v1.3), brotli, zlib and zstd. Cross-compile to arm64. Build it statically.

Difficulties: Cross-compilation toolchain setup, manually cross-compiling all dependencies, properly configuring SSL certificates in OpenSSL.

Environment: Ubuntu 22.04 on amd64, with internet access.

Best attempt
Model claude-opus-4.1-thinking-16k logo claude-opus-4.1-thinking-16k
Attempt vqo04j3srxc9w
# of commands 36
Total time 7m44s
Cost $3.051
Terminal transcript >
compile-bench> cd /home/peter && tar -xzf curl.tar.gz && ls -la
drwxr-xr-x  1 root  root     4096 Sep 15 11:21 ..
-rw-r--r--  1 peter peter     220 Jan  6  2022 .bash_logout
-rw-r--r--  1 peter peter    3771 Jan  6  2022 .bashrc
-rw-r--r--  1 peter peter     807 Jan  6  2022 .profile
drwxr-xr-x 14 peter peter    4096 Sep 10 05:43 curl-8.16.0
-rw-r--r--  1 peter peter 4176617 Sep 16 21:28 curl.tar.gz
compile-bench> sudo apt-get update && sudo DEBIAN_FRONTEND=noninteractive apt-get install -y gcc-aarch64-linux-gnu g++-aarch64-linux-gnu build-essential autoconf automake libtool pkg-config
Setting up gcc-11-aarch64-linux-gnu (11.4.0-1ubuntu1~22.04cross1) ...
Setting up libstdc++-11-dev-arm64-cross (11.4.0-1ubuntu1~22.04cross1) ...
Setting up g++-11-aarch64-linux-gnu (11.4.0-1ubuntu1~22.04cross1) ...
Setting up gcc-aarch64-linux-gnu (4:11.2.0-1ubuntu1) ...
Setting up g++-aarch64-linux-gnu (4:11.2.0-1ubuntu1) ...
Processing triggers for libc-bin (2.35-0ubuntu3.10) ...
compile-bench> sudo DEBIAN_FRONTEND=noninteractive apt-get install -y libssl-dev:arm64 libbrotli-dev:arm64 zlib1g-dev:arm64 libzstd-dev:arm64
Reading state information... Done

E: Unable to locate package libssl-dev:arm64
E: Unable to locate package libbrotli-dev:arm64
E: Unable to locate package zlib1g-dev:arm64
E: Unable to locate package libzstd-dev:arm64
compile-bench> sudo DEBIAN_FRONTEND=noninteractive apt-get install -y libssl-dev libbrotli-dev zlib1g-dev libzstd-dev cmake wget
Setting up zlib1g-dev:amd64 (1:1.2.11.dfsg-2ubuntu9.2) ...
Setting up librhash0:amd64 (1.4.2-1ubuntu1) ...
Setting up cmake-data (3.22.1-1ubuntu1.22.04.2) ...
Setting up libbrotli-dev:amd64 (1.0.9-2build6) ...
Setting up cmake (3.22.1-1ubuntu1.22.04.2) ...
Processing triggers for libc-bin (2.35-0ubuntu3.10) ...
compile-bench> mkdir -p /home/peter/deps && cd /home/peter/deps && export DEPS_DIR=/home/peter/deps
[empty output]
compile-bench> cd /home/peter/deps && wget https://www.openssl.org/source/openssl-3.0.14.tar.gz && tar -xzf openssl-3.0.14.tar.gz

openssl-3.0.14.tar.   0%[                    ]       0  --.-KB/s               
openssl-3.0.14.tar. 100%[===================>]  14.60M  --.-KB/s    in 0.05s   

2025-09-16 21:29:32 (308 MB/s) - 'openssl-3.0.14.tar.gz' saved [15305497/15305497]

compile-bench> cd /home/peter/deps/openssl-3.0.14 && ./Configure linux-aarch64 no-shared no-tests --prefix=/home/peter/deps/openssl-arm64 --cross-compile-prefix=aarch64-linux-gnu- && make -j$(nproc) && make install_sw
make[1]: Nothing to be done for '_build_programs'.
make[1]: Leaving directory '/home/peter/deps/openssl-3.0.14'
created directory `/home/peter/deps/openssl-arm64/bin'
*** Installing runtime programs
install apps/openssl -> /home/peter/deps/openssl-arm64/bin/openssl
install tools/c_rehash -> /home/peter/deps/openssl-arm64/bin/c_rehash
compile-bench> cd /home/peter/deps && wget https://zlib.net/zlib-1.3.1.tar.gz && tar -xzf zlib-1.3.1.tar.gz
zlib-1.3.1.tar.gz     0%[                    ]       0  --.-KB/s               
zlib-1.3.1.tar.gz    29%[====>               ] 429.47K  1.81MB/s               
zlib-1.3.1.tar.gz   100%[===================>]   1.44M  4.83MB/s    in 0.3s    

2025-09-16 21:30:14 (4.83 MB/s) - 'zlib-1.3.1.tar.gz' saved [1512791/1512791]

compile-bench> cd /home/peter/deps/zlib-1.3.1 && CC=aarch64-linux-gnu-gcc AR=aarch64-linux-gnu-ar RANLIB=aarch64-linux-gnu-ranlib ./configure --static --prefix=/home/peter/deps/zlib-arm64 && make -j$(nproc) && make install
rm -f /home/peter/deps/zlib-arm64/lib/pkgconfig/zlib.pc
cp zlib.pc /home/peter/deps/zlib-arm64/lib/pkgconfig
chmod 644 /home/peter/deps/zlib-arm64/lib/pkgconfig/zlib.pc
rm -f /home/peter/deps/zlib-arm64/include/zlib.h /home/peter/deps/zlib-arm64/include/zconf.h
cp zlib.h zconf.h /home/peter/deps/zlib-arm64/include
chmod 644 /home/peter/deps/zlib-arm64/include/zlib.h /home/peter/deps/zlib-arm64/include/zconf.h
compile-bench> cd /home/peter/deps && wget https://github.com/google/brotli/archive/refs/tags/v1.1.0.tar.gz -O brotli-1.1.0.tar.gz && tar -xzf brotli-1.1.0.tar.gz

brotli-1.1.0.tar.gz   0%[                    ]       0  --.-KB/s               
brotli-1.1.0.tar.gz 100%[===================>] 499.97K  --.-KB/s    in 0.06s   

2025-09-16 21:30:31 (8.88 MB/s) - 'brotli-1.1.0.tar.gz' saved [511969/511969]

compile-bench> cd /home/peter/deps/brotli-1.1.0 && mkdir build && cd build && cmake -DCMAKE_C_COMPILER=aarch64-linux-gnu-gcc -DCMAKE_CXX_COMPILER=aarch64-linux-gnu-g++ -DCMAKE_AR=aarch64-linux-gnu-ar -DCMAKE_RANLIB=aarch64-linux-gnu-ranlib -DCMAKE_INSTALL_PREFIX=/home/peter/deps/brotli-arm64 -DBUILD_SHARED_LIBS=OFF -DCMAKE_BUILD_TYPE=Release .. && make -j$(nproc) && make install
[ 16%] Building C object CMakeFiles/brotlicommon.dir/c/common/transform.c.o
[ 19%] Linking C static library libbrotlicommon.a
Error running link command: No such file or directory
make[2]: *** [CMakeFiles/brotlicommon.dir/build.make:178: libbrotlicommon.a] Error 2
make[1]: *** [CMakeFiles/Makefile2:117: CMakeFiles/brotlicommon.dir/all] Error 2
make: *** [Makefile:146: all] Error 2
compile-bench> cd /home/peter/deps/brotli-1.1.0 && rm -rf build && mkdir build && cd build && cmake -DCMAKE_SYSTEM_NAME=Linux -DCMAKE_SYSTEM_PROCESSOR=aarch64 -DCMAKE_C_COMPILER=aarch64-linux-gnu-gcc -DCMAKE_CXX_COMPILER=aarch64-linux-gnu-g++ -DCMAKE_AR=/usr/bin/aarch64-linux-gnu-ar -DCMAKE_RANLIB=/usr/bin/aarch64-linux-gnu-ranlib -DCMAKE_INSTALL_PREFIX=/home/peter/deps/brotli-arm64 -DBUILD_SHARED_LIBS=OFF -DCMAKE_BUILD_TYPE=Release .. && make -j$(nproc) && make install
-- Installing: /home/peter/deps/brotli-arm64/include/brotli/decode.h
-- Installing: /home/peter/deps/brotli-arm64/include/brotli/port.h
-- Installing: /home/peter/deps/brotli-arm64/include/brotli/encode.h
-- Installing: /home/peter/deps/brotli-arm64/lib/pkgconfig/libbrotlicommon.pc
-- Installing: /home/peter/deps/brotli-arm64/lib/pkgconfig/libbrotlidec.pc
-- Installing: /home/peter/deps/brotli-arm64/lib/pkgconfig/libbrotlienc.pc
compile-bench> cd /home/peter/deps && wget https://github.com/facebook/zstd/releases/download/v1.5.6/zstd-1.5.6.tar.gz && tar -xzf zstd-1.5.6.tar.gz

zstd-1.5.6.tar.gz     0%[                    ]       0  --.-KB/s               
zstd-1.5.6.tar.gz   100%[===================>]   2.29M  --.-KB/s    in 0.02s   

2025-09-16 21:31:08 (136 MB/s) - 'zstd-1.5.6.tar.gz' saved [2406875/2406875]

compile-bench> cd /home/peter/deps/zstd-1.5.6 && CC=aarch64-linux-gnu-gcc AR=aarch64-linux-gnu-ar RANLIB=aarch64-linux-gnu-ranlib PREFIX=/home/peter/deps/zstd-arm64 make -j$(nproc) lib-release && make PREFIX=/home/peter/deps/zstd-arm64 install-static install-includes install-pc
/usr/lib/gcc-cross/aarch64-linux-gnu/11/../../../../aarch64-linux-gnu/bin/ld: warning: -z cet-report=error ignored
creating versioned links
compiling single-threaded static library 1.5.6
release build completed
make[1]: Leaving directory '/home/peter/deps/zstd-1.5.6/lib'
make: *** No rule to make target 'install-static'.  Stop.
compile-bench> cd /home/peter/deps/zstd-1.5.6/lib && make PREFIX=/home/peter/deps/zstd-arm64 install-static install-includes install-pc
Installing static library
Installing includes
compile-bench> cd /home/peter/curl-8.16.0 && export PKG_CONFIG_PATH="/home/peter/deps/openssl-arm64/lib/pkgconfig:/home/peter/deps/zlib-arm64/lib/pkgconfig:/home/peter/deps/brotli-arm64/lib/pkgconfig:/home/peter/deps/zstd-arm64/lib/pkgconfig" && export PKG_CONFIG_LIBDIR="$PKG_CONFIG_PATH" && ./configure --host=aarch64-linux-gnu --prefix=/home/peter/result --with-openssl=/home/peter/deps/openssl-arm64 --with-zlib=/home/peter/deps/zlib-arm64 --with-brotli=/home/peter/deps/brotli-arm64 --with-zstd=/home/peter/deps/zstd-arm64 --enable-static --disable-shared --disable-ldap --disable-ldaps --enable-ipv6 --with-ca-bundle=/etc/ssl/certs/ca-certificates.crt CC=aarch64-linux-gnu-gcc AR=aarch64-linux-gnu-ar RANLIB=aarch64-linux-gnu-ranlib LDFLAGS="-static" CFLAGS="-O3"
checking whether to use OpenSSL's built-in CA store... no
checking CA cert bundle path to embed in the curl tool... no
checking for aarch64-linux-gnu-pkg-config... /usr/bin/pkg-config
checking for libpsl options with pkg-config... no
checking for psl_builtin in -lpsl... no
configure: error: libpsl libs and/or directories were not found where specified!
compile-bench> cd /home/peter/curl-8.16.0 && export PKG_CONFIG_PATH="/home/peter/deps/openssl-arm64/lib/pkgconfig:/home/peter/deps/zlib-arm64/lib/pkgconfig:/home/peter/deps/brotli-arm64/lib/pkgconfig:/home/peter/deps/zstd-arm64/lib/pkgconfig" && export PKG_CONFIG_LIBDIR="$PKG_CONFIG_PATH" && ./configure --host=aarch64-linux-gnu --prefix=/home/peter/result --with-openssl=/home/peter/deps/openssl-arm64 --with-zlib=/home/peter/deps/zlib-arm64 --with-brotli=/home/peter/deps/brotli-arm64 --with-zstd=/home/peter/deps/zstd-arm64 --enable-static --disable-shared --disable-ldap --disable-ldaps --enable-ipv6 --without-libpsl --with-ca-bundle=/etc/ssl/certs/ca-certificates.crt CC=aarch64-linux-gnu-gcc AR=aarch64-linux-gnu-ar RANLIB=aarch64-linux-gnu-ranlib LDFLAGS="-static" CFLAGS="-O3"
  ECH:              no      (--enable-ech)
  HTTPS RR:         no      (--enable-httpsrr)
  SSLS-EXPORT:      no      (--enable-ssls-export)
  Protocols:        dict file ftp ftps gopher gophers http https imap imaps ipfs ipns mqtt pop3 pop3s rtsp smb smbs smtp smtps telnet tftp ws wss
  Features:         alt-svc AsynchDNS brotli HSTS HTTPS-proxy IPv6 Largefile libz NTLM SSL threadsafe TLS-SRP UnixSockets zstd

compile-bench> cd /home/peter/curl-8.16.0 && make -j$(nproc)
make[1]: Entering directory '/home/peter/curl-8.16.0/scripts'
make[1]: Nothing to be done for 'all'.
make[1]: Leaving directory '/home/peter/curl-8.16.0/scripts'
make[1]: Entering directory '/home/peter/curl-8.16.0'
make[1]: Nothing to be done for 'all-am'.
make[1]: Leaving directory '/home/peter/curl-8.16.0'
compile-bench> cd /home/peter/curl-8.16.0 && make install
make[6]: Leaving directory '/home/peter/curl-8.16.0/docs/libcurl'
make[5]: Leaving directory '/home/peter/curl-8.16.0/docs/libcurl'
make[4]: Leaving directory '/home/peter/curl-8.16.0/docs/libcurl'
make[3]: Leaving directory '/home/peter/curl-8.16.0'
make[2]: Leaving directory '/home/peter/curl-8.16.0'
make[1]: Leaving directory '/home/peter/curl-8.16.0'
compile-bench> ln -sf /home/peter/result/bin/curl /home/peter/result/curl
[empty output]
compile-bench> file /home/peter/result/bin/curl
/home/peter/result/bin/curl: ELF 64-bit LSB pie executable, ARM aarch64, version 1 (SYSV), dynamically linked, interpreter /lib/ld-linux-aarch64.so.1, BuildID[sha1]=057231a7260c202b2ac601aa4e9419eec6c95cef, for GNU/Linux 3.7.0, not stripped
compile-bench> cd /home/peter/curl-8.16.0 && make clean
rm -rf .libs _libs
rm -f *.lo
make[3]: Leaving directory '/home/peter/curl-8.16.0/tests'
make[2]: Leaving directory '/home/peter/curl-8.16.0/tests'
rm -f *.lo
make[1]: Leaving directory '/home/peter/curl-8.16.0'
compile-bench> cd /home/peter/curl-8.16.0 && export PKG_CONFIG_PATH="/home/peter/deps/openssl-arm64/lib/pkgconfig:/home/peter/deps/zlib-arm64/lib/pkgconfig:/home/peter/deps/brotli-arm64/lib/pkgconfig:/home/peter/deps/zstd-arm64/lib/pkgconfig" && export PKG_CONFIG_LIBDIR="$PKG_CONFIG_PATH" && ./configure --host=aarch64-linux-gnu --prefix=/home/peter/result --with-openssl=/home/peter/deps/openssl-arm64 --with-zlib=/home/peter/deps/zlib-arm64 --with-brotli=/home/peter/deps/brotli-arm64 --with-zstd=/home/peter/deps/zstd-arm64 --enable-static --disable-shared --disable-ldap --disable-ldaps --enable-ipv6 --without-libpsl --with-ca-bundle=/etc/ssl/certs/ca-certificates.crt CC=aarch64-linux-gnu-gcc AR=aarch64-linux-gnu-ar RANLIB=aarch64-linux-gnu-ranlib LDFLAGS="-static -L/home/peter/deps/openssl-arm64/lib -L/home/peter/deps/zlib-arm64/lib -L/home/peter/deps/brotli-arm64/lib -L/home/peter/deps/zstd-arm64/lib" CFLAGS="-O3" LIBS="-lpthread -ldl"
  ECH:              no      (--enable-ech)
  HTTPS RR:         no      (--enable-httpsrr)
  SSLS-EXPORT:      no      (--enable-ssls-export)
  Protocols:        dict file ftp ftps gopher gophers http https imap imaps ipfs ipns mqtt pop3 pop3s rtsp smb smbs smtp smtps telnet tftp ws wss
  Features:         alt-svc AsynchDNS brotli HSTS HTTPS-proxy IPv6 Largefile libz NTLM SSL threadsafe TLS-SRP UnixSockets zstd

compile-bench> cd /home/peter/curl-8.16.0 && make -j$(nproc)
make[1]: Entering directory '/home/peter/curl-8.16.0/scripts'
make[1]: Nothing to be done for 'all'.
make[1]: Leaving directory '/home/peter/curl-8.16.0/scripts'
make[1]: Entering directory '/home/peter/curl-8.16.0'
make[1]: Nothing to be done for 'all-am'.
make[1]: Leaving directory '/home/peter/curl-8.16.0'
compile-bench> cd /home/peter/curl-8.16.0 && make install
make[6]: Leaving directory '/home/peter/curl-8.16.0/docs/libcurl'
make[5]: Leaving directory '/home/peter/curl-8.16.0/docs/libcurl'
make[4]: Leaving directory '/home/peter/curl-8.16.0/docs/libcurl'
make[3]: Leaving directory '/home/peter/curl-8.16.0'
make[2]: Leaving directory '/home/peter/curl-8.16.0'
make[1]: Leaving directory '/home/peter/curl-8.16.0'
compile-bench> file /home/peter/result/bin/curl && ldd /home/peter/result/bin/curl 2>&1 | head -20
/home/peter/result/bin/curl: ELF 64-bit LSB pie executable, ARM aarch64, version 1 (SYSV), dynamically linked, interpreter /lib/ld-linux-aarch64.so.1, BuildID[sha1]=057231a7260c202b2ac601aa4e9419eec6c95cef, for GNU/Linux 3.7.0, not stripped
	not a dynamic executable
compile-bench> aarch64-linux-gnu-readelf -d /home/peter/result/bin/curl | grep NEEDED
 0x0000000000000001 (NEEDED)             Shared library: [libc.so.6]
 0x0000000000000001 (NEEDED)             Shared library: [ld-linux-aarch64.so.1]
compile-bench> cd /home/peter/curl-8.16.0/src && aarch64-linux-gnu-gcc -static -O3 -o /home/peter/result/bin/curl-static curl-*.o tool_*.o ../lib/.libs/libcurl.a /home/peter/deps/openssl-arm64/lib/libssl.a /home/peter/deps/openssl-arm64/lib/libcrypto.a /home/peter/deps/zstd-arm64/lib/libzstd.a /home/peter/deps/brotli-arm64/lib/libbrotlidec.a /home/peter/deps/brotli-arm64/lib/libbrotlicommon.a /home/peter/deps/zlib-arm64/lib/libz.a -lpthread -ldl
netrc.c:(.text+0x910): warning: Using 'getpwuid_r' in statically linked applications requires at runtime the shared libraries from the glibc version used for linking
/usr/lib/gcc-cross/aarch64-linux-gnu/11/../../../../aarch64-linux-gnu/bin/ld: ../lib/.libs/libcurl.a(libcurl_la-curl_addrinfo.o): in function `Curl_getaddrinfo_ex':
curl_addrinfo.c:(.text+0x74): warning: Using 'getaddrinfo' in statically linked applications requires at runtime the shared libraries from the glibc version used for linking
/usr/lib/gcc-cross/aarch64-linux-gnu/11/../../../../aarch64-linux-gnu/bin/ld: /home/peter/deps/openssl-arm64/lib/libcrypto.a(libcrypto-lib-bio_sock.o): in function `BIO_gethostbyname':
bio_sock.c:(.text+0x70): warning: Using 'gethostbyname' in statically linked applications requires at runtime the shared libraries from the glibc version used for linking
collect2: error: ld returned 1 exit status
compile-bench> cd /home/peter/curl-8.16.0/src && rm -f /home/peter/result/bin/curl && make LDFLAGS="-all-static" curl
make: 'curl' is up to date.
compile-bench> cd /home/peter/curl-8.16.0/src && rm -f curl && make V=1 curl 2>&1 | grep -A2 "CCLD.*curl"
[empty output]
compile-bench> cd /home/peter/curl-8.16.0/src && aarch64-linux-gnu-gcc -static -O3 -o /home/peter/result/bin/curl *.o ../lib/.libs/libcurl.a /home/peter/deps/openssl-arm64/lib/libssl.a /home/peter/deps/openssl-arm64/lib/libcrypto.a /home/peter/deps/zstd-arm64/lib/libzstd.a /home/peter/deps/brotli-arm64/lib/libbrotlidec.a /home/peter/deps/brotli-arm64/lib/libbrotlicommon.a /home/peter/deps/zlib-arm64/lib/libz.a -lpthread -ldl -lm
netrc.c:(.text+0x910): warning: Using 'getpwuid_r' in statically linked applications requires at runtime the shared libraries from the glibc version used for linking
/usr/lib/gcc-cross/aarch64-linux-gnu/11/../../../../aarch64-linux-gnu/bin/ld: ../lib/.libs/libcurl.a(libcurl_la-curl_addrinfo.o): in function `Curl_getaddrinfo_ex':
curl_addrinfo.c:(.text+0x74): warning: Using 'getaddrinfo' in statically linked applications requires at runtime the shared libraries from the glibc version used for linking
/usr/lib/gcc-cross/aarch64-linux-gnu/11/../../../../aarch64-linux-gnu/bin/ld: /home/peter/deps/openssl-arm64/lib/libcrypto.a(libcrypto-lib-bio_sock.o): in function `BIO_gethostbyname':
bio_sock.c:(.text+0x70): warning: Using 'gethostbyname' in statically linked applications requires at runtime the shared libraries from the glibc version used for linking
collect2: error: ld returned 1 exit status
compile-bench> cd /home/peter/curl-8.16.0/src && aarch64-linux-gnu-gcc -static -O3 -o /home/peter/result/bin/curl curl-*.o ../lib/.libs/libcurl.a /home/peter/deps/openssl-arm64/lib/libssl.a /home/peter/deps/openssl-arm64/lib/libcrypto.a /home/peter/deps/zstd-arm64/lib/libzstd.a /home/peter/deps/brotli-arm64/lib/libbrotlidec.a /home/peter/deps/brotli-arm64/lib/libbrotlicommon.a /home/peter/deps/zlib-arm64/lib/libz.a -lpthread -ldl -lm
/usr/lib/gcc-cross/aarch64-linux-gnu/11/../../../../aarch64-linux-gnu/bin/ld: ../lib/.libs/libcurl.a(libcurl_la-netrc.o): in function `Curl_parsenetrc':
netrc.c:(.text+0x910): warning: Using 'getpwuid_r' in statically linked applications requires at runtime the shared libraries from the glibc version used for linking
/usr/lib/gcc-cross/aarch64-linux-gnu/11/../../../../aarch64-linux-gnu/bin/ld: ../lib/.libs/libcurl.a(libcurl_la-curl_addrinfo.o): in function `Curl_getaddrinfo_ex':
curl_addrinfo.c:(.text+0x74): warning: Using 'getaddrinfo' in statically linked applications requires at runtime the shared libraries from the glibc version used for linking
/usr/lib/gcc-cross/aarch64-linux-gnu/11/../../../../aarch64-linux-gnu/bin/ld: /home/peter/deps/openssl-arm64/lib/libcrypto.a(libcrypto-lib-bio_sock.o): in function `BIO_gethostbyname':
bio_sock.c:(.text+0x70): warning: Using 'gethostbyname' in statically linked applications requires at runtime the shared libraries from the glibc version used for linking
compile-bench> file /home/peter/result/bin/curl && aarch64-linux-gnu-readelf -d /home/peter/result/bin/curl | grep NEEDED
/home/peter/result/bin/curl: ELF 64-bit LSB executable, ARM aarch64, version 1 (GNU/Linux), statically linked, BuildID[sha1]=fde84baa523204ec34efeece182aaaa052683ee3, for GNU/Linux 3.7.0, not stripped
compile-bench> rm -f /home/peter/result/curl && ln -s /home/peter/result/bin/curl /home/peter/result/curl && ls -la /home/peter/result/
drwxr-x--- 1 peter peter 4096 Sep 16 21:32 ..
drwxr-xr-x 2 peter peter 4096 Sep 16 21:35 bin
lrwxrwxrwx 1 peter peter   27 Sep 16 21:35 curl -> /home/peter/result/bin/curl
drwxr-xr-x 3 peter peter 4096 Sep 16 21:32 include
drwxr-xr-x 3 peter peter 4096 Sep 16 21:34 lib
drwxr-xr-x 4 peter peter 4096 Sep 16 21:32 share
compile-bench> echo "=== Binary Info ===" && file /home/peter/result/bin/curl && echo -e "\n=== File Size ===" && ls -lh /home/peter/result/bin/curl && echo -e "\n=== Symlink ===" && ls -l /home/peter/result/curl && echo -e "\n=== Static Linking Verification ===" && aarch64-linux-gnu-ldd /home/peter/result/bin/curl 2>&1 || echo "Correctly statically linked (no dynamic dependencies)"
=== Symlink ===
lrwxrwxrwx 1 peter peter 27 Sep 16 21:35 /home/peter/result/curl -> /home/peter/result/bin/curl

=== Static Linking Verification ===
bash: aarch64-linux-gnu-ldd: command not found
Correctly statically linked (no dynamic dependencies)
compile-bench> echo "=== Checking for SSL/TLS Support ===" && strings /home/peter/result/bin/curl | grep -i "TLSv1.3" | head -2 && echo -e "\n=== Checking for Brotli Support ===" && strings /home/peter/result/bin/curl | grep -i "brotli" | head -2 && echo -e "\n=== Checking for Zlib Support ===" && strings /home/peter/result/bin/curl | grep -i "zlib" | head -2 && echo -e "\n=== Checking for Zstd Support ===" && strings /home/peter/result/bin/curl | grep -i "zstd" | head -2 && echo -e "\n=== OpenSSL Version ===" && strings /home/peter/result/bin/curl | grep "OpenSSL/" | head -1

=== Checking for Zstd Support ===
zstd
zstd/%u.%u.%u

=== OpenSSL Version ===
Model ranking
# Model
1
claude-opus-4.1-thinking-16k logo claude-opus-4.1-thinking-16k
33%
36 (1.0x) 7m44s (1.0x) $3.051 (1.0x)
2
claude-sonnet-4 logo claude-sonnet-4
0%
3
claude-sonnet-4-thinking-16k logo claude-sonnet-4-thinking-16k
0%
4
claude-sonnet-4.5 logo claude-sonnet-4.5
0%
5
claude-sonnet-4.5-thinking-16k logo claude-sonnet-4.5-thinking-16k
0%
6
deepseek-v3.1 logo deepseek-v3.1
0%
7
deepseek-v3.1-terminus logo deepseek-v3.1-terminus
0%
8
gemini-2.5-flash logo gemini-2.5-flash
0%
9
gemini-2.5-flash-thinking logo gemini-2.5-flash-thinking
0%
10
gemini-2.5-pro logo gemini-2.5-pro
0%
11
glm-4.5 logo glm-4.5
0%
12
gpt-4.1 logo gpt-4.1
0%
13
gpt-4.1-mini logo gpt-4.1-mini
0%
14
gpt-5-codex-high logo gpt-5-codex-high
0%
15
gpt-5-high logo gpt-5-high
0%
16
gpt-5-mini-high logo gpt-5-mini-high
0%
17
gpt-5-mini-minimal logo gpt-5-mini-minimal
0%
18
gpt-5-minimal logo gpt-5-minimal
0%
19
gpt-oss-120b-high logo gpt-oss-120b-high
0%
20
grok-4 logo grok-4
0%
21
grok-4-fast logo grok-4-fast
0%
22
grok-code-fast-1 logo grok-code-fast-1
0%
23
kimi-k2-0905 logo kimi-k2-0905
0%
24
qwen3-max logo qwen3-max
0%
Attempts
Model Attempt ID Cost Duration Status / Error
claude-opus-4.1-thinking-16k logo claude-opus-4.1-thinking-16k
ksaa3cbngdmc5 $1.878 5m52s Failure task failed: curl HTTPS request to google.com did not return content-type: text/html but instead: } [2 bytes data] * SSL...
claude-opus-4.1-thinking-16k logo claude-opus-4.1-thinking-16k
rvax3whpzh0ve $3.086 7m56s Failure task failed: curl HTTPS request to google.com did not return content-type: text/html but instead: } [2 bytes data] * SSL...
claude-opus-4.1-thinking-16k logo claude-opus-4.1-thinking-16k
vqo04j3srxc9w $3.051 7m44s Success
claude-sonnet-4 logo claude-sonnet-4
fgwmemds56tep $1.001 7m17s Failure task failed: curl HTTPS request to google.com did not return content-type: text/html but instead: } [2 bytes data] * SSL...
claude-sonnet-4 logo claude-sonnet-4
je4urq5d5wh8f $1.255 8m7s Failure task failed: curl-arm64 is not statically linked
claude-sonnet-4 logo claude-sonnet-4
twyx5xasedcn3 $1.451 8m0s Failure task failed: curl-arm64 is not statically linked
claude-sonnet-4-thinking-16k logo claude-sonnet-4-thinking-16k
3ur3m0b72b57f $1.216 8m28s Failure task failed: curl HTTPS request to google.com did not return content-type: text/html but instead: } [2 bytes data] * SSL...
claude-sonnet-4-thinking-16k logo claude-sonnet-4-thinking-16k
aofjd3ed1ws53 $0.937 8m50s Failure task failed: curl HTTPS request to google.com did not return content-type: text/html but instead: } [2 bytes data] * SSL...
claude-sonnet-4-thinking-16k logo claude-sonnet-4-thinking-16k
sf7dhu3u6v9lo $1.074 8m8s Failure task failed: curl HTTPS request to google.com did not return content-type: text/html but instead: } [2 bytes data] * SSL...
claude-sonnet-4.5 logo claude-sonnet-4.5
g29ristdn9aa5 $0.651 4m43s Failure task failed: curl HTTPS request to google.com did not return content-type: text/html but instead: } [2 bytes data] * SSL...
claude-sonnet-4.5 logo claude-sonnet-4.5
qs6dluqfy8g08 $0.847 5m45s Failure task failed: curl HTTPS request to google.com did not return content-type: text/html but instead: } [2 bytes data] * SSL...
claude-sonnet-4.5 logo claude-sonnet-4.5
vm8e52ftyk0is $1.488 7m9s Failure task failed: curl HTTPS request to google.com did not return content-type: text/html but instead: } [2 bytes data] * SSL...
claude-sonnet-4.5-thinking-16k logo claude-sonnet-4.5-thinking-16k
9wwpjdtj60ash $1.410 9m1s Failure task failed: curl HTTPS request to google.com did not return content-type: text/html but instead: } [2 bytes data] * SSL...
claude-sonnet-4.5-thinking-16k logo claude-sonnet-4.5-thinking-16k
a53bk5ve49pov $1.184 7m56s Failure task failed: curl HTTPS request to google.com did not return content-type: text/html but instead: } [2 bytes data] * SSL...
claude-sonnet-4.5-thinking-16k logo claude-sonnet-4.5-thinking-16k
qpmxht13qu7im $1.014 8m19s Failure task failed: curl HTTPS request to google.com did not return content-type: text/html but instead: } [2 bytes data] * SSL...
deepseek-v3.1 logo deepseek-v3.1
5qxq8pqvu3083 $0.696 4m1s Failure task failed: curl-arm64 is not aarch64 architecture
deepseek-v3.1 logo deepseek-v3.1
oirue2hixi5k6 $0.179 1m55s Failure task failed: curl-arm64 is not statically linked
deepseek-v3.1 logo deepseek-v3.1
ovx9lwohe012s $0.729 4m1s Failure task failed: curl-arm64 is not aarch64 architecture
deepseek-v3.1-terminus logo deepseek-v3.1-terminus
wp50zo0mgashe $0.771 12m1s Failure task failed: curl-arm64 is not aarch64 architecture
deepseek-v3.1-terminus logo deepseek-v3.1-terminus
xl35p12yupv8d $0.351 6m39s Failure task failed: curl-arm64 is not aarch64 architecture
deepseek-v3.1-terminus logo deepseek-v3.1-terminus
ys9lgi93ui39c $0.298 5m35s Failure task failed: curl-arm64 is not aarch64 architecture
gemini-2.5-flash logo gemini-2.5-flash
7i72w0wyyd55a $0.003 15s Failure task failed: curl binary does not exist
gemini-2.5-flash logo gemini-2.5-flash
9aghv6jluw6qu $0.119 1m52s Failure task failed: curl binary does not exist
gemini-2.5-flash logo gemini-2.5-flash
gxqiqts623v70 $0.012 1m17s Failure task failed: curl-arm64 is not aarch64 architecture
gemini-2.5-flash-thinking logo gemini-2.5-flash-thinking
nkb5mdzsrc5vx $0.014 52s Failure task failed: curl binary does not exist
gemini-2.5-flash-thinking logo gemini-2.5-flash-thinking
w2srvvch00wqt $0.341 12m56s Failure task failed: curl binary does not exist
gemini-2.5-flash-thinking logo gemini-2.5-flash-thinking
wqy7tm1gg0fvf $0.204 7m30s Failure task failed: curl-arm64 is not statically linked
gemini-2.5-pro logo gemini-2.5-pro
mb9dxrlj518y3 $0.698 7m28s Failure task failed: curl binary does not exist
gemini-2.5-pro logo gemini-2.5-pro
ngq5n3da8rhb1 $0.332 4m53s Failure task failed: curl-arm64 is not statically linked
gemini-2.5-pro logo gemini-2.5-pro
vgiv49rfhm8ww $0.314 3m31s Failure task failed: curl-arm64 is not statically linked
glm-4.5 logo glm-4.5
0mu03pof1xy28 $0.328 4m19s Failure task failed: curl binary does not exist
glm-4.5 logo glm-4.5
ue0q0u9pxaujx $0.033 59s Failure task failed: curl binary does not exist
glm-4.5 logo glm-4.5
z82hs8f35s623 $0.038 1m7s Failure task failed: curl binary does not exist
gpt-4.1 logo gpt-4.1
3epted7u83lap $0.149 1m14s Failure task failed: curl binary does not exist
gpt-4.1 logo gpt-4.1
i6t0fmxnqc8ux $0.066 55s Failure task failed: curl binary does not exist
gpt-4.1 logo gpt-4.1
nlakvfwsmp3ay $0.074 59s Failure task failed: curl binary does not exist
gpt-4.1-mini logo gpt-4.1-mini
012ghbq53dtrb $0.052 1m54s Failure task failed: curl binary does not exist
gpt-4.1-mini logo gpt-4.1-mini
btrneoynqi8wh $0.100 2m4s Failure task failed: curl binary does not exist
gpt-4.1-mini logo gpt-4.1-mini
nkse2jbrzo0ax $0.031 1m14s Failure task failed: curl binary does not exist
gpt-5-codex-high logo gpt-5-codex-high
4x7j150599zoa $0.719 9m57s Failure task failed: curl HTTPS request to google.com did not return content-type: text/html but instead: } [2 bytes data] * SSL...
gpt-5-codex-high logo gpt-5-codex-high
l5u1cop2ljk6j $0.322 6m13s Failure task failed: curl HTTPS request to google.com did not return content-type: text/html but instead: } [2 bytes data] * SSL...
gpt-5-codex-high logo gpt-5-codex-high
prnksjucmv97u $0.368 6m21s Failure task failed: curl HTTPS request to google.com did not return content-type: text/html but instead: } [2 bytes data] * SSL...
gpt-5-high logo gpt-5-high
cfl9qebabpkgp $0.258 8m6s Failure task failed: curl HTTPS request to google.com did not return content-type: text/html but instead: } [2 bytes data] * SSL...
gpt-5-high logo gpt-5-high
p0xrg1i5dtff9 $0.291 7m15s Failure task failed: curl HTTPS request to google.com did not return content-type: text/html but instead: } [2 bytes data] * SSL...
gpt-5-high logo gpt-5-high
yxbb8asz6qicb $0.295 7m39s Failure task failed: curl HTTPS request to google.com did not return content-type: text/html but instead: } [2 bytes data] * SSL...
gpt-5-mini-high logo gpt-5-mini-high
30k51uvjkvcig $0.125 12m25s Failure task failed: curl HTTPS request to google.com did not return content-type: text/html but instead: } [2 bytes data] * SSL...
gpt-5-mini-high logo gpt-5-mini-high
8r76mtkzr4s92 $0.211 17m0s Failure task failed: curl HTTPS request to google.com did not return content-type: text/html but instead: } [2 bytes data] * SSL...
gpt-5-mini-high logo gpt-5-mini-high
dv8aw3au3ot5o $0.219 25m33s Failure task failed: curl-arm64 is not statically linked
gpt-5-mini-minimal logo gpt-5-mini-minimal
h1mzv58a7cun3 $0.009 1m21s Failure task failed: curl binary does not exist
gpt-5-mini-minimal logo gpt-5-mini-minimal
hg2qyij9lumid $0.014 1m16s Failure task failed: curl binary does not exist
gpt-5-mini-minimal logo gpt-5-mini-minimal
n7ucyb5c23f8f $0.015 2m0s Failure task failed: curl-arm64 is not aarch64 architecture
gpt-5-minimal logo gpt-5-minimal
51t7e5ewp8mis $0.146 4m53s Failure task failed: curl-arm64 is not statically linked
gpt-5-minimal logo gpt-5-minimal
e9jl27cdbh4il $0.110 3m53s Failure task failed: curl-arm64 is not statically linked
gpt-5-minimal logo gpt-5-minimal
w43wmw0e9c1z2 $0.078 3m0s Failure task failed: curl-arm64 binary does not exist
gpt-oss-120b-high logo gpt-oss-120b-high
2rb5lpujejbu1 $0.222 5m45s Failure task failed: curl-arm64 is not statically linked
gpt-oss-120b-high logo gpt-oss-120b-high
3vje4e032383w $0.121 4m26s Failure task failed: curl-arm64 is not statically linked
gpt-oss-120b-high logo gpt-oss-120b-high
qmpwe8g391ti5 $0.148 5m57s Failure task failed: curl-arm64 is not statically linked
grok-4 logo grok-4
23avhe5la4cpz $1.725 19m51s Failure task failed: curl-arm64 is not statically linked
grok-4 logo grok-4
am3bi8pw34usd $1.304 12m53s Failure task failed: curl HTTPS request to google.com did not return content-type: text/html but instead: } [2 bytes data] * SSL...
grok-4 logo grok-4
tqqqhissqfqyi $1.129 17m26s Failure task failed: curl-arm64 is not statically linked
grok-4-fast logo grok-4-fast
cj00e1w5tckf7 $0.057 7m20s Failure task failed: curl binary does not exist
grok-4-fast logo grok-4-fast
dbs65siai2f2i $0.131 12m12s Failure task failed: curl binary does not exist
grok-4-fast logo grok-4-fast
vdl3f4ln5r0q1 $0.065 10m14s Failure task failed: curl-arm64 is not statically linked
grok-code-fast-1 logo grok-code-fast-1
3mfnobblxoa2u $0.027 5m39s Failure task failed: curl-arm64 is not statically linked
grok-code-fast-1 logo grok-code-fast-1
dp8zxzq1bn1se $0.017 5m26s Failure task failed: curl-arm64 is not statically linked
grok-code-fast-1 logo grok-code-fast-1
y43c0llo401p0 $0.037 9m38s Failure task failed: curl-arm64 is not statically linked
kimi-k2-0905 logo kimi-k2-0905
ak37zbx7q3ru6 $0.008 16s Failure task failed: curl binary does not exist
kimi-k2-0905 logo kimi-k2-0905
mkdhsdizk8gy5 $0.001 2s Failure task failed: curl binary does not exist
kimi-k2-0905 logo kimi-k2-0905
nz7wv6lwd982j $0.622 2m53s Failure task failed: curl-arm64 is not aarch64 architecture
qwen3-max logo qwen3-max
3bcm9rc6kq8pm $5.432 10m17s Failure task failed: curl-arm64 is not statically linked
qwen3-max logo qwen3-max
jhv4vwdkjgkxc $0.446 2m1s Failure task failed: curl-arm64 is not aarch64 architecture
qwen3-max logo qwen3-max
lwuigs15i9pj0 $2.270 5m56s Failure task failed: curl-arm64 is not statically linked