Task
coreutils-old-version-alpine

GNU coreutils 5.0 (from 2003) is a collection of Linux utilities like ls, cp, mv, etc. Project link: gnu.org/software/coreutils

Task: Compile and install all coreutils utilities to a specific location.

Difficulties: The source is very old (2003) and requires heavy patching. On Alpine Linux (with musl) the code requires even more patching.

Environment: Alpine Linux 3.22.1 on amd64, without internet access.

Best attempt
Model claude-opus-4.1-thinking-16k logo claude-opus-4.1-thinking-16k
Attempt ymjhxjhwxqf4k
# of commands 54
Total time 7m54s
Cost $5.958
Terminal transcript >
compile-bench> cd /home/peter && tar -xzf coreutils.tar.gz && ls -la
total 5896
drwxr-sr-x    1 peter    peter         4096 Sep 16 21:59 .
drwxr-xr-x    1 root     root          4096 Sep 15 10:20 ..
drwxr-sr-x   11 peter    peter         4096 Sep 16 21:59 coreutils-5.0
-rw-r--r--    1 peter    peter      6020616 Sep 16 21:59 coreutils.tar.gz
compile-bench> cd /home/peter/coreutils-5.0 && ./configure --prefix=/home/peter/result
config.status: linking ./lib/fnmatch_.h to lib/fnmatch.h
config.status: linking ./lib/ftw_.h to lib/ftw.h
config.status: executing depfiles commands
config.status: executing default-1 commands
config.status: creating po/POTFILES
config.status: creating po/Makefile
compile-bench> cd /home/peter/coreutils-5.0 && make -j$(nproc)
make[3]: Leaving directory '/home/peter/coreutils-5.0/lib'
make[2]: *** [Makefile:414: all] Error 2
make[2]: Leaving directory '/home/peter/coreutils-5.0/lib'
make[1]: *** [Makefile:244: all-recursive] Error 1
make[1]: Leaving directory '/home/peter/coreutils-5.0'
make: *** [Makefile:199: all] Error 2
compile-bench> cd /home/peter/coreutils-5.0 && sed -i 's/#define ino_t unsigned long/#define ino_t unsigned long int/' config.h
[empty output]
compile-bench> cd /home/peter/coreutils-5.0 && grep -n "ino_t" config.h | head -5
1359:#define ino_t unsigned long int
compile-bench> cd /home/peter/coreutils-5.0 && sed -i 's/^#define ino_t unsigned long int/\/\/ #define ino_t unsigned long int/' config.h
[empty output]
compile-bench> cd /home/peter/coreutils-5.0 && make clean && make -j$(nproc)
make[3]: Leaving directory '/home/peter/coreutils-5.0/lib'
make[2]: *** [Makefile:414: all] Error 2
make[2]: Leaving directory '/home/peter/coreutils-5.0/lib'
make[1]: *** [Makefile:244: all-recursive] Error 1
make[1]: Leaving directory '/home/peter/coreutils-5.0'
make: *** [Makefile:199: all] Error 2
compile-bench> cd /home/peter/coreutils-5.0 && CFLAGS="-D_GNU_SOURCE -U_FORTIFY_SOURCE" ./configure --prefix=/home/peter/result
config.status: linking ./lib/fnmatch_.h to lib/fnmatch.h
config.status: linking ./lib/ftw_.h to lib/ftw.h
config.status: executing depfiles commands
config.status: executing default-1 commands
config.status: creating po/POTFILES
config.status: creating po/Makefile
compile-bench> cd /home/peter/coreutils-5.0 && sed -i 's/^#define ino_t unsigned long/\/\/ #define ino_t unsigned long/' config.h && make clean && make CFLAGS="-D_GNU_SOURCE -U_FORTIFY_SOURCE" -j$(nproc)
make[3]: Leaving directory '/home/peter/coreutils-5.0/lib'
make[2]: *** [Makefile:414: all] Error 2
make[2]: Leaving directory '/home/peter/coreutils-5.0/lib'
make[1]: *** [Makefile:244: all-recursive] Error 1
make[1]: Leaving directory '/home/peter/coreutils-5.0'
make: *** [Makefile:199: all] Error 2
compile-bench> cd /home/peter/coreutils-5.0/lib && sed -i '1i#include <string.h>' md5.c && sed -i '1i#include <stdlib.h>' modechange.c
[empty output]
compile-bench> cd /home/peter/coreutils-5.0 && make CFLAGS="-D_GNU_SOURCE -U_FORTIFY_SOURCE" -j$(nproc)
make[3]: Leaving directory '/home/peter/coreutils-5.0/lib'
make[2]: *** [Makefile:414: all] Error 2
make[2]: Leaving directory '/home/peter/coreutils-5.0/lib'
make[1]: *** [Makefile:244: all-recursive] Error 1
make[1]: Leaving directory '/home/peter/coreutils-5.0'
make: *** [Makefile:199: all] Error 2
compile-bench> cd /home/peter/coreutils-5.0/lib && sed -i '1i#include <stdlib.h>' readtokens.c && sed -i '/^char \*malloc ();/d' modechange.c
[empty output]
compile-bench> cd /home/peter/coreutils-5.0 && make CFLAGS="-D_GNU_SOURCE -U_FORTIFY_SOURCE" -j$(nproc)
make[3]: Leaving directory '/home/peter/coreutils-5.0/lib'
make[2]: *** [Makefile:414: all] Error 2
make[2]: Leaving directory '/home/peter/coreutils-5.0/lib'
make[1]: *** [Makefile:244: all-recursive] Error 1
make[1]: Leaving directory '/home/peter/coreutils-5.0'
make: *** [Makefile:199: all] Error 2
compile-bench> cd /home/peter/coreutils-5.0/lib && sed -i '1i#include <string.h>' savedir.c && sed -i '1i#include <stdlib.h>' save-cwd.c && sed -i '1i#include <string.h>' sha.c
[empty output]
compile-bench> cd /home/peter/coreutils-5.0 && make CFLAGS="-D_GNU_SOURCE -U_FORTIFY_SOURCE" -j$(nproc)
make[3]: Leaving directory '/home/peter/coreutils-5.0/lib'
make[2]: *** [Makefile:414: all] Error 2
make[2]: Leaving directory '/home/peter/coreutils-5.0/lib'
make[1]: *** [Makefile:244: all-recursive] Error 1
make[1]: Leaving directory '/home/peter/coreutils-5.0'
make: *** [Makefile:199: all] Error 2
compile-bench> cd /home/peter/coreutils-5.0/lib && sed -i '1i#include <stdlib.h>' savedir.c && sed -i '1i#include <stdlib.h>' userspec.c
[empty output]
compile-bench> cd /home/peter/coreutils-5.0 && make CFLAGS="-D_GNU_SOURCE -U_FORTIFY_SOURCE" -j$(nproc)
make[3]: Leaving directory '/home/peter/coreutils-5.0/lib'
make[2]: *** [Makefile:414: all] Error 2
make[2]: Leaving directory '/home/peter/coreutils-5.0/lib'
make[1]: *** [Makefile:244: all-recursive] Error 1
make[1]: Leaving directory '/home/peter/coreutils-5.0'
make: *** [Makefile:199: all] Error 2
compile-bench> cd /home/peter/coreutils-5.0/lib && sed -i '1i#include <stdlib.h>' xmalloc.c
[empty output]
compile-bench> cd /home/peter/coreutils-5.0 && make CFLAGS="-D_GNU_SOURCE -U_FORTIFY_SOURCE" -j$(nproc)
make[3]: Leaving directory '/home/peter/coreutils-5.0/lib'
make[2]: *** [Makefile:414: all] Error 2
make[2]: Leaving directory '/home/peter/coreutils-5.0/lib'
make[1]: *** [Makefile:244: all-recursive] Error 1
make[1]: Leaving directory '/home/peter/coreutils-5.0'
make: *** [Makefile:199: all] Error 2
compile-bench> cd /home/peter/coreutils-5.0/lib && sed -i '/# include <config.h>/a#include <stdlib.h>' xstrtol.c
[empty output]
compile-bench> cd /home/peter/coreutils-5.0 && make CFLAGS="-D_GNU_SOURCE -U_FORTIFY_SOURCE" -j$(nproc)
make[3]: Leaving directory '/home/peter/coreutils-5.0/lib'
make[2]: *** [Makefile:414: all] Error 2
make[2]: Leaving directory '/home/peter/coreutils-5.0/lib'
make[1]: *** [Makefile:244: all-recursive] Error 1
make[1]: Leaving directory '/home/peter/coreutils-5.0'
make: *** [Makefile:199: all] Error 2
compile-bench> cd /home/peter/coreutils-5.0/lib && sed -i '/#include <fnmatch.h>/a#include <stddef.h>' fnmatch.c
[empty output]
compile-bench> cd /home/peter/coreutils-5.0 && make CFLAGS="-D_GNU_SOURCE -U_FORTIFY_SOURCE" -j$(nproc)
make[3]: Leaving directory '/home/peter/coreutils-5.0/lib'
make[2]: *** [Makefile:414: all] Error 2
make[2]: Leaving directory '/home/peter/coreutils-5.0/lib'
make[1]: *** [Makefile:244: all-recursive] Error 1
make[1]: Leaving directory '/home/peter/coreutils-5.0'
make: *** [Makefile:199: all] Error 2
compile-bench> cd /home/peter/coreutils-5.0/lib && sed -i '1i#include <string.h>' error.c && sed -i '1i#include <stdlib.h>' getgroups.c && sed -i '/^char \*malloc ();/d' putenv.c
[empty output]
compile-bench> cd /home/peter/coreutils-5.0 && make CFLAGS="-D_GNU_SOURCE -U_FORTIFY_SOURCE" -j$(nproc)
make[3]: Leaving directory '/home/peter/coreutils-5.0/lib'
make[2]: *** [Makefile:414: all] Error 2
make[2]: Leaving directory '/home/peter/coreutils-5.0/lib'
make[1]: *** [Makefile:244: all-recursive] Error 1
make[1]: Leaving directory '/home/peter/coreutils-5.0'
make: *** [Makefile:199: all] Error 2
compile-bench> cd /home/peter/coreutils-5.0/lib && sed -i '1i#include <stdlib.h>' putenv.c && sed -i '1i#include <string.h>' tempname.c && sed -i '1i#include <string.h>\n#include <stdlib.h>' canonicalize.c && sed -i '/^char \*malloc ();/d' regex.c && sed -i '/^char \*realloc ();/d' regex.c && sed -i 's/__mempcpy/memcpy/g' regex.c
[empty output]
compile-bench> cd /home/peter/coreutils-5.0 && make CFLAGS="-D_GNU_SOURCE -U_FORTIFY_SOURCE" -j$(nproc)
make[3]: Leaving directory '/home/peter/coreutils-5.0/lib'
make[2]: *** [Makefile:414: all] Error 2
make[2]: Leaving directory '/home/peter/coreutils-5.0/lib'
make[1]: *** [Makefile:244: all-recursive] Error 1
make[1]: Leaving directory '/home/peter/coreutils-5.0'
make: *** [Makefile:199: all] Error 2
compile-bench> cd /home/peter/coreutils-5.0/lib && sed -i '1i#include <unistd.h>' getgroups.c && sed -i 's/^int$/ssize_t/' getline.c && sed -i 's/^getline /ssize_t\ngetline /' getline.c && sed -i 's/^getdelim /ssize_t\ngetdelim /' getline.c
[empty output]
compile-bench> cd /home/peter/coreutils-5.0/lib && sed -i 's/^int$/ssize_t/' getline.c && sed -i 's/^getline (/ssize_t getline (/' getline.c && sed -i 's/^getdelim (/ssize_t getdelim (/' getline.c
[empty output]
compile-bench> cd /home/peter/coreutils-5.0 && make CFLAGS="-D_GNU_SOURCE -U_FORTIFY_SOURCE" -j$(nproc)
make[3]: Leaving directory '/home/peter/coreutils-5.0/lib'
make[2]: *** [Makefile:414: all] Error 2
make[2]: Leaving directory '/home/peter/coreutils-5.0/lib'
make[1]: *** [Makefile:244: all-recursive] Error 1
make[1]: Leaving directory '/home/peter/coreutils-5.0'
make: *** [Makefile:199: all] Error 2
compile-bench> cd /home/peter/coreutils-5.0/lib && sed -i '1i#include <stdlib.h>' strtod.c && sed -i '/^ssize_t$/d' getline.c
[empty output]
compile-bench> cd /home/peter/coreutils-5.0 && make CFLAGS="-D_GNU_SOURCE -U_FORTIFY_SOURCE" -j$(nproc)
make[3]: Leaving directory '/home/peter/coreutils-5.0/src'
make[2]: *** [Makefile:815: all] Error 2
make[2]: Leaving directory '/home/peter/coreutils-5.0/src'
make[1]: *** [Makefile:244: all-recursive] Error 1
make[1]: Leaving directory '/home/peter/coreutils-5.0'
make: *** [Makefile:199: all] Error 2
compile-bench> cd /home/peter/coreutils-5.0/lib && sed -i 's/^int$/ssize_t/' getline.h && sed -i 's/^getline /ssize_t\ngetline /' getline.h && sed -i 's/^getdelim /ssize_t\ngetdelim /' getline.h
[empty output]
compile-bench> cd /home/peter/coreutils-5.0/lib && grep -n "getline\|getdelim" getline.h | head -10
33:getline PARAMS ((char **_lineptr, size_t *_n, FILE *_stream));
37:getdelim PARAMS ((char **_lineptr, size_t *_n, int _delimiter, FILE *_stream));
compile-bench> cd /home/peter/coreutils-5.0/lib && sed -i '32a ssize_t' getline.h && sed -i '36a ssize_t' getline.h
[empty output]
compile-bench> cd /home/peter/coreutils-5.0 && make CFLAGS="-D_GNU_SOURCE -U_FORTIFY_SOURCE" -j$(nproc)
make[3]: Leaving directory '/home/peter/coreutils-5.0/src'
make[2]: *** [Makefile:815: all] Error 2
make[2]: Leaving directory '/home/peter/coreutils-5.0/src'
make[1]: *** [Makefile:244: all-recursive] Error 1
make[1]: Leaving directory '/home/peter/coreutils-5.0'
make: *** [Makefile:199: all] Error 2
compile-bench> cd /home/peter/coreutils-5.0/lib && sed -i '/^ssize_t$/d' getline.h && sed -i 's/^getline /ssize_t getline /' getline.h && sed -i 's/^getdelim /ssize_t getdelim /' getline.h
[empty output]
compile-bench> cd /home/peter/coreutils-5.0 && make CFLAGS="-D_GNU_SOURCE -U_FORTIFY_SOURCE" -j$(nproc)
make[3]: Leaving directory '/home/peter/coreutils-5.0/src'
make[2]: *** [Makefile:815: all] Error 2
make[2]: Leaving directory '/home/peter/coreutils-5.0/src'
make[1]: *** [Makefile:244: all-recursive] Error 1
make[1]: Leaving directory '/home/peter/coreutils-5.0'
make: *** [Makefile:199: all] Error 2
compile-bench> cd /home/peter/coreutils-5.0 && sed -i 's/^#define RMDIR_ERRNO_NOT_EMPTY configure error in rmdir-errno.m4/#define RMDIR_ERRNO_NOT_EMPTY ENOTEMPTY/' config.h
[empty output]
compile-bench> cd /home/peter/coreutils-5.0 && make CFLAGS="-D_GNU_SOURCE -U_FORTIFY_SOURCE" -j$(nproc)
make[3]: Leaving directory '/home/peter/coreutils-5.0/src'
make[2]: *** [Makefile:815: all] Error 2
make[2]: Leaving directory '/home/peter/coreutils-5.0/src'
make[1]: *** [Makefile:244: all-recursive] Error 1
make[1]: Leaving directory '/home/peter/coreutils-5.0'
make: *** [Makefile:199: all] Error 2
compile-bench> cd /home/peter/coreutils-5.0/src && sed -i 's/static FILE dummy_closed;/static FILE *dummy_closed = (FILE *)-1;/' paste.c && sed -i 's/static FILE dummy_endlist;/static FILE *dummy_endlist = (FILE *)-2;/' paste.c && sed -i 's/\&dummy_closed/dummy_closed/g' paste.c && sed -i 's/\&dummy_endlist/dummy_endlist/g' paste.c
[empty output]
compile-bench> cd /home/peter/coreutils-5.0 && make CFLAGS="-D_GNU_SOURCE -U_FORTIFY_SOURCE" -j$(nproc)
make[3]: Leaving directory '/home/peter/coreutils-5.0/src'
make[2]: *** [Makefile:815: all] Error 2
make[2]: Leaving directory '/home/peter/coreutils-5.0/src'
make[1]: *** [Makefile:244: all-recursive] Error 1
make[1]: Leaving directory '/home/peter/coreutils-5.0'
make: *** [Makefile:199: all] Error 2
compile-bench> cd /home/peter/coreutils-5.0/src && sed -i 's/static int tee (/static int my_tee (/' tee.c && sed -i 's/tee (/my_tee (/' tee.c && sed -i 's/^static int$/int/' test.c
[empty output]
compile-bench> cd /home/peter/coreutils-5.0 && make CFLAGS="-D_GNU_SOURCE -U_FORTIFY_SOURCE" -j$(nproc)
make[3]: Leaving directory '/home/peter/coreutils-5.0/src'
make[2]: *** [Makefile:815: all] Error 2
make[2]: Leaving directory '/home/peter/coreutils-5.0/src'
make[1]: *** [Makefile:244: all-recursive] Error 1
make[1]: Leaving directory '/home/peter/coreutils-5.0'
make: *** [Makefile:199: all] Error 2
compile-bench> cd /home/peter/coreutils-5.0/src && sed -i 's/static int my_tee (/static int do_tee (/' tee.c && sed -i 's/my_tee (/do_tee (/' tee.c && sed -i 's/^do_tee (/static int do_tee (/' tee.c
[empty output]
compile-bench> cd /home/peter/coreutils-5.0 && make CFLAGS="-D_GNU_SOURCE -U_FORTIFY_SOURCE" -j$(nproc)
make[3]: Leaving directory '/home/peter/coreutils-5.0/src'
make[2]: *** [Makefile:815: all] Error 2
make[2]: Leaving directory '/home/peter/coreutils-5.0/src'
make[1]: *** [Makefile:244: all-recursive] Error 1
make[1]: Leaving directory '/home/peter/coreutils-5.0'
make: *** [Makefile:199: all] Error 2
compile-bench> cd /home/peter/coreutils-5.0/src && grep -n "do_tee" tee.c | head -5
35:static int my_do_tee (int nfiles, const char **files);
149:  errs = do_tee (argc - optind, (const char **) &argv[optind]);
161:static int do_tee (int nfiles, const char **files)
compile-bench> cd /home/peter/coreutils-5.0/src && sed -i 's/static int my_do_tee/static int do_tee/' tee.c && sed -i '161s/static int do_tee/do_tee/' tee.c
[empty output]
compile-bench> cd /home/peter/coreutils-5.0 && make CFLAGS="-D_GNU_SOURCE -U_FORTIFY_SOURCE" -j$(nproc)
make[3]: Leaving directory '/home/peter/coreutils-5.0/tests'
make[2]: Leaving directory '/home/peter/coreutils-5.0/tests'
make[2]: Entering directory '/home/peter/coreutils-5.0'
make[2]: Nothing to be done for 'all-am'.
make[2]: Leaving directory '/home/peter/coreutils-5.0'
make[1]: Leaving directory '/home/peter/coreutils-5.0'
compile-bench> cd /home/peter/coreutils-5.0 && make install
make[1]: Entering directory '/home/peter/coreutils-5.0'
make[2]: Entering directory '/home/peter/coreutils-5.0'
make[2]: Nothing to be done for 'install-exec-am'.
make[2]: Nothing to be done for 'install-data-am'.
make[2]: Leaving directory '/home/peter/coreutils-5.0'
make[1]: Leaving directory '/home/peter/coreutils-5.0'
compile-bench> cd /home/peter/result && for file in bin/*; do ln -s "$file" "$(basename "$file")"; done
[empty output]
compile-bench> ls -la /home/peter/result | head -20
lrwxrwxrwx    1 peter    peter            7 Sep 16 22:06 cut -> bin/cut
lrwxrwxrwx    1 peter    peter            8 Sep 16 22:06 date -> bin/date
lrwxrwxrwx    1 peter    peter            6 Sep 16 22:06 dd -> bin/dd
lrwxrwxrwx    1 peter    peter            6 Sep 16 22:06 df -> bin/df
lrwxrwxrwx    1 peter    peter            7 Sep 16 22:06 dir -> bin/dir
lrwxrwxrwx    1 peter    peter           13 Sep 16 22:06 dircolors -> bin/dircolors
compile-bench> ls -la /home/peter/result/uptime && /home/peter/result/uptime --version
uptime (GNU coreutils) 5.0
Written by Joseph Arceneaux, David MacKenzie, and Kaveh Ghazi.

Copyright (C) 2003 Free Software Foundation, Inc.
This is free software; see the source for copying conditions.  There is NO
warranty; not even for MERCHANTABILITY or FITNESS FOR A PARTICULAR PURPOSE.
compile-bench> ls /home/peter/result/*.* 2>/dev/null | wc -l && ls /home/peter/result | grep -v "^bin$" | grep -v "^lib$" | grep -v "^share$" | grep -v "^man$" | wc -l && echo "Sample utilities:" && ls -la /home/peter/result/{ls,cp,uptime,date,who} 2>/dev/null
Sample utilities:
lrwxrwxrwx    1 peter    peter            6 Sep 16 22:06 /home/peter/result/cp -> bin/cp
lrwxrwxrwx    1 peter    peter            8 Sep 16 22:06 /home/peter/result/date -> bin/date
lrwxrwxrwx    1 peter    peter            6 Sep 16 22:06 /home/peter/result/ls -> bin/ls
lrwxrwxrwx    1 peter    peter           10 Sep 16 22:06 /home/peter/result/uptime -> bin/uptime
lrwxrwxrwx    1 peter    peter            7 Sep 16 22:06 /home/peter/result/who -> bin/who
Model ranking
# Model
1
claude-sonnet-4-thinking-16k logo claude-sonnet-4-thinking-16k
100%
97 (1.8x) 8m37s (1.1x) $1.869 (3.2x)
2
claude-opus-4.1-thinking-16k logo claude-opus-4.1-thinking-16k
67%
54 (1.0x) 7m54s (1.0x) $5.958 (10.3x)
3
gpt-5-high logo gpt-5-high
67%
63 (1.2x) 11m52s (1.5x) $0.580 (1.0x)
4
gpt-5-codex-high logo gpt-5-codex-high
67%
126 (2.3x) 19m59s (2.5x) $1.364 (2.4x)
5
claude-sonnet-4 logo claude-sonnet-4
0%
6
claude-sonnet-4.5 logo claude-sonnet-4.5
0%
7
claude-sonnet-4.5-thinking-16k logo claude-sonnet-4.5-thinking-16k
0%
8
deepseek-v3.1 logo deepseek-v3.1
0%
9
deepseek-v3.1-terminus logo deepseek-v3.1-terminus
0%
10
gemini-2.5-flash logo gemini-2.5-flash
0%
11
gemini-2.5-flash-thinking logo gemini-2.5-flash-thinking
0%
12
gemini-2.5-pro logo gemini-2.5-pro
0%
13
glm-4.5 logo glm-4.5
0%
14
gpt-4.1 logo gpt-4.1
0%
15
gpt-4.1-mini logo gpt-4.1-mini
0%
16
gpt-5-mini-high logo gpt-5-mini-high
0%
17
gpt-5-mini-minimal logo gpt-5-mini-minimal
0%
18
gpt-5-minimal logo gpt-5-minimal
0%
19
gpt-oss-120b-high logo gpt-oss-120b-high
0%
20
grok-4 logo grok-4
0%
21
grok-4-fast logo grok-4-fast
0%
22
grok-code-fast-1 logo grok-code-fast-1
0%
23
kimi-k2-0905 logo kimi-k2-0905
0%
24
qwen3-max logo qwen3-max
0%
Attempts
Model Attempt ID Cost Duration Status / Error
claude-opus-4.1-thinking-16k logo claude-opus-4.1-thinking-16k
2edc703j4ndd0 $9.235 15m48s Failure task failed: install missing at /home/peter/result/install or not executable
claude-opus-4.1-thinking-16k logo claude-opus-4.1-thinking-16k
n1fb7u1kd1wel $9.828 14m37s Success
claude-opus-4.1-thinking-16k logo claude-opus-4.1-thinking-16k
ymjhxjhwxqf4k $5.958 7m54s Success
claude-sonnet-4 logo claude-sonnet-4
3rqntd230prug $1.811 6m59s Failure task failed: sha1sum binary does not exist
claude-sonnet-4 logo claude-sonnet-4
b7rxvrz6qhje6 $1.600 7m8s Failure task failed: df missing at /home/peter/result/df or not executable
claude-sonnet-4 logo claude-sonnet-4
klh44gpq8q2vz $1.478 22m2s Failure task failed: No success reported by script: all-utils-exists.sh
claude-sonnet-4-thinking-16k logo claude-sonnet-4-thinking-16k
2np714vmpuui1 $3.417 14m18s Success
claude-sonnet-4-thinking-16k logo claude-sonnet-4-thinking-16k
bs08n362cba73 $1.547 8m8s Success
claude-sonnet-4-thinking-16k logo claude-sonnet-4-thinking-16k
oo8mzagzoleya $1.869 8m37s Success
claude-sonnet-4.5 logo claude-sonnet-4.5
16lzvasib388n $1.352 5m20s Failure task failed: df missing at /home/peter/result/df or not executable
claude-sonnet-4.5 logo claude-sonnet-4.5
8v1o8aocq515l $2.115 8m31s Failure task failed: df missing at /home/peter/result/df or not executable
claude-sonnet-4.5 logo claude-sonnet-4.5
g04000s0wb4di $1.692 5m32s Failure task failed: df missing at /home/peter/result/df or not executable
claude-sonnet-4.5-thinking-16k logo claude-sonnet-4.5-thinking-16k
dpjz1qjardflm $1.539 7m40s Failure task failed: df missing at /home/peter/result/df or not executable
claude-sonnet-4.5-thinking-16k logo claude-sonnet-4.5-thinking-16k
rvt80a7fv2kc9 $1.548 9m25s Failure task failed: df missing at /home/peter/result/df or not executable
claude-sonnet-4.5-thinking-16k logo claude-sonnet-4.5-thinking-16k
xe5158hs7os7t $1.735 9m41s Failure task failed: df missing at /home/peter/result/df or not executable
deepseek-v3.1 logo deepseek-v3.1
caio4ys8xz5vn $5.336 10m52s Failure exceeded max tool calls (200)
deepseek-v3.1 logo deepseek-v3.1
npw0nr2wfh7b9 $4.218 8m38s Failure task failed: sha1sum binary does not exist
deepseek-v3.1 logo deepseek-v3.1
s4v44ndrejnr5 $1.386 4m47s Failure task failed: sha1sum binary does not exist
deepseek-v3.1-terminus logo deepseek-v3.1-terminus
8ku90eb5ntv3k $1.151 15m26s Failure task failed: sha1sum binary does not exist
deepseek-v3.1-terminus logo deepseek-v3.1-terminus
fef6r1p37bi74 $0.488 23m20s Failure task failed: No success reported by script: all-utils-exists.sh
deepseek-v3.1-terminus logo deepseek-v3.1-terminus
qaj1rduklob6h $0.288 6m29s Failure task failed: sha1sum binary does not exist
gemini-2.5-flash logo gemini-2.5-flash
6aqhoaxklcwsp $0.151 4m11s Failure task failed: sha1sum binary does not exist
gemini-2.5-flash logo gemini-2.5-flash
icppoonmwph4h $0.109 3m30s Failure task failed: sha1sum binary does not exist
gemini-2.5-flash logo gemini-2.5-flash
t1dwq7bannu76 $0.030 1m42s Failure task failed: sha1sum binary does not exist
gemini-2.5-flash-thinking logo gemini-2.5-flash-thinking
38us456gg97t1 $0.165 3m9s Failure task failed: sha1sum binary does not exist
gemini-2.5-flash-thinking logo gemini-2.5-flash-thinking
3kvv58u1s2o7s $0.077 2m27s Failure task failed: sha1sum binary does not exist
gemini-2.5-flash-thinking logo gemini-2.5-flash-thinking
gnjbi1l73fyfg $1.484 22m43s Failure task failed: sha1sum binary does not exist
gemini-2.5-pro logo gemini-2.5-pro
73yuzozgu39e8 $1.376 7m10s Failure task failed: sha1sum binary does not exist
gemini-2.5-pro logo gemini-2.5-pro
axxfa9gtps3e8 $2.703 8m15s Failure task failed: sha1sum binary does not exist
gemini-2.5-pro logo gemini-2.5-pro
nbgpyvzf5sn1j $0.186 1m42s Failure task failed: sha1sum binary does not exist
glm-4.5 logo glm-4.5
1sv17yuewn3rz $0.018 39s Failure task failed: sha1sum binary does not exist
glm-4.5 logo glm-4.5
3semgfu1bjn95 $0.075 1m31s Failure task failed: sha1sum binary does not exist
glm-4.5 logo glm-4.5
ao3pftvf0rjdx $0.316 3m9s Failure task failed: sha1sum binary does not exist
gpt-4.1 logo gpt-4.1
avu5b7qwr9i8b $2.821 4m46s Failure task failed: sha1sum binary does not exist
gpt-4.1 logo gpt-4.1
bh4rfhg0kgnrd $1.576 3m16s Failure task failed: df missing at /home/peter/result/df or not executable
gpt-4.1 logo gpt-4.1
onifl1ovzzryu $0.659 2m23s Failure task failed: sha1sum binary does not exist
gpt-4.1-mini logo gpt-4.1-mini
0jd0ssv7t8ej8 $1.626 10m18s Failure exceeded max tool calls (200)
gpt-4.1-mini logo gpt-4.1-mini
0uyfhajvzi84t $0.570 5m41s Failure task failed: sha1sum binary does not exist
gpt-4.1-mini logo gpt-4.1-mini
deuztodwd8fyw $0.015 33s Failure task failed: sha1sum binary does not exist
gpt-5-codex-high logo gpt-5-codex-high
1ltffu0yi165k $0.617 6m36s Failure task failed: stty missing at /home/peter/result/stty or not executable
gpt-5-codex-high logo gpt-5-codex-high
oznvks484jtmc $1.370 34m1s Success
gpt-5-codex-high logo gpt-5-codex-high
rui2vahcqalrp $1.364 19m59s Success
gpt-5-high logo gpt-5-high
8xsbws4w35j07 $0.580 11m52s Success
gpt-5-high logo gpt-5-high
hn5805nt2m0qz $0.438 25m11s Failure task failed: df missing at /home/peter/result/df or not executable
gpt-5-high logo gpt-5-high
xmgu0wx9ubylz $0.693 13m7s Success
gpt-5-mini-high logo gpt-5-mini-high
0fmtwlk101w1z $0.133 12m51s Failure task failed: sha1sum binary does not exist
gpt-5-mini-high logo gpt-5-mini-high
uc7s97sptn2m1 $0.259 32m11s Failure task failed: No success reported by script: all-utils-exists.sh
gpt-5-mini-high logo gpt-5-mini-high
yty1ryhg5g01r $0.170 11m57s Failure task failed: df missing at /home/peter/result/df or not executable
gpt-5-mini-minimal logo gpt-5-mini-minimal
ahn7gmt14ic2c $0.012 1m7s Failure task failed: sha1sum binary does not exist
gpt-5-mini-minimal logo gpt-5-mini-minimal
mf5roenxa2b7c $0.025 2m24s Failure task failed: sha1sum binary does not exist
gpt-5-mini-minimal logo gpt-5-mini-minimal
tfelny2ccy8dm $0.008 1m7s Failure task failed: sha1sum binary does not exist
gpt-5-minimal logo gpt-5-minimal
3djpvqzmime4t $0.192 3m31s Failure task failed: sha1sum binary does not exist
gpt-5-minimal logo gpt-5-minimal
gy2h758v208x3 $0.066 1m34s Failure task failed: sha1sum binary does not exist
gpt-5-minimal logo gpt-5-minimal
x1o5f313ymcer $0.211 3m6s Failure task failed: df missing at /home/peter/result/df or not executable
gpt-oss-120b-high logo gpt-oss-120b-high
9pykuf8y8q5v5 $0.050 1m54s Failure task failed: sha1sum binary does not exist
gpt-oss-120b-high logo gpt-oss-120b-high
vowqrb6e2rr63 $0.102 2m57s Failure task failed: sha1sum binary does not exist
gpt-oss-120b-high logo gpt-oss-120b-high
x5jnvkimf2mcc $0.041 1m10s Failure task failed: sha1sum binary does not exist
grok-4 logo grok-4
0v7qjmu94o0w5 $1.836 23m29s Failure task failed: df missing at /home/peter/result/df or not executable
grok-4 logo grok-4
ffj48x6sy4918 $7.081 24m5s Failure task failed: sha1sum binary does not exist
grok-4 logo grok-4
ob89w3v71ur3b $3.753 17m24s Failure task failed: df missing at /home/peter/result/df or not executable
grok-4-fast logo grok-4-fast
42h1kwxv4ki70 $0.178 7m34s Failure task failed: sha1sum binary does not exist
grok-4-fast logo grok-4-fast
bgucgcarjkd5x $0.339 12m28s Failure task failed: install missing at /home/peter/result/install or not executable
grok-4-fast logo grok-4-fast
voxhzz08py9n4 $0.201 8m31s Failure task failed: sha1sum binary does not exist
grok-code-fast-1 logo grok-code-fast-1
9bqaabitdxvk6 $0.008 1m5s Failure task failed: sha1sum binary does not exist
grok-code-fast-1 logo grok-code-fast-1
ntv1i1pe675zq $0.021 1m15s Failure task failed: sha1sum binary does not exist
grok-code-fast-1 logo grok-code-fast-1
yr85a0fcqw0zd $0.051 3m29s Failure task failed: sha1sum binary does not exist
kimi-k2-0905 logo kimi-k2-0905
3aumgfpqz1ake $2.071 4m9s Failure task failed: sha1sum binary does not exist
kimi-k2-0905 logo kimi-k2-0905
3veg94fzgpt4f $3.198 19m44s Failure task failed: No success reported by script: all-utils-exists.sh
kimi-k2-0905 logo kimi-k2-0905
5ymhny37lt8aj $2.255 4m20s Failure task failed: sha1sum binary does not exist
qwen3-max logo qwen3-max
01l5qvl2yzo0e $3.256 5m16s Failure task failed: df missing at /home/peter/result/df or not executable
qwen3-max logo qwen3-max
3302vghtf15lc $10.254 6m43s Failure exceeded max cost dollars (max=$10.00, current=10.25)
qwen3-max logo qwen3-max
lbgmhbvyp77mc $10.354 7m36s Failure exceeded max cost dollars (max=$10.00, current=10.35)