| Cost | $1.494 |
| Total elapsed time | 5m23s |
| LLM inference time | 4m0s |
| Command execution time | 1m24s |
| Commands executed | 28 |
All details >
| Attempt ID | y4igco0imbqau | Attempt group | run-16-09-22-05 |
| Revision | fb5c74bd2fee | AWS Instance | m8i.2xlarge |
| Start time | 2025-09-16T21:43:43.480Z | End time | 2025-09-16T21:49:07.208Z |
| Task | coreutils-old-version | Environment | ubuntu-22.04-amd64-offline |
| Model | | OpenRouter slug | anthropic/claude-opus-4.1 |
| Temperature | 1 | Explicit prompt caching | true |
| User msg after tool call | true | Max tool calls | 90 |
| Total timeout seconds | 1200 | Single command timeout | 600 |
| Cost | $1.494 | Duration | 5m23s |
| LLM inference time | 4m0s | Command execution time | 1m24s |
| Final context tokens | 23,402 | Total output tokens | 6,248 |
| Output reasoning tokens | 2,600 | Messages | 59 |
| Assistant messages | 29 | User messages | 1 |
| System messages | 1 | Commands executed | 28 |
GNU coreutils 5.0 (from 2003) is a collection of Linux utilities like ls, cp, mv, etc.
Project link: gnu.org/software/coreutils
Task:
Compile and install all coreutils utilities to a specific location.
Difficulties:
The source is very old (2003) and requires heavy patching.
Environment:
Ubuntu 22.04 on amd64, without internet access.
You are a package-building specialist operating a Ubuntu 22.04 bash shell via one tool: run_terminal_cmd.
The current working directory of every run_terminal_cmd is /home/peter.
Execution rules:
- Always pass non-interactive flags for any command that could prompt (e.g., -y, --yes, DEBIAN_FRONTEND=noninteractive).
- Don't include any newlines in the command.
- The environment is offline, assume you have all the necessary tools already installed.
If you encounter any errors or issues while doing the user's request, you must fix them and continue the task.
At the end verify you did the user request correctly.
You are given a coreutils v5.0 source code at /home/peter/coreutils.tar.gz. Please compile the coreutils package and install it to /home/peter/result. Create symlinks for all coreutils utilities so they are available under /home/peter/result/
Show reasoning
The user wants me to:
1. Extract the coreutils v5.0 source code from /home/peter/coreutils.tar.gz
2. Compile the coreutils package
3. Install it to /home/peter/result
4. Create symlinks for all utilities so they're available directly under /home/peter/result/
Let me break this down into steps:
1. Extract the tar.gz file
2. Configure the build with prefix=/home/peter/result
3. Compile (make)
4. Install (make install)
5. Create symlinks for all utilities in /home/peter/result
The coreutils utilities are typically installed in bin/ subdirectory, so after installation they would be at /home/peter/result/bin/. I need to create symlinks from /home/peter/result/
I'll help you compile and install coreutils v5.0 from the source tarball, then create the necessary symlinks. Let me break this down into steps:
1. First, let's extract the source code
2. Configure and compile coreutils
3. Install to /home/peter/result
4. Create symlinks for all utilities
Let's start:
[empty output]
Show reasoning
The user wants me to continue with the task. The tar extraction was successful (no error). Let me continue with the next steps.
compile-bench> ls -la | grep coreutils drwxr-xr-x 11 peter peter 4096 Apr 2 2003 coreutils-5.0
-rw-r--r-- 1 peter peter 6020616 Sep 16 21:43 coreutils.tar.gz
↓ 3 lines
drwxr-xr-x 11 peter peter 4096 Apr 2 2003 coreutils-5.0 -rw-r--r-- 1 peter peter 6020616 Sep 16 21:43 coreutils.tar.gz
Show reasoning
Good, the source code has been extracted. Now I need to:
1. Enter the coreutils-5.0 directory
2. Configure it with the prefix /home/peter/result
3. Compile it
4. Install it
5. Create symlinks for all utilities
Let me proceed with the configuration and compilation.
compile-bench> cd coreutils-5.0 && ./configure --prefix=/home/peter/result checking build system type... x86_64-unknown-linux-gnu
checking host system type... x86_64-unknown-linux-gnu
checking for a BSD-compatible install... /usr/bin/install -c
checking whether build environment is sane... yes
checking for gawk... no
checking for mawk... mawk
checking whether make sets $(MAKE)... yes
checking for perl5.003 or newer... yes
checking for gcc... gcc
checking for C compiler default output... a.out
checking whether the C compiler works... yes
checking whether we are cross compiling... no
checking for suffix of executables...
checking for suffix of object files... o
checking whether we are using the GNU C compiler... yes
checking whether gcc accepts -g... yes
checking for gcc option to accept ANSI C... none needed
checking for style of include used by make... GNU
checking dependency style of gcc... gcc3
checking how to run the C preprocessor... gcc -E
checking for egrep... grep -E
checking whether gcc needs -traditional... no
checking for ranlib... ranlib
checking whether ln -s works... yes
checking for AIX... no
checking for ANSI C header files... yes
checking for sys/types.h... yes
checking for sys/stat.h... yes
checking for stdlib.h... yes
checking for string.h... yes
checking for memory.h... yes
checking for strings.h... yes
checking for inttypes.h... yes
checking for stdint.h... yes
checking for unistd.h... yes
checking minix/config.h usability... no
checking minix/config.h presence... no
checking for minix/config.h... no
checking for uname... yes
checking for chroot... yes
checking for gethostid... yes
checking for strerror in -lcposix... no
checking for special C compiler options needed for large files... no
checking for _FILE_OFFSET_BITS value needed for large files... no
checking for _LARGE_FILES value needed for large files... no
checking for gcc option to accept ANSI C... none needed
checking for function prototypes... yes
checking for ANSI C header files... (cached) yes
checking for string.h... (cached) yes
checking whether byte ordering is bigendian... no
checking for an ANSI C-conforming const... yes
checking for working volatile... yes
checking for inline... inline
checking for working long double with more range or precision than double... no
checking errno.h usability... yes
checking errno.h presence... yes
checking for errno.h... yes
checking fcntl.h usability... yes
checking fcntl.h presence... yes
checking for fcntl.h... yes
checking float.h usability... yes
checking float.h presence... yes
checking for float.h... yes
checking hurd.h usability... no
checking hurd.h presence... no
checking for hurd.h... no
checking limits.h usability... yes
checking limits.h presence... yes
checking for limits.h... yes
checking for memory.h... (cached) yes
[command output truncated]
checking shadow.h presence... yes
checking for shadow.h... yes
checking for struct spwd.sp_pwdp... yes
checking for getspnam... yes
checking for library containing crypt... -lcrypt
checking for msgfmt... no
checking for gmsgfmt... :
checking for xgettext... no
checking for msgmerge... no
checking whether NLS is requested... yes
checking for GNU gettext in libc... yes
configure: creating ./config.status
config.status: creating Makefile
config.status: creating doc/Makefile
config.status: creating lib/Makefile
config.status: creating man/Makefile
config.status: creating m4/Makefile
config.status: creating po/Makefile.in
config.status: creating src/Makefile
config.status: creating tests/Makefile
config.status: creating tests/basename/Makefile
config.status: creating tests/chgrp/Makefile
config.status: creating tests/chmod/Makefile
config.status: creating tests/chown/Makefile
config.status: creating tests/cp/Makefile
config.status: creating tests/cut/Makefile
config.status: creating tests/date/Makefile
config.status: creating tests/dd/Makefile
config.status: creating tests/dircolors/Makefile
config.status: creating tests/du/Makefile
config.status: creating tests/expr/Makefile
config.status: creating tests/factor/Makefile
config.status: creating tests/fmt/Makefile
config.status: creating tests/head/Makefile
config.status: creating tests/install/Makefile
config.status: creating tests/join/Makefile
config.status: creating tests/ln/Makefile
config.status: creating tests/ls-2/Makefile
config.status: creating tests/ls/Makefile
config.status: creating tests/md5sum/Makefile
config.status: creating tests/misc/Makefile
config.status: creating tests/mkdir/Makefile
config.status: creating tests/mv/Makefile
config.status: creating tests/od/Makefile
config.status: creating tests/pr/Makefile
config.status: creating tests/rm/Makefile
config.status: creating tests/rmdir/Makefile
config.status: creating tests/seq/Makefile
config.status: creating tests/sha1sum/Makefile
config.status: creating tests/shred/Makefile
config.status: creating tests/sort/Makefile
config.status: creating tests/stty/Makefile
config.status: creating tests/sum/Makefile
config.status: creating tests/tac/Makefile
config.status: creating tests/tail-2/Makefile
config.status: creating tests/tail/Makefile
config.status: creating tests/test/Makefile
config.status: creating tests/touch/Makefile
config.status: creating tests/tr/Makefile
config.status: creating tests/tsort/Makefile
config.status: creating tests/unexpand/Makefile
config.status: creating tests/uniq/Makefile
config.status: creating tests/wc/Makefile
config.status: creating config.h
config.status: linking ./lib/ftw_.h to lib/ftw.h
config.status: executing depfiles commands
config.status: executing default-1 commands
config.status: creating po/POTFILES
config.status: creating po/Makefile
↓ 141 lines
checking build system type... x86_64-unknown-linux-gnu checking host system type... x86_64-unknown-linux-gnu checking for a BSD-compatible install... /usr/bin/install -c checking whether build environment is sane... yes checking for gawk... no checking for mawk... mawk checking whether make sets $(MAKE)... yes checking for perl5.003 or newer... yes checking for gcc... gcc checking for C compiler default output... a.out checking whether the C compiler works... yes checking whether we are cross compiling... no checking for suffix of executables... checking for suffix of object files... o checking whether we are using the GNU C compiler... yes checking whether gcc accepts -g... yes checking for gcc option to accept ANSI C... none needed checking for style of include used by make... GNU checking dependency style of gcc... gcc3 checking how to run the C preprocessor... gcc -E checking for egrep... grep -E checking whether gcc needs -traditional... no checking for ranlib... ranlib checking whether ln -s works... yes checking for AIX... no checking for ANSI C header files... yes checking for sys/types.h... yes checking for sys/stat.h... yes checking for stdlib.h... yes checking for string.h... yes checking for memory.h... yes checking for strings.h... yes checking for inttypes.h... yes checking for stdint.h... yes checking for unistd.h... yes checking minix/config.h usability... no checking minix/config.h presence... no checking for minix/config.h... no checking for uname... yes checking for chroot... yes checking for gethostid... yes checking for strerror in -lcposix... no checking for special C compiler options needed for large files... no checking for _FILE_OFFSET_BITS value needed for large files... no checking for _LARGE_FILES value needed for large files... no checking for gcc option to accept ANSI C... none needed checking for function prototypes... yes checking for ANSI C header files... (cached) yes checking for string.h... (cached) yes checking whether byte ordering is bigendian... no checking for an ANSI C-conforming const... yes checking for working volatile... yes checking for inline... inline checking for working long double with more range or precision than double... no checking errno.h usability... yes checking errno.h presence... yes checking for errno.h... yes checking fcntl.h usability... yes checking fcntl.h presence... yes checking for fcntl.h... yes checking float.h usability... yes checking float.h presence... yes checking for float.h... yes checking hurd.h usability... no checking hurd.h presence... no checking for hurd.h... no checking limits.h usability... yes checking limits.h presence... yes checking for limits.h... yes checking for memory.h... (cached) yes [command output truncated] checking shadow.h presence... yes checking for shadow.h... yes checking for struct spwd.sp_pwdp... yes checking for getspnam... yes checking for library containing crypt... -lcrypt checking for msgfmt... no checking for gmsgfmt... : checking for xgettext... no checking for msgmerge... no checking whether NLS is requested... yes checking for GNU gettext in libc... yes configure: creating ./config.status config.status: creating Makefile config.status: creating doc/Makefile config.status: creating lib/Makefile config.status: creating man/Makefile config.status: creating m4/Makefile config.status: creating po/Makefile.in config.status: creating src/Makefile config.status: creating tests/Makefile config.status: creating tests/basename/Makefile config.status: creating tests/chgrp/Makefile config.status: creating tests/chmod/Makefile config.status: creating tests/chown/Makefile config.status: creating tests/cp/Makefile config.status: creating tests/cut/Makefile config.status: creating tests/date/Makefile config.status: creating tests/dd/Makefile config.status: creating tests/dircolors/Makefile config.status: creating tests/du/Makefile config.status: creating tests/expr/Makefile config.status: creating tests/factor/Makefile config.status: creating tests/fmt/Makefile config.status: creating tests/head/Makefile config.status: creating tests/install/Makefile config.status: creating tests/join/Makefile config.status: creating tests/ln/Makefile config.status: creating tests/ls-2/Makefile config.status: creating tests/ls/Makefile config.status: creating tests/md5sum/Makefile config.status: creating tests/misc/Makefile config.status: creating tests/mkdir/Makefile config.status: creating tests/mv/Makefile config.status: creating tests/od/Makefile config.status: creating tests/pr/Makefile config.status: creating tests/rm/Makefile config.status: creating tests/rmdir/Makefile config.status: creating tests/seq/Makefile config.status: creating tests/sha1sum/Makefile config.status: creating tests/shred/Makefile config.status: creating tests/sort/Makefile config.status: creating tests/stty/Makefile config.status: creating tests/sum/Makefile config.status: creating tests/tac/Makefile config.status: creating tests/tail-2/Makefile config.status: creating tests/tail/Makefile config.status: creating tests/test/Makefile config.status: creating tests/touch/Makefile config.status: creating tests/tr/Makefile config.status: creating tests/tsort/Makefile config.status: creating tests/unexpand/Makefile config.status: creating tests/uniq/Makefile config.status: creating tests/wc/Makefile config.status: creating config.h config.status: linking ./lib/ftw_.h to lib/ftw.h config.status: executing depfiles commands config.status: executing default-1 commands config.status: creating po/POTFILES config.status: creating po/Makefile
Show reasoning
Good, configure completed successfully. Now let's compile the code with make.
compile-bench> cd coreutils-5.0 && make -j$(nproc) make all-recursive
make[1]: Entering directory '/home/peter/coreutils-5.0'
Making all in lib
make[2]: Entering directory '/home/peter/coreutils-5.0/lib'
make all-am
make[3]: Entering directory '/home/peter/coreutils-5.0/lib'
if gcc -DLIBDIR=\"/home/peter/result/lib\" -DHAVE_CONFIG_H -I. -I. -I.. -I.. -I. -g -O2 -MT acl.o -MD -MP -MF ".deps/acl.Tpo" \
-c -o acl.o `test -f 'acl.c' || echo './'`acl.c; \
then mv ".deps/acl.Tpo" ".deps/acl.Po"; \
else rm -f ".deps/acl.Tpo"; exit 1; \
fi
if gcc -DLIBDIR=\"/home/peter/result/lib\" -DHAVE_CONFIG_H -I. -I. -I.. -I.. -I. -g -O2 -MT getdate.o -MD -MP -MF ".deps/getdate.Tpo" \
-c -o getdate.o `test -f 'getdate.c' || echo './'`getdate.c; \
then mv ".deps/getdate.Tpo" ".deps/getdate.Po"; \
else rm -f ".deps/getdate.Tpo"; exit 1; \
fi
if gcc -DLIBDIR=\"/home/peter/result/lib\" -DHAVE_CONFIG_H -I. -I. -I.. -I.. -I. -g -O2 -MT posixtm.o -MD -MP -MF ".deps/posixtm.Tpo" \
-c -o posixtm.o `test -f 'posixtm.c' || echo './'`posixtm.c; \
then mv ".deps/posixtm.Tpo" ".deps/posixtm.Po"; \
else rm -f ".deps/posixtm.Tpo"; exit 1; \
fi
if gcc -DLIBDIR=\"/home/peter/result/lib\" -DHAVE_CONFIG_H -I. -I. -I.. -I.. -I. -g -O2 -MT posixver.o -MD -MP -MF ".deps/posixver.Tpo" \
-c -o posixver.o `test -f 'posixver.c' || echo './'`posixver.c; \
then mv ".deps/posixver.Tpo" ".deps/posixver.Po"; \
else rm -f ".deps/posixver.Tpo"; exit 1; \
fi
if gcc -DLIBDIR=\"/home/peter/result/lib\" -DHAVE_CONFIG_H -I. -I. -I.. -I.. -I. -g -O2 -MT strftime.o -MD -MP -MF ".deps/strftime.Tpo" \
-c -o strftime.o `test -f 'strftime.c' || echo './'`strftime.c; \
then mv ".deps/strftime.Tpo" ".deps/strftime.Po"; \
else rm -f ".deps/strftime.Tpo"; exit 1; \
fi
if gcc -DLIBDIR=\"/home/peter/result/lib\" -DHAVE_CONFIG_H -I. -I. -I.. -I.. -I. -g -O2 -MT getopt.o -MD -MP -MF ".deps/getopt.Tpo" \
-c -o getopt.o `test -f 'getopt.c' || echo './'`getopt.c; \
then mv ".deps/getopt.Tpo" ".deps/getopt.Po"; \
else rm -f ".deps/getopt.Tpo"; exit 1; \
fi
if gcc -DLIBDIR=\"/home/peter/result/lib\" -DHAVE_CONFIG_H -I. -I. -I.. -I.. -I. -g -O2 -MT getopt1.o -MD -MP -MF ".deps/getopt1.Tpo" \
-c -o getopt1.o `test -f 'getopt1.c' || echo './'`getopt1.c; \
then mv ".deps/getopt1.Tpo" ".deps/getopt1.Po"; \
else rm -f ".deps/getopt1.Tpo"; exit 1; \
fi
if gcc -DLIBDIR=\"/home/peter/result/lib\" -DHAVE_CONFIG_H -I. -I. -I.. -I.. -I. -g -O2 -MT hash.o -MD -MP -MF ".deps/hash.Tpo" \
-c -o hash.o `test -f 'hash.c' || echo './'`hash.c; \
then mv ".deps/hash.Tpo" ".deps/hash.Po"; \
else rm -f ".deps/hash.Tpo"; exit 1; \
fi
if gcc -DLIBDIR=\"/home/peter/result/lib\" -DHAVE_CONFIG_H -I. -I. -I.. -I.. -I. -g -O2 -MT hash-pjw.o -MD -MP -MF ".deps/hash-pjw.Tpo" \
-c -o hash-pjw.o `test -f 'hash-pjw.c' || echo './'`hash-pjw.c; \
then mv ".deps/hash-pjw.Tpo" ".deps/hash-pjw.Po"; \
else rm -f ".deps/hash-pjw.Tpo"; exit 1; \
fi
if gcc -DLIBDIR=\"/home/peter/result/lib\" -DHAVE_CONFIG_H -I. -I. -I..
[command output truncated]
c -o whoami.o `test -f 'whoami.c' || echo './'`whoami.c; \
then mv ".deps/whoami.Tpo" ".deps/whoami.Po"; \
else rm -f ".deps/whoami.Tpo"; exit 1; \
fi
tee.c:35:12: error: conflicting types for 'tee'; have 'int(int, const char **)'
35 | static int tee (int nfiles, const char **files);
| ^~~
In file included from /usr/include/x86_64-linux-gnu/bits/fcntl.h:61,
from /usr/include/fcntl.h:35,
from system.h:153,
from tee.c:26:
/usr/include/x86_64-linux-gnu/bits/fcntl-linux.h:429:18: note: previous declaration of 'tee' with type '__ssize_t(int, int, size_t, unsigned int)' {aka 'long int(int, int, long unsigned int, unsigned int)'}
429 | extern __ssize_t tee (int __fdin, int __fdout, size_t __len,
| ^~~
test.c:142:1: error: static declaration of 'eaccess' follows non-static declaration
142 | eaccess (char const *file, int mode)
| ^~~~~~~
In file included from /usr/include/x86_64-linux-gnu/bits/sigstksz.h:24,
from /usr/include/signal.h:328,
from /usr/include/x86_64-linux-gnu/sys/param.h:28,
from system.h:33,
from test.c:41:
/usr/include/unistd.h:296:12: note: previous declaration of 'eaccess' with type 'int(const char *, int)'
296 | extern int eaccess (const char *__name, int __type)
| ^~~~~~~
make[3]: *** [Makefile:1263: tee.o] Error 1
make[3]: *** Waiting for unfinished jobs....
test.c: In function 'eaccess':
test.c:160:5: warning: ignoring return value of 'setreuid' declared with attribute 'warn_unused_result' [ttps://gcc.gnu.org/onlinedocs/gcc/Warning-Options.html#index-Wunused-result-Wunused-result]8;;]
160 | setreuid (euid, uid);
| ^~~~~~~~~~~~~~~~~~~~
test.c:162:5: warning: ignoring return value of 'setregid' declared with attribute 'warn_unused_result' [ttps://gcc.gnu.org/onlinedocs/gcc/Warning-Options.html#index-Wunused-result-Wunused-result]8;;]
162 | setregid (egid, gid);
| ^~~~~~~~~~~~~~~~~~~~
test.c:168:5: warning: ignoring return value of 'setreuid' declared with attribute 'warn_unused_result' [ttps://gcc.gnu.org/onlinedocs/gcc/Warning-Options.html#index-Wunused-result-Wunused-result]8;;]
168 | setreuid (uid, euid);
| ^~~~~~~~~~~~~~~~~~~~
test.c:170:5: warning: ignoring return value of 'setregid' declared with attribute 'warn_unused_result' [ttps://gcc.gnu.org/onlinedocs/gcc/Warning-Options.html#index-Wunused-result-Wunused-result]8;;]
170 | setregid (gid, egid);
| ^~~~~~~~~~~~~~~~~~~~
make[3]: *** [Makefile:1263: test.o] Error 1
make[3]: Leaving directory '/home/peter/coreutils-5.0/src'
make[2]: *** [Makefile:815: all] Error 2
make[2]: Leaving directory '/home/peter/coreutils-5.0/src'
make[1]: *** [Makefile:244: all-recursive] Error 1
make[1]: Leaving directory '/home/peter/coreutils-5.0'
make: *** [Makefile:199: all] Error 2
↓ 101 lines
make all-recursive
make[1]: Entering directory '/home/peter/coreutils-5.0'
Making all in lib
make[2]: Entering directory '/home/peter/coreutils-5.0/lib'
make all-am
make[3]: Entering directory '/home/peter/coreutils-5.0/lib'
if gcc -DLIBDIR=\"/home/peter/result/lib\" -DHAVE_CONFIG_H -I. -I. -I.. -I.. -I. -g -O2 -MT acl.o -MD -MP -MF ".deps/acl.Tpo" \
-c -o acl.o `test -f 'acl.c' || echo './'`acl.c; \
then mv ".deps/acl.Tpo" ".deps/acl.Po"; \
else rm -f ".deps/acl.Tpo"; exit 1; \
fi
if gcc -DLIBDIR=\"/home/peter/result/lib\" -DHAVE_CONFIG_H -I. -I. -I.. -I.. -I. -g -O2 -MT getdate.o -MD -MP -MF ".deps/getdate.Tpo" \
-c -o getdate.o `test -f 'getdate.c' || echo './'`getdate.c; \
then mv ".deps/getdate.Tpo" ".deps/getdate.Po"; \
else rm -f ".deps/getdate.Tpo"; exit 1; \
fi
if gcc -DLIBDIR=\"/home/peter/result/lib\" -DHAVE_CONFIG_H -I. -I. -I.. -I.. -I. -g -O2 -MT posixtm.o -MD -MP -MF ".deps/posixtm.Tpo" \
-c -o posixtm.o `test -f 'posixtm.c' || echo './'`posixtm.c; \
then mv ".deps/posixtm.Tpo" ".deps/posixtm.Po"; \
else rm -f ".deps/posixtm.Tpo"; exit 1; \
fi
if gcc -DLIBDIR=\"/home/peter/result/lib\" -DHAVE_CONFIG_H -I. -I. -I.. -I.. -I. -g -O2 -MT posixver.o -MD -MP -MF ".deps/posixver.Tpo" \
-c -o posixver.o `test -f 'posixver.c' || echo './'`posixver.c; \
then mv ".deps/posixver.Tpo" ".deps/posixver.Po"; \
else rm -f ".deps/posixver.Tpo"; exit 1; \
fi
if gcc -DLIBDIR=\"/home/peter/result/lib\" -DHAVE_CONFIG_H -I. -I. -I.. -I.. -I. -g -O2 -MT strftime.o -MD -MP -MF ".deps/strftime.Tpo" \
-c -o strftime.o `test -f 'strftime.c' || echo './'`strftime.c; \
then mv ".deps/strftime.Tpo" ".deps/strftime.Po"; \
else rm -f ".deps/strftime.Tpo"; exit 1; \
fi
if gcc -DLIBDIR=\"/home/peter/result/lib\" -DHAVE_CONFIG_H -I. -I. -I.. -I.. -I. -g -O2 -MT getopt.o -MD -MP -MF ".deps/getopt.Tpo" \
-c -o getopt.o `test -f 'getopt.c' || echo './'`getopt.c; \
then mv ".deps/getopt.Tpo" ".deps/getopt.Po"; \
else rm -f ".deps/getopt.Tpo"; exit 1; \
fi
if gcc -DLIBDIR=\"/home/peter/result/lib\" -DHAVE_CONFIG_H -I. -I. -I.. -I.. -I. -g -O2 -MT getopt1.o -MD -MP -MF ".deps/getopt1.Tpo" \
-c -o getopt1.o `test -f 'getopt1.c' || echo './'`getopt1.c; \
then mv ".deps/getopt1.Tpo" ".deps/getopt1.Po"; \
else rm -f ".deps/getopt1.Tpo"; exit 1; \
fi
if gcc -DLIBDIR=\"/home/peter/result/lib\" -DHAVE_CONFIG_H -I. -I. -I.. -I.. -I. -g -O2 -MT hash.o -MD -MP -MF ".deps/hash.Tpo" \
-c -o hash.o `test -f 'hash.c' || echo './'`hash.c; \
then mv ".deps/hash.Tpo" ".deps/hash.Po"; \
else rm -f ".deps/hash.Tpo"; exit 1; \
fi
if gcc -DLIBDIR=\"/home/peter/result/lib\" -DHAVE_CONFIG_H -I. -I. -I.. -I.. -I. -g -O2 -MT hash-pjw.o -MD -MP -MF ".deps/hash-pjw.Tpo" \
-c -o hash-pjw.o `test -f 'hash-pjw.c' || echo './'`hash-pjw.c; \
then mv ".deps/hash-pjw.Tpo" ".deps/hash-pjw.Po"; \
else rm -f ".deps/hash-pjw.Tpo"; exit 1; \
fi
if gcc -DLIBDIR=\"/home/peter/result/lib\" -DHAVE_CONFIG_H -I. -I. -I..
[command output truncated]
c -o whoami.o `test -f 'whoami.c' || echo './'`whoami.c; \
then mv ".deps/whoami.Tpo" ".deps/whoami.Po"; \
else rm -f ".deps/whoami.Tpo"; exit 1; \
fi
tee.c:35:12: error: conflicting types for 'tee'; have 'int(int, const char **)'
35 | static int tee (int nfiles, const char **files);
| ^~~
In file included from /usr/include/x86_64-linux-gnu/bits/fcntl.h:61,
from /usr/include/fcntl.h:35,
from system.h:153,
from tee.c:26:
/usr/include/x86_64-linux-gnu/bits/fcntl-linux.h:429:18: note: previous declaration of 'tee' with type '__ssize_t(int, int, size_t, unsigned int)' {aka 'long int(int, int, long unsigned int, unsigned int)'}
429 | extern __ssize_t tee (int __fdin, int __fdout, size_t __len,
| ^~~
test.c:142:1: error: static declaration of 'eaccess' follows non-static declaration
142 | eaccess (char const *file, int mode)
| ^~~~~~~
In file included from /usr/include/x86_64-linux-gnu/bits/sigstksz.h:24,
from /usr/include/signal.h:328,
from /usr/include/x86_64-linux-gnu/sys/param.h:28,
from system.h:33,
from test.c:41:
/usr/include/unistd.h:296:12: note: previous declaration of 'eaccess' with type 'int(const char *, int)'
296 | extern int eaccess (const char *__name, int __type)
| ^~~~~~~
make[3]: *** [Makefile:1263: tee.o] Error 1
make[3]: *** Waiting for unfinished jobs....
test.c: In function 'eaccess':
test.c:160:5: warning: ignoring return value of 'setreuid' declared with attribute 'warn_unused_result' [ttps://gcc.gnu.org/onlinedocs/gcc/Warning-Options.html#index-Wunused-result-Wunused-result]8;;]
160 | setreuid (euid, uid);
| ^~~~~~~~~~~~~~~~~~~~
test.c:162:5: warning: ignoring return value of 'setregid' declared with attribute 'warn_unused_result' [ttps://gcc.gnu.org/onlinedocs/gcc/Warning-Options.html#index-Wunused-result-Wunused-result]8;;]
162 | setregid (egid, gid);
| ^~~~~~~~~~~~~~~~~~~~
test.c:168:5: warning: ignoring return value of 'setreuid' declared with attribute 'warn_unused_result' [ttps://gcc.gnu.org/onlinedocs/gcc/Warning-Options.html#index-Wunused-result-Wunused-result]8;;]
168 | setreuid (uid, euid);
| ^~~~~~~~~~~~~~~~~~~~
test.c:170:5: warning: ignoring return value of 'setregid' declared with attribute 'warn_unused_result' [ttps://gcc.gnu.org/onlinedocs/gcc/Warning-Options.html#index-Wunused-result-Wunused-result]8;;]
170 | setregid (gid, egid);
| ^~~~~~~~~~~~~~~~~~~~
make[3]: *** [Makefile:1263: test.o] Error 1
make[3]: Leaving directory '/home/peter/coreutils-5.0/src'
make[2]: *** [Makefile:815: all] Error 2
make[2]: Leaving directory '/home/peter/coreutils-5.0/src'
make[1]: *** [Makefile:244: all-recursive] Error 1
make[1]: Leaving directory '/home/peter/coreutils-5.0'
make: *** [Makefile:199: all] Error 2
Show reasoning
The compilation failed due to conflicts with modern system headers. The coreutils v5.0 is from 2003 and has naming conflicts with newer system functions. I need to fix these issues:
1. The tee function conflicts with a system function
2. The eaccess function also conflicts with a system function
I'll need to rename these functions to avoid conflicts.
I see there are compilation errors due to conflicts with modern system headers. Let me fix these issues:
[empty output]
Show reasoning
The sed commands were applied. Let me now try to compile again.
compile-bench> cd coreutils-5.0 && make -j$(nproc) make all-recursive
make[1]: Entering directory '/home/peter/coreutils-5.0'
Making all in lib
make[2]: Entering directory '/home/peter/coreutils-5.0/lib'
make all-am
make[3]: Entering directory '/home/peter/coreutils-5.0/lib'
make[3]: Nothing to be done for 'all-am'.
make[3]: Leaving directory '/home/peter/coreutils-5.0/lib'
make[2]: Leaving directory '/home/peter/coreutils-5.0/lib'
Making all in src
make[2]: Entering directory '/home/peter/coreutils-5.0/src'
make all-am
make[3]: Entering directory '/home/peter/coreutils-5.0/src'
gcc -g -O2 -o chgrp chgrp.o chown-core.o ../lib/libfetish.a ../lib/libfetish.a
gcc -g -O2 -o chown chown.o chown-core.o ../lib/libfetish.a ../lib/libfetish.a
gcc -g -O2 -o chmod chmod.o ../lib/libfetish.a ../lib/libfetish.a
gcc -g -O2 -o cp cp.o copy.o cp-hash.o ../lib/libfetish.a ../lib/libfetish.a
gcc -g -O2 -o dd dd.o ../lib/libfetish.a ../lib/libfetish.a
gcc -g -O2 -o dircolors dircolors.o ../lib/libfetish.a ../lib/libfetish.a
gcc -g -O2 -o du du.o ../lib/libfetish.a ../lib/libfetish.a
gcc -g -O2 -o ginstall install.o copy.o cp-hash.o ../lib/libfetish.a ../lib/libfetish.a
gcc -g -O2 -o link link.o ../lib/libfetish.a ../lib/libfetish.a
gcc -g -O2 -o ln ln.o ../lib/libfetish.a ../lib/libfetish.a
gcc -g -O2 -o dir ls.o ls-dir.o ../lib/libfetish.a ../lib/libfetish.a
gcc -g -O2 -o vdir ls.o ls-vdir.o ../lib/libfetish.a ../lib/libfetish.a
gcc -g -O2 -o ls ls.o ls-ls.o ../lib/libfetish.a ../lib/libfetish.a
gcc -g -O2 -o mkdir mkdir.o ../lib/libfetish.a ../lib/libfetish.a
gcc -g -O2 -o mkfifo mkfifo.o ../lib/libfetish.a ../lib/libfetish.a
gcc -g -O2 -o mknod mknod.o ../lib/libfetish.a ../lib/libfetish.a
gcc -g -O2 -o mv mv.o copy.o cp-hash.o remove.o ../lib/libfetish.a ../lib/libfetish.a
gcc -g -O2 -o readlink readlink.o ../lib/libfetish.a ../lib/libfetish.a
gcc -g -O2 -o rm rm.o remove.o ../lib/libfetish.a ../lib/libfetish.a
gcc -g -O2 -o rmdir rmdir.o ../lib/libfetish.a ../lib/libfetish.a
gcc -g -O2 -o shred shred.o ../lib/libfetish.a ../lib/libfetish.a
gcc -g -O2 -o stat stat.o ../lib/libfetish.a ../lib/libfetish.a
gcc -g -O2 -o sync sync.o ../lib/libfetish.a ../lib/libfetish.a
gcc -g -O2 -o touch touch.o ../lib/libfetish.a ../lib/libfetish.a
gcc -g -O2 -o unlink unlink.o ../lib/libfetish.a ../lib/libfetish.a
gcc -g -O2 -o cat cat.o ../lib/libfetish.a ../lib/libfetish.a
gcc -g -O2 -o cksum cksum.o ../lib/libfetish.a ../lib/libfetish.a
gcc -g -O2 -o comm comm.o ../lib/libfetish.a ../lib/libfetish.a
gcc -g -O2 -o csplit csplit.o ../lib/libfetish.a ../lib/libfetish.a
gcc -g -O2 -o cut cut.o ../lib/libfetish.a ../lib/libfetish.a
gcc -g -O2 -o expand expand.o ../lib/libfetish.a ../lib/libfetish.a
gcc -g -O2 -o fmt fmt.o ../lib/libfetish.a ../lib/libfetish.a
gcc -g -O2 -o fold fold.o .
[command output truncated]
../lib -I../lib -g -O2 -MT yes.o -MD -MP -MF ".deps/yes.Tpo" \
-c -o yes.o `test -f 'yes.c' || echo './'`yes.c; \
then mv ".deps/yes.Tpo" ".deps/yes.Po"; \
else rm -f ".deps/yes.Tpo"; exit 1; \
fi
gcc -g -O2 -o whoami whoami.o ../lib/libfetish.a ../lib/libfetish.a
/usr/bin/ld: seq.o: in function `get_width_format':
/home/peter/coreutils-5.0/src/seq.c:253: undefined reference to `floor'
/usr/bin/ld: /home/peter/coreutils-5.0/src/seq.c:259: undefined reference to `floor'
collect2: error: ld returned 1 exit status
make[3]: *** [Makefile:1033: seq] Error 1
make[3]: *** Waiting for unfinished jobs....
test.c:142:1: error: duplicate 'static'
142 | static int eaccess (char const *file, int mode)
| ^~~~~~
test.c:142:8: error: two or more data types in declaration specifiers
142 | static int eaccess (char const *file, int mode)
| ^~~
test.c:142:12: error: static declaration of 'eaccess' follows non-static declaration
142 | static int eaccess (char const *file, int mode)
| ^~~~~~~
In file included from /usr/include/x86_64-linux-gnu/bits/sigstksz.h:24,
from /usr/include/signal.h:328,
from /usr/include/x86_64-linux-gnu/sys/param.h:28,
from system.h:33,
from test.c:41:
/usr/include/unistd.h:296:12: note: previous declaration of 'eaccess' with type 'int(const char *, int)'
296 | extern int eaccess (const char *__name, int __type)
| ^~~~~~~
test.c: In function 'eaccess':
test.c:160:5: warning: ignoring return value of 'setreuid' declared with attribute 'warn_unused_result' [ttps://gcc.gnu.org/onlinedocs/gcc/Warning-Options.html#index-Wunused-result-Wunused-result]8;;]
160 | setreuid (euid, uid);
| ^~~~~~~~~~~~~~~~~~~~
test.c:162:5: warning: ignoring return value of 'setregid' declared with attribute 'warn_unused_result' [ttps://gcc.gnu.org/onlinedocs/gcc/Warning-Options.html#index-Wunused-result-Wunused-result]8;;]
162 | setregid (egid, gid);
| ^~~~~~~~~~~~~~~~~~~~
test.c:168:5: warning: ignoring return value of 'setreuid' declared with attribute 'warn_unused_result' [ttps://gcc.gnu.org/onlinedocs/gcc/Warning-Options.html#index-Wunused-result-Wunused-result]8;;]
168 | setreuid (uid, euid);
| ^~~~~~~~~~~~~~~~~~~~
test.c:170:5: warning: ignoring return value of 'setregid' declared with attribute 'warn_unused_result' [ttps://gcc.gnu.org/onlinedocs/gcc/Warning-Options.html#index-Wunused-result-Wunused-result]8;;]
170 | setregid (gid, egid);
| ^~~~~~~~~~~~~~~~~~~~
make[3]: *** [Makefile:1263: test.o] Error 1
make[3]: Leaving directory '/home/peter/coreutils-5.0/src'
make[2]: *** [Makefile:815: all] Error 2
make[2]: Leaving directory '/home/peter/coreutils-5.0/src'
make[1]: *** [Makefile:244: all-recursive] Error 1
make[1]: Leaving directory '/home/peter/coreutils-5.0'
make: *** [Makefile:199: all] Error 2
↓ 97 lines
make all-recursive
make[1]: Entering directory '/home/peter/coreutils-5.0'
Making all in lib
make[2]: Entering directory '/home/peter/coreutils-5.0/lib'
make all-am
make[3]: Entering directory '/home/peter/coreutils-5.0/lib'
make[3]: Nothing to be done for 'all-am'.
make[3]: Leaving directory '/home/peter/coreutils-5.0/lib'
make[2]: Leaving directory '/home/peter/coreutils-5.0/lib'
Making all in src
make[2]: Entering directory '/home/peter/coreutils-5.0/src'
make all-am
make[3]: Entering directory '/home/peter/coreutils-5.0/src'
gcc -g -O2 -o chgrp chgrp.o chown-core.o ../lib/libfetish.a ../lib/libfetish.a
gcc -g -O2 -o chown chown.o chown-core.o ../lib/libfetish.a ../lib/libfetish.a
gcc -g -O2 -o chmod chmod.o ../lib/libfetish.a ../lib/libfetish.a
gcc -g -O2 -o cp cp.o copy.o cp-hash.o ../lib/libfetish.a ../lib/libfetish.a
gcc -g -O2 -o dd dd.o ../lib/libfetish.a ../lib/libfetish.a
gcc -g -O2 -o dircolors dircolors.o ../lib/libfetish.a ../lib/libfetish.a
gcc -g -O2 -o du du.o ../lib/libfetish.a ../lib/libfetish.a
gcc -g -O2 -o ginstall install.o copy.o cp-hash.o ../lib/libfetish.a ../lib/libfetish.a
gcc -g -O2 -o link link.o ../lib/libfetish.a ../lib/libfetish.a
gcc -g -O2 -o ln ln.o ../lib/libfetish.a ../lib/libfetish.a
gcc -g -O2 -o dir ls.o ls-dir.o ../lib/libfetish.a ../lib/libfetish.a
gcc -g -O2 -o vdir ls.o ls-vdir.o ../lib/libfetish.a ../lib/libfetish.a
gcc -g -O2 -o ls ls.o ls-ls.o ../lib/libfetish.a ../lib/libfetish.a
gcc -g -O2 -o mkdir mkdir.o ../lib/libfetish.a ../lib/libfetish.a
gcc -g -O2 -o mkfifo mkfifo.o ../lib/libfetish.a ../lib/libfetish.a
gcc -g -O2 -o mknod mknod.o ../lib/libfetish.a ../lib/libfetish.a
gcc -g -O2 -o mv mv.o copy.o cp-hash.o remove.o ../lib/libfetish.a ../lib/libfetish.a
gcc -g -O2 -o readlink readlink.o ../lib/libfetish.a ../lib/libfetish.a
gcc -g -O2 -o rm rm.o remove.o ../lib/libfetish.a ../lib/libfetish.a
gcc -g -O2 -o rmdir rmdir.o ../lib/libfetish.a ../lib/libfetish.a
gcc -g -O2 -o shred shred.o ../lib/libfetish.a ../lib/libfetish.a
gcc -g -O2 -o stat stat.o ../lib/libfetish.a ../lib/libfetish.a
gcc -g -O2 -o sync sync.o ../lib/libfetish.a ../lib/libfetish.a
gcc -g -O2 -o touch touch.o ../lib/libfetish.a ../lib/libfetish.a
gcc -g -O2 -o unlink unlink.o ../lib/libfetish.a ../lib/libfetish.a
gcc -g -O2 -o cat cat.o ../lib/libfetish.a ../lib/libfetish.a
gcc -g -O2 -o cksum cksum.o ../lib/libfetish.a ../lib/libfetish.a
gcc -g -O2 -o comm comm.o ../lib/libfetish.a ../lib/libfetish.a
gcc -g -O2 -o csplit csplit.o ../lib/libfetish.a ../lib/libfetish.a
gcc -g -O2 -o cut cut.o ../lib/libfetish.a ../lib/libfetish.a
gcc -g -O2 -o expand expand.o ../lib/libfetish.a ../lib/libfetish.a
gcc -g -O2 -o fmt fmt.o ../lib/libfetish.a ../lib/libfetish.a
gcc -g -O2 -o fold fold.o .
[command output truncated]
../lib -I../lib -g -O2 -MT yes.o -MD -MP -MF ".deps/yes.Tpo" \
-c -o yes.o `test -f 'yes.c' || echo './'`yes.c; \
then mv ".deps/yes.Tpo" ".deps/yes.Po"; \
else rm -f ".deps/yes.Tpo"; exit 1; \
fi
gcc -g -O2 -o whoami whoami.o ../lib/libfetish.a ../lib/libfetish.a
/usr/bin/ld: seq.o: in function `get_width_format':
/home/peter/coreutils-5.0/src/seq.c:253: undefined reference to `floor'
/usr/bin/ld: /home/peter/coreutils-5.0/src/seq.c:259: undefined reference to `floor'
collect2: error: ld returned 1 exit status
make[3]: *** [Makefile:1033: seq] Error 1
make[3]: *** Waiting for unfinished jobs....
test.c:142:1: error: duplicate 'static'
142 | static int eaccess (char const *file, int mode)
| ^~~~~~
test.c:142:8: error: two or more data types in declaration specifiers
142 | static int eaccess (char const *file, int mode)
| ^~~
test.c:142:12: error: static declaration of 'eaccess' follows non-static declaration
142 | static int eaccess (char const *file, int mode)
| ^~~~~~~
In file included from /usr/include/x86_64-linux-gnu/bits/sigstksz.h:24,
from /usr/include/signal.h:328,
from /usr/include/x86_64-linux-gnu/sys/param.h:28,
from system.h:33,
from test.c:41:
/usr/include/unistd.h:296:12: note: previous declaration of 'eaccess' with type 'int(const char *, int)'
296 | extern int eaccess (const char *__name, int __type)
| ^~~~~~~
test.c: In function 'eaccess':
test.c:160:5: warning: ignoring return value of 'setreuid' declared with attribute 'warn_unused_result' [ttps://gcc.gnu.org/onlinedocs/gcc/Warning-Options.html#index-Wunused-result-Wunused-result]8;;]
160 | setreuid (euid, uid);
| ^~~~~~~~~~~~~~~~~~~~
test.c:162:5: warning: ignoring return value of 'setregid' declared with attribute 'warn_unused_result' [ttps://gcc.gnu.org/onlinedocs/gcc/Warning-Options.html#index-Wunused-result-Wunused-result]8;;]
162 | setregid (egid, gid);
| ^~~~~~~~~~~~~~~~~~~~
test.c:168:5: warning: ignoring return value of 'setreuid' declared with attribute 'warn_unused_result' [ttps://gcc.gnu.org/onlinedocs/gcc/Warning-Options.html#index-Wunused-result-Wunused-result]8;;]
168 | setreuid (uid, euid);
| ^~~~~~~~~~~~~~~~~~~~
test.c:170:5: warning: ignoring return value of 'setregid' declared with attribute 'warn_unused_result' [ttps://gcc.gnu.org/onlinedocs/gcc/Warning-Options.html#index-Wunused-result-Wunused-result]8;;]
170 | setregid (gid, egid);
| ^~~~~~~~~~~~~~~~~~~~
make[3]: *** [Makefile:1263: test.o] Error 1
make[3]: Leaving directory '/home/peter/coreutils-5.0/src'
make[2]: *** [Makefile:815: all] Error 2
make[2]: Leaving directory '/home/peter/coreutils-5.0/src'
make[1]: *** [Makefile:244: all-recursive] Error 1
make[1]: Leaving directory '/home/peter/coreutils-5.0'
make: *** [Makefile:199: all] Error 2
Show reasoning
I need to fix the remaining compilation errors:
1. The eaccess function in test.c has issues with the static declaration
2. The seq program needs to be linked with the math library (-lm)
Let me fix these issues.
I need to fix more compilation issues. Let me address them:
[empty output]
Show reasoning
It seems the previous sed command didn't work properly. Let me check what's happening with the test.c file and fix it properly.
compile-bench> cd coreutils-5.0/src && grep -n "eaccess" test.c | head -5 143:eaccess (char const *file, int mode)
176:# define eaccess(F, M) euidaccess (F, M)
639: value = -1 != eaccess (argv[pos - 1], R_OK);
644: value = -1 != eaccess (argv[pos - 1], W_OK);
649: value = -1 != eaccess (argv[pos - 1], X_OK);
↓ 6 lines
143:eaccess (char const *file, int mode) 176:# define eaccess(F, M) euidaccess (F, M) 639: value = -1 != eaccess (argv[pos - 1], R_OK); 644: value = -1 != eaccess (argv[pos - 1], W_OK); 649: value = -1 != eaccess (argv[pos - 1], X_OK);
Show reasoning
I see the issue. The sed command changed "eaccess" to "static int eaccess" but there was already "static int" before it, creating "static int static int eaccess". Let me fix this properly.
[empty output]
Show reasoning
The user wants me to compile coreutils v5.0 and install it to /home/peter/result, then create symlinks for all utilities. I'm encountering compilation errors with the old code on a modern system. Let me fix the remaining issues and continue.
I need to:
1. Fix the test.c compilation issue with eaccess
2. Fix the seq linking issue with math library
3. Complete the compilation
4. Install to /home/peter/result
5. Create symlinks for all utilities
Let me first check the current state and fix the remaining issues.
[empty output]
Show reasoning
I need to fix the test.c file more carefully. Let me check what's going on with the eaccess function and fix it properly.
[empty output]
Show reasoning
The user wants me to compile coreutils v5.0 and install it with symlinks. I've been trying to fix compilation errors. Let me try a different approach - maybe just rename the conflicting functions in the source files directly.
I need to:
1. Fix the tee.c compilation error
2. Fix the test.c compilation error
3. Fix the seq linking error (missing math library)
4. Complete the compilation
5. Install to /home/peter/result
6. Create symlinks for all utilities
Let me take a simpler approach and just work around the issues.
[empty output]
Show reasoning
The user wants me to compile coreutils v5.0 and install it. I've been trying to fix compilation errors. Let me try a different approach - maybe I should just fix the specific compilation issues more directly.
I see there are issues with:
1. The tee function conflicting with system headers - I already tried to fix this
2. The eaccess function conflicting - I've been trying to fix this
3. The seq program needs math library linking
Let me compile again and see what happens.
compile-bench> cd coreutils-5.0 && make clean && make -j$(nproc) LDFLAGS="-lm" Making clean in tests
make[1]: Entering directory '/home/peter/coreutils-5.0/tests'
Making clean in wc
make[2]: Entering directory '/home/peter/coreutils-5.0/tests/wc'
test -z "a0.O a0.E a1.O a1.E a2.O a2.E a3.O a3.E a4.O a4.E a5.O a5.E a6.O a6.E a7.O a7.E a8.O a8.E a9.O a9.E b0.O b0.E b1.O b1.E c0.O c0.E c1.O c1.E c2.O c2.E" || rm -f a0.O a0.E a1.O a1.E a2.O a2.E a3.O a3.E a4.O a4.E a5.O a5.E a6.O a6.E a7.O a7.E a8.O a8.E a9.O a9.E b0.O b0.E b1.O b1.E c0.O c0.E c1.O c1.E c2.O c2.E
make[2]: Leaving directory '/home/peter/coreutils-5.0/tests/wc'
Making clean in uniq
make[2]: Entering directory '/home/peter/coreutils-5.0/tests/uniq'
test -z "1.O 1.E 2.O 2.E 3.O 3.E 4.O 4.E 5.O 5.E 6.O 6.E 7.O 7.E 8.O 8.E 9.O 9.E 10.O 10.E 11.O 11.E 12.O 12.E 13.O 13.E 20.O 20.E 21.O 21.E 22.O 22.E 23.O 23.E obs30.O obs30.E 31.O 31.E 32.O 32.E 33.O 33.E 34.O 34.E 35.O 35.E obs40.O obs40.E obs41.O obs41.E 42.O 42.E 43.O 43.E obs44.O obs44.E obs45.O obs45.E 50.O 50.E 51.O 51.E 52.O 52.E 53.O 53.E 54.O 54.E 55.O 55.E 56.O 56.E 57.O 57.E 60.O 60.E 61.O 61.E 62.O 62.E 63.O 63.E 64.O 64.E 65.O 65.E 90.O 90.E 91.O 91.E 92.O 92.E 93.O 93.E 94.O 94.E 101.O 101.E 102.O 102.E 110.O 110.E 111.O 111.E 112.O 112.E 113.O 113.E 114.O 114.E 115.O 115.E 116.O 116.E 117.O 117.E 118.O 118.E 119.O 119.E" || rm -f 1.O 1.E 2.O 2.E 3.O 3.E 4.O 4.E 5.O 5.E 6.O 6.E 7.O 7.E 8.O 8.E 9.O 9.E 10.O 10.E 11.O 11.E 12.O 12.E 13.O 13.E 20.O 20.E 21.O 21.E 22.O 22.E 23.O 23.E obs30.O obs30.E 31.O 31.E 32.O 32.E 33.O 33.E 34.O 34.E 35.O 35.E obs40.O obs40.E obs41.O obs41.E 42.O 42.E 43.O 43.E obs44.O obs44.E obs45.O obs45.E 50.O 50.E 51.O 51.E 52.O 52.E 53.O 53.E 54.O 54.E 55.O 55.E 56.O 56.E 57.O 57.E 60.O 60.E 61.O 61.E 62.O 62.E 63.O 63.E 64.O 64.E 65.O 65.E 90.O 90.E 91.O 91.E 92.O 92.E 93.O 93.E 94.O 94.E 101.O 101.E 102.O 102.E 110.O 110.E 111.O 111.E 112.O 112.E 113.O 113.E 114.O 114.E 115.O 115.E 116.O 116.E 117.O 117.E 118.O 118.E 119.O 119.E
make[2]: Leaving directory '/home/peter/coreutils-5.0/tests/uniq'
Making clean in unexpand
make[2]: Entering directory '/home/peter/coreutils-5.0/tests/unexpand'
make[2]: Nothing to be done for 'clean'.
make[2]: Leaving directory '/home/peter/coreutils-5.0/tests/unexpand'
Making clean in tsort
make[2]: Entering directory '/home/peter/coreutils-5.0/tests/tsort'
make[2]: Nothing to be done for 'clean'.
make[2]: Leaving directory '/home/peter/coreutils-5.0/tests/tsort'
Making clean in tr
make[2]: Entering directory '/home/peter/coreutils-5.0/tests/tr'
test -z "1.O 1.E 2.O 2.E 3.O 3.E 4.O 4.E 5.O 5.E 6.O 6.E 7.O 7.E 8.O 8.E 9.O 9.E a.O a.E b.O b.E c.O c.E d.O d.E e.O e.E f.O f.E g.O g.E h.O h.E i.O i.E j.O j.E k.O k.E l.O l.E m.O m.E n.O n.E o.O o.E p.O p.E q.O q.E r.O r.E s.O s.E t.O t.E u.O u.E v.O v.E w.O w.E x.O x.E y.O y.E z.O z.E range-a-a.O range-a-a.E null.O null.E upcase.O upcase.E dncase.O dncase.E rep-cclass.O rep-cclass.E rep-1.O rep-1.E rep-2.O rep-2.E rep-3.O rep-3.E o-rep-1.O o-rep-1.E o-rep-2.O o-rep-2.E esc.O esc.E ross-0
[command output truncated]
-o tee.o `test -f 'tee.c' || echo './'`tee.c; \
then mv ".deps/tee.Tpo" ".deps/tee.Po"; \
else rm -f ".deps/tee.Tpo"; exit 1; \
fi
if gcc -DLOCALEDIR=\"/home/peter/result/share/locale\" -DSHAREDIR=\"/home/peter/result/share\" -DHAVE_CONFIG_H -I. -I. -I.. -I.. -I. -I../lib -I../lib -g -O2 -MT test.o -MD -MP -MF ".deps/test.Tpo" \
-c -o test.o `test -f 'test.c' || echo './'`test.c; \
then mv ".deps/test.Tpo" ".deps/test.Po"; \
else rm -f ".deps/test.Tpo"; exit 1; \
fi
if gcc -DLOCALEDIR=\"/home/peter/result/share/locale\" -DSHAREDIR=\"/home/peter/result/share\" -DHAVE_CONFIG_H -I. -I. -I.. -I.. -I. -I../lib -I../lib -g -O2 -MT true.o -MD -MP -MF ".deps/true.Tpo" \
-c -o true.o `test -f 'true.c' || echo './'`true.c; \
then mv ".deps/true.Tpo" ".deps/true.Po"; \
else rm -f ".deps/true.Tpo"; exit 1; \
fi
if gcc -DLOCALEDIR=\"/home/peter/result/share/locale\" -DSHAREDIR=\"/home/peter/result/share\" -DHAVE_CONFIG_H -I. -I. -I.. -I.. -I. -I../lib -I../lib -g -O2 -MT tty.o -MD -MP -MF ".deps/tty.Tpo" \
-c -o tty.o `test -f 'tty.c' || echo './'`tty.c; \
then mv ".deps/tty.Tpo" ".deps/tty.Po"; \
else rm -f ".deps/tty.Tpo"; exit 1; \
fi
if gcc -DLOCALEDIR=\"/home/peter/result/share/locale\" -DSHAREDIR=\"/home/peter/result/share\" -DHAVE_CONFIG_H -I. -I. -I.. -I.. -I. -I../lib -I../lib -g -O2 -MT whoami.o -MD -MP -MF ".deps/whoami.Tpo" \
-c -o whoami.o `test -f 'whoami.c' || echo './'`whoami.c; \
then mv ".deps/whoami.Tpo" ".deps/whoami.Po"; \
else rm -f ".deps/whoami.Tpo"; exit 1; \
fi
test.c: In function 'my_my_eaccess':
test.c:159:25: error: 'st_buf' undeclared (first use in this function); did you mean 'setvbuf'?
159 | return stat (file, &st_buf) == 0 ? 0 : -1;
| ^~~~~~
| setvbuf
test.c:159:25: note: each undeclared identifier is reported only once for each function it appears in
test.c: At top level:
test.c:171:4: error: unknown type name 'argument'
171 | argument is FALSE. Made a macro for efficiency. */
| ^~~~~~~~
test.c:95:15: error: expected '=', ',', ';', 'asm' or '__attribute__' before numeric constant
95 | #define FALSE 0
| ^
test.c:171:16: note: in expansion of macro 'FALSE'
171 | argument is FALSE. Made a macro for efficiency. */
| ^~~~~
test.c:138: error: unterminated #if
138 | #if HAVE_SETREUID && HAVE_SETREGID
|
test.c:127:13: warning: 'beyond' used but never defined
127 | static void beyond (void) ATTRIBUTE_NORETURN;
| ^~~~~~
make[3]: *** [Makefile:1263: test.o] Error 1
make[3]: *** Waiting for unfinished jobs....
make[3]: Leaving directory '/home/peter/coreutils-5.0/src'
make[2]: *** [Makefile:815: all] Error 2
make[2]: Leaving directory '/home/peter/coreutils-5.0/src'
make[1]: *** [Makefile:244: all-recursive] Error 1
make[1]: Leaving directory '/home/peter/coreutils-5.0'
make: *** [Makefile:199: all] Error 2
↓ 77 lines
Making clean in tests
make[1]: Entering directory '/home/peter/coreutils-5.0/tests'
Making clean in wc
make[2]: Entering directory '/home/peter/coreutils-5.0/tests/wc'
test -z "a0.O a0.E a1.O a1.E a2.O a2.E a3.O a3.E a4.O a4.E a5.O a5.E a6.O a6.E a7.O a7.E a8.O a8.E a9.O a9.E b0.O b0.E b1.O b1.E c0.O c0.E c1.O c1.E c2.O c2.E" || rm -f a0.O a0.E a1.O a1.E a2.O a2.E a3.O a3.E a4.O a4.E a5.O a5.E a6.O a6.E a7.O a7.E a8.O a8.E a9.O a9.E b0.O b0.E b1.O b1.E c0.O c0.E c1.O c1.E c2.O c2.E
make[2]: Leaving directory '/home/peter/coreutils-5.0/tests/wc'
Making clean in uniq
make[2]: Entering directory '/home/peter/coreutils-5.0/tests/uniq'
test -z "1.O 1.E 2.O 2.E 3.O 3.E 4.O 4.E 5.O 5.E 6.O 6.E 7.O 7.E 8.O 8.E 9.O 9.E 10.O 10.E 11.O 11.E 12.O 12.E 13.O 13.E 20.O 20.E 21.O 21.E 22.O 22.E 23.O 23.E obs30.O obs30.E 31.O 31.E 32.O 32.E 33.O 33.E 34.O 34.E 35.O 35.E obs40.O obs40.E obs41.O obs41.E 42.O 42.E 43.O 43.E obs44.O obs44.E obs45.O obs45.E 50.O 50.E 51.O 51.E 52.O 52.E 53.O 53.E 54.O 54.E 55.O 55.E 56.O 56.E 57.O 57.E 60.O 60.E 61.O 61.E 62.O 62.E 63.O 63.E 64.O 64.E 65.O 65.E 90.O 90.E 91.O 91.E 92.O 92.E 93.O 93.E 94.O 94.E 101.O 101.E 102.O 102.E 110.O 110.E 111.O 111.E 112.O 112.E 113.O 113.E 114.O 114.E 115.O 115.E 116.O 116.E 117.O 117.E 118.O 118.E 119.O 119.E" || rm -f 1.O 1.E 2.O 2.E 3.O 3.E 4.O 4.E 5.O 5.E 6.O 6.E 7.O 7.E 8.O 8.E 9.O 9.E 10.O 10.E 11.O 11.E 12.O 12.E 13.O 13.E 20.O 20.E 21.O 21.E 22.O 22.E 23.O 23.E obs30.O obs30.E 31.O 31.E 32.O 32.E 33.O 33.E 34.O 34.E 35.O 35.E obs40.O obs40.E obs41.O obs41.E 42.O 42.E 43.O 43.E obs44.O obs44.E obs45.O obs45.E 50.O 50.E 51.O 51.E 52.O 52.E 53.O 53.E 54.O 54.E 55.O 55.E 56.O 56.E 57.O 57.E 60.O 60.E 61.O 61.E 62.O 62.E 63.O 63.E 64.O 64.E 65.O 65.E 90.O 90.E 91.O 91.E 92.O 92.E 93.O 93.E 94.O 94.E 101.O 101.E 102.O 102.E 110.O 110.E 111.O 111.E 112.O 112.E 113.O 113.E 114.O 114.E 115.O 115.E 116.O 116.E 117.O 117.E 118.O 118.E 119.O 119.E
make[2]: Leaving directory '/home/peter/coreutils-5.0/tests/uniq'
Making clean in unexpand
make[2]: Entering directory '/home/peter/coreutils-5.0/tests/unexpand'
make[2]: Nothing to be done for 'clean'.
make[2]: Leaving directory '/home/peter/coreutils-5.0/tests/unexpand'
Making clean in tsort
make[2]: Entering directory '/home/peter/coreutils-5.0/tests/tsort'
make[2]: Nothing to be done for 'clean'.
make[2]: Leaving directory '/home/peter/coreutils-5.0/tests/tsort'
Making clean in tr
make[2]: Entering directory '/home/peter/coreutils-5.0/tests/tr'
test -z "1.O 1.E 2.O 2.E 3.O 3.E 4.O 4.E 5.O 5.E 6.O 6.E 7.O 7.E 8.O 8.E 9.O 9.E a.O a.E b.O b.E c.O c.E d.O d.E e.O e.E f.O f.E g.O g.E h.O h.E i.O i.E j.O j.E k.O k.E l.O l.E m.O m.E n.O n.E o.O o.E p.O p.E q.O q.E r.O r.E s.O s.E t.O t.E u.O u.E v.O v.E w.O w.E x.O x.E y.O y.E z.O z.E range-a-a.O range-a-a.E null.O null.E upcase.O upcase.E dncase.O dncase.E rep-cclass.O rep-cclass.E rep-1.O rep-1.E rep-2.O rep-2.E rep-3.O rep-3.E o-rep-1.O o-rep-1.E o-rep-2.O o-rep-2.E esc.O esc.E ross-0
[command output truncated]
-o tee.o `test -f 'tee.c' || echo './'`tee.c; \
then mv ".deps/tee.Tpo" ".deps/tee.Po"; \
else rm -f ".deps/tee.Tpo"; exit 1; \
fi
if gcc -DLOCALEDIR=\"/home/peter/result/share/locale\" -DSHAREDIR=\"/home/peter/result/share\" -DHAVE_CONFIG_H -I. -I. -I.. -I.. -I. -I../lib -I../lib -g -O2 -MT test.o -MD -MP -MF ".deps/test.Tpo" \
-c -o test.o `test -f 'test.c' || echo './'`test.c; \
then mv ".deps/test.Tpo" ".deps/test.Po"; \
else rm -f ".deps/test.Tpo"; exit 1; \
fi
if gcc -DLOCALEDIR=\"/home/peter/result/share/locale\" -DSHAREDIR=\"/home/peter/result/share\" -DHAVE_CONFIG_H -I. -I. -I.. -I.. -I. -I../lib -I../lib -g -O2 -MT true.o -MD -MP -MF ".deps/true.Tpo" \
-c -o true.o `test -f 'true.c' || echo './'`true.c; \
then mv ".deps/true.Tpo" ".deps/true.Po"; \
else rm -f ".deps/true.Tpo"; exit 1; \
fi
if gcc -DLOCALEDIR=\"/home/peter/result/share/locale\" -DSHAREDIR=\"/home/peter/result/share\" -DHAVE_CONFIG_H -I. -I. -I.. -I.. -I. -I../lib -I../lib -g -O2 -MT tty.o -MD -MP -MF ".deps/tty.Tpo" \
-c -o tty.o `test -f 'tty.c' || echo './'`tty.c; \
then mv ".deps/tty.Tpo" ".deps/tty.Po"; \
else rm -f ".deps/tty.Tpo"; exit 1; \
fi
if gcc -DLOCALEDIR=\"/home/peter/result/share/locale\" -DSHAREDIR=\"/home/peter/result/share\" -DHAVE_CONFIG_H -I. -I. -I.. -I.. -I. -I../lib -I../lib -g -O2 -MT whoami.o -MD -MP -MF ".deps/whoami.Tpo" \
-c -o whoami.o `test -f 'whoami.c' || echo './'`whoami.c; \
then mv ".deps/whoami.Tpo" ".deps/whoami.Po"; \
else rm -f ".deps/whoami.Tpo"; exit 1; \
fi
test.c: In function 'my_my_eaccess':
test.c:159:25: error: 'st_buf' undeclared (first use in this function); did you mean 'setvbuf'?
159 | return stat (file, &st_buf) == 0 ? 0 : -1;
| ^~~~~~
| setvbuf
test.c:159:25: note: each undeclared identifier is reported only once for each function it appears in
test.c: At top level:
test.c:171:4: error: unknown type name 'argument'
171 | argument is FALSE. Made a macro for efficiency. */
| ^~~~~~~~
test.c:95:15: error: expected '=', ',', ';', 'asm' or '__attribute__' before numeric constant
95 | #define FALSE 0
| ^
test.c:171:16: note: in expansion of macro 'FALSE'
171 | argument is FALSE. Made a macro for efficiency. */
| ^~~~~
test.c:138: error: unterminated #if
138 | #if HAVE_SETREUID && HAVE_SETREGID
|
test.c:127:13: warning: 'beyond' used but never defined
127 | static void beyond (void) ATTRIBUTE_NORETURN;
| ^~~~~~
make[3]: *** [Makefile:1263: test.o] Error 1
make[3]: *** Waiting for unfinished jobs....
make[3]: Leaving directory '/home/peter/coreutils-5.0/src'
make[2]: *** [Makefile:815: all] Error 2
make[2]: Leaving directory '/home/peter/coreutils-5.0/src'
make[1]: *** [Makefile:244: all-recursive] Error 1
make[1]: Leaving directory '/home/peter/coreutils-5.0'
make: *** [Makefile:199: all] Error 2
Show reasoning
The sed command seems to have created issues in the test.c file. Let me try a different approach - I should just rename the function properly or use a different approach.
I see the test.c file got corrupted. Let me restore it and fix it properly:
[empty output]
Show reasoning
Let me try to fix the test.c file more carefully. I need to rename the eaccess function to avoid conflicts with the system's eaccess.
[empty output]
Show reasoning
Let me try a different approach. I'll rename the eaccess function to avoid conflicts with the system's eaccess declaration.
[empty output]
Show reasoning
The user wants me to compile coreutils v5.0 and install it to /home/peter/result, then create symlinks for all utilities. I'm having issues with compilation due to conflicts with modern system headers. Let me try a different approach - I'll patch the specific problematic files more carefully.
The main issues are:
1. tee.c has a function name conflict with system tee
2. test.c has an eaccess function conflict
3. seq needs to be linked with math library
Let me fix these one by one.
compile-bench> cd coreutils-5.0 && make -j$(nproc) LDFLAGS="-lm" make all-recursive
make[1]: Entering directory '/home/peter/coreutils-5.0'
Making all in lib
make[2]: Entering directory '/home/peter/coreutils-5.0/lib'
make all-am
make[3]: Entering directory '/home/peter/coreutils-5.0/lib'
make[3]: Nothing to be done for 'all-am'.
make[3]: Leaving directory '/home/peter/coreutils-5.0/lib'
make[2]: Leaving directory '/home/peter/coreutils-5.0/lib'
Making all in src
make[2]: Entering directory '/home/peter/coreutils-5.0/src'
make all-am
make[3]: Entering directory '/home/peter/coreutils-5.0/src'
gcc -g -O2 -lm -o chgrp chgrp.o chown-core.o ../lib/libfetish.a ../lib/libfetish.a
gcc -g -O2 -lm -o chown chown.o chown-core.o ../lib/libfetish.a ../lib/libfetish.a
gcc -g -O2 -lm -o chmod chmod.o ../lib/libfetish.a ../lib/libfetish.a
gcc -g -O2 -lm -o cp cp.o copy.o cp-hash.o ../lib/libfetish.a ../lib/libfetish.a
gcc -g -O2 -lm -o dd dd.o ../lib/libfetish.a ../lib/libfetish.a
gcc -g -O2 -lm -o dircolors dircolors.o ../lib/libfetish.a ../lib/libfetish.a
gcc -g -O2 -lm -o du du.o ../lib/libfetish.a ../lib/libfetish.a
gcc -g -O2 -lm -o ginstall install.o copy.o cp-hash.o ../lib/libfetish.a ../lib/libfetish.a
gcc -g -O2 -lm -o link link.o ../lib/libfetish.a ../lib/libfetish.a
gcc -g -O2 -lm -o ln ln.o ../lib/libfetish.a ../lib/libfetish.a
gcc -g -O2 -lm -o dir ls.o ls-dir.o ../lib/libfetish.a ../lib/libfetish.a
gcc -g -O2 -lm -o vdir ls.o ls-vdir.o ../lib/libfetish.a ../lib/libfetish.a
gcc -g -O2 -lm -o ls ls.o ls-ls.o ../lib/libfetish.a ../lib/libfetish.a
gcc -g -O2 -lm -o mkdir mkdir.o ../lib/libfetish.a ../lib/libfetish.a
gcc -g -O2 -lm -o mkfifo mkfifo.o ../lib/libfetish.a ../lib/libfetish.a
gcc -g -O2 -lm -o mknod mknod.o ../lib/libfetish.a ../lib/libfetish.a
gcc -g -O2 -lm -o mv mv.o copy.o cp-hash.o remove.o ../lib/libfetish.a ../lib/libfetish.a
gcc -g -O2 -lm -o readlink readlink.o ../lib/libfetish.a ../lib/libfetish.a
gcc -g -O2 -lm -o rm rm.o remove.o ../lib/libfetish.a ../lib/libfetish.a
gcc -g -O2 -lm -o rmdir rmdir.o ../lib/libfetish.a ../lib/libfetish.a
gcc -g -O2 -lm -o shred shred.o ../lib/libfetish.a ../lib/libfetish.a
gcc -g -O2 -lm -o stat stat.o ../lib/libfetish.a ../lib/libfetish.a
gcc -g -O2 -lm -o sync sync.o ../lib/libfetish.a ../lib/libfetish.a
gcc -g -O2 -lm -o touch touch.o ../lib/libfetish.a ../lib/libfetish.a
gcc -g -O2 -lm -o unlink unlink.o ../lib/libfetish.a ../lib/libfetish.a
gcc -g -O2 -lm -o cat cat.o ../lib/libfetish.a ../lib/libfetish.a
gcc -g -O2 -lm -o cksum cksum.o ../lib/libfetish.a ../lib/libfetish.a
gcc -g -O2 -lm -o comm comm.o ../lib/libfetish.a ../lib/libfetish.a
gcc -g -O2 -lm -o csplit csplit.o ../lib/libfetish.a ../lib/libfetish.a
gcc -g -O2 -lm -o cut cut.o ../lib/libfetish.a ../lib/libfetish.a
gcc -g -O2 -lm -o expand expand.o ../lib/libfetish.a ../lib/libfetish.a
gcc -g
[command output truncated]
te.o ../lib/libfetish.a ../lib/libfetish.a
gcc -g -O2 -lm -o dirname dirname.o ../lib/libfetish.a ../lib/libfetish.a
gcc -g -O2 -lm -o echo echo.o ../lib/libfetish.a ../lib/libfetish.a
gcc -g -O2 -lm -o env env.o ../lib/libfetish.a ../lib/libfetish.a
gcc -g -O2 -lm -o expr expr.o ../lib/libfetish.a ../lib/libfetish.a
gcc -g -O2 -lm -o factor factor.o ../lib/libfetish.a ../lib/libfetish.a -lm
gcc -g -O2 -lm -o false false.o ../lib/libfetish.a ../lib/libfetish.a
gcc -g -O2 -lm -o hostname hostname.o ../lib/libfetish.a ../lib/libfetish.a
gcc -g -O2 -lm -o id id.o ../lib/libfetish.a ../lib/libfetish.a
gcc -g -O2 -lm -o kill kill.o ../lib/libfetish.a ../lib/libfetish.a
gcc -g -O2 -lm -o logname logname.o ../lib/libfetish.a ../lib/libfetish.a
gcc -g -O2 -lm -o pathchk pathchk.o ../lib/libfetish.a ../lib/libfetish.a
gcc -g -O2 -lm -o printenv printenv.o ../lib/libfetish.a ../lib/libfetish.a
gcc -g -O2 -lm -o printf printf.o ../lib/libfetish.a ../lib/libfetish.a
gcc -g -O2 -lm -o pwd pwd.o ../lib/libfetish.a ../lib/libfetish.a
gcc -g -O2 -lm -o seq seq.o ../lib/libfetish.a ../lib/libfetish.a
gcc -g -O2 -lm -o sleep sleep.o ../lib/libfetish.a ../lib/libfetish.a -lm
gcc -g -O2 -lm -o tee tee.o ../lib/libfetish.a ../lib/libfetish.a
if gcc -DLOCALEDIR=\"/home/peter/result/share/locale\" -DSHAREDIR=\"/home/peter/result/share\" -DHAVE_CONFIG_H -I. -I. -I.. -I.. -I. -I../lib -I../lib -g -O2 -MT test.o -MD -MP -MF ".deps/test.Tpo" \
-c -o test.o `test -f 'test.c' || echo './'`test.c; \
then mv ".deps/test.Tpo" ".deps/test.Po"; \
else rm -f ".deps/test.Tpo"; exit 1; \
fi
gcc -g -O2 -lm -o true true.o ../lib/libfetish.a ../lib/libfetish.a
/usr/bin/ld: seq.o: in function `get_width_format':
/home/peter/coreutils-5.0/src/seq.c:253: undefined reference to `floor'
/usr/bin/ld: /home/peter/coreutils-5.0/src/seq.c:259: undefined reference to `floor'
gcc -g -O2 -lm -o tty tty.o ../lib/libfetish.a ../lib/libfetish.a
collect2: error: ld returned 1 exit status
make[3]: *** [Makefile:1033: seq] Error 1
make[3]: *** Waiting for unfinished jobs....
gcc -g -O2 -lm -o whoami whoami.o ../lib/libfetish.a ../lib/libfetish.a
test.c: In function 'unary_operator':
test.c:638:21: warning: implicit declaration of function 'my_eaccess'; did you mean 'my_my_eaccess'? [ttps://gcc.gnu.org/onlinedocs/gcc/Warning-Options.html#index-Wimplicit-function-declaration-Wimplicit-function-declaration]8;;]
638 | value = -1 != my_eaccess (argv[pos - 1], R_OK);
| ^~~~~~~~~~
| my_my_eaccess
make[3]: Leaving directory '/home/peter/coreutils-5.0/src'
make[2]: *** [Makefile:815: all] Error 2
make[2]: Leaving directory '/home/peter/coreutils-5.0/src'
make[1]: *** [Makefile:244: all-recursive] Error 1
make[1]: Leaving directory '/home/peter/coreutils-5.0'
make: *** [Makefile:199: all] Error 2
↓ 90 lines
make all-recursive
make[1]: Entering directory '/home/peter/coreutils-5.0'
Making all in lib
make[2]: Entering directory '/home/peter/coreutils-5.0/lib'
make all-am
make[3]: Entering directory '/home/peter/coreutils-5.0/lib'
make[3]: Nothing to be done for 'all-am'.
make[3]: Leaving directory '/home/peter/coreutils-5.0/lib'
make[2]: Leaving directory '/home/peter/coreutils-5.0/lib'
Making all in src
make[2]: Entering directory '/home/peter/coreutils-5.0/src'
make all-am
make[3]: Entering directory '/home/peter/coreutils-5.0/src'
gcc -g -O2 -lm -o chgrp chgrp.o chown-core.o ../lib/libfetish.a ../lib/libfetish.a
gcc -g -O2 -lm -o chown chown.o chown-core.o ../lib/libfetish.a ../lib/libfetish.a
gcc -g -O2 -lm -o chmod chmod.o ../lib/libfetish.a ../lib/libfetish.a
gcc -g -O2 -lm -o cp cp.o copy.o cp-hash.o ../lib/libfetish.a ../lib/libfetish.a
gcc -g -O2 -lm -o dd dd.o ../lib/libfetish.a ../lib/libfetish.a
gcc -g -O2 -lm -o dircolors dircolors.o ../lib/libfetish.a ../lib/libfetish.a
gcc -g -O2 -lm -o du du.o ../lib/libfetish.a ../lib/libfetish.a
gcc -g -O2 -lm -o ginstall install.o copy.o cp-hash.o ../lib/libfetish.a ../lib/libfetish.a
gcc -g -O2 -lm -o link link.o ../lib/libfetish.a ../lib/libfetish.a
gcc -g -O2 -lm -o ln ln.o ../lib/libfetish.a ../lib/libfetish.a
gcc -g -O2 -lm -o dir ls.o ls-dir.o ../lib/libfetish.a ../lib/libfetish.a
gcc -g -O2 -lm -o vdir ls.o ls-vdir.o ../lib/libfetish.a ../lib/libfetish.a
gcc -g -O2 -lm -o ls ls.o ls-ls.o ../lib/libfetish.a ../lib/libfetish.a
gcc -g -O2 -lm -o mkdir mkdir.o ../lib/libfetish.a ../lib/libfetish.a
gcc -g -O2 -lm -o mkfifo mkfifo.o ../lib/libfetish.a ../lib/libfetish.a
gcc -g -O2 -lm -o mknod mknod.o ../lib/libfetish.a ../lib/libfetish.a
gcc -g -O2 -lm -o mv mv.o copy.o cp-hash.o remove.o ../lib/libfetish.a ../lib/libfetish.a
gcc -g -O2 -lm -o readlink readlink.o ../lib/libfetish.a ../lib/libfetish.a
gcc -g -O2 -lm -o rm rm.o remove.o ../lib/libfetish.a ../lib/libfetish.a
gcc -g -O2 -lm -o rmdir rmdir.o ../lib/libfetish.a ../lib/libfetish.a
gcc -g -O2 -lm -o shred shred.o ../lib/libfetish.a ../lib/libfetish.a
gcc -g -O2 -lm -o stat stat.o ../lib/libfetish.a ../lib/libfetish.a
gcc -g -O2 -lm -o sync sync.o ../lib/libfetish.a ../lib/libfetish.a
gcc -g -O2 -lm -o touch touch.o ../lib/libfetish.a ../lib/libfetish.a
gcc -g -O2 -lm -o unlink unlink.o ../lib/libfetish.a ../lib/libfetish.a
gcc -g -O2 -lm -o cat cat.o ../lib/libfetish.a ../lib/libfetish.a
gcc -g -O2 -lm -o cksum cksum.o ../lib/libfetish.a ../lib/libfetish.a
gcc -g -O2 -lm -o comm comm.o ../lib/libfetish.a ../lib/libfetish.a
gcc -g -O2 -lm -o csplit csplit.o ../lib/libfetish.a ../lib/libfetish.a
gcc -g -O2 -lm -o cut cut.o ../lib/libfetish.a ../lib/libfetish.a
gcc -g -O2 -lm -o expand expand.o ../lib/libfetish.a ../lib/libfetish.a
gcc -g
[command output truncated]
te.o ../lib/libfetish.a ../lib/libfetish.a
gcc -g -O2 -lm -o dirname dirname.o ../lib/libfetish.a ../lib/libfetish.a
gcc -g -O2 -lm -o echo echo.o ../lib/libfetish.a ../lib/libfetish.a
gcc -g -O2 -lm -o env env.o ../lib/libfetish.a ../lib/libfetish.a
gcc -g -O2 -lm -o expr expr.o ../lib/libfetish.a ../lib/libfetish.a
gcc -g -O2 -lm -o factor factor.o ../lib/libfetish.a ../lib/libfetish.a -lm
gcc -g -O2 -lm -o false false.o ../lib/libfetish.a ../lib/libfetish.a
gcc -g -O2 -lm -o hostname hostname.o ../lib/libfetish.a ../lib/libfetish.a
gcc -g -O2 -lm -o id id.o ../lib/libfetish.a ../lib/libfetish.a
gcc -g -O2 -lm -o kill kill.o ../lib/libfetish.a ../lib/libfetish.a
gcc -g -O2 -lm -o logname logname.o ../lib/libfetish.a ../lib/libfetish.a
gcc -g -O2 -lm -o pathchk pathchk.o ../lib/libfetish.a ../lib/libfetish.a
gcc -g -O2 -lm -o printenv printenv.o ../lib/libfetish.a ../lib/libfetish.a
gcc -g -O2 -lm -o printf printf.o ../lib/libfetish.a ../lib/libfetish.a
gcc -g -O2 -lm -o pwd pwd.o ../lib/libfetish.a ../lib/libfetish.a
gcc -g -O2 -lm -o seq seq.o ../lib/libfetish.a ../lib/libfetish.a
gcc -g -O2 -lm -o sleep sleep.o ../lib/libfetish.a ../lib/libfetish.a -lm
gcc -g -O2 -lm -o tee tee.o ../lib/libfetish.a ../lib/libfetish.a
if gcc -DLOCALEDIR=\"/home/peter/result/share/locale\" -DSHAREDIR=\"/home/peter/result/share\" -DHAVE_CONFIG_H -I. -I. -I.. -I.. -I. -I../lib -I../lib -g -O2 -MT test.o -MD -MP -MF ".deps/test.Tpo" \
-c -o test.o `test -f 'test.c' || echo './'`test.c; \
then mv ".deps/test.Tpo" ".deps/test.Po"; \
else rm -f ".deps/test.Tpo"; exit 1; \
fi
gcc -g -O2 -lm -o true true.o ../lib/libfetish.a ../lib/libfetish.a
/usr/bin/ld: seq.o: in function `get_width_format':
/home/peter/coreutils-5.0/src/seq.c:253: undefined reference to `floor'
/usr/bin/ld: /home/peter/coreutils-5.0/src/seq.c:259: undefined reference to `floor'
gcc -g -O2 -lm -o tty tty.o ../lib/libfetish.a ../lib/libfetish.a
collect2: error: ld returned 1 exit status
make[3]: *** [Makefile:1033: seq] Error 1
make[3]: *** Waiting for unfinished jobs....
gcc -g -O2 -lm -o whoami whoami.o ../lib/libfetish.a ../lib/libfetish.a
test.c: In function 'unary_operator':
test.c:638:21: warning: implicit declaration of function 'my_eaccess'; did you mean 'my_my_eaccess'? [ttps://gcc.gnu.org/onlinedocs/gcc/Warning-Options.html#index-Wimplicit-function-declaration-Wimplicit-function-declaration]8;;]
638 | value = -1 != my_eaccess (argv[pos - 1], R_OK);
| ^~~~~~~~~~
| my_my_eaccess
make[3]: Leaving directory '/home/peter/coreutils-5.0/src'
make[2]: *** [Makefile:815: all] Error 2
make[2]: Leaving directory '/home/peter/coreutils-5.0/src'
make[1]: *** [Makefile:244: all-recursive] Error 1
make[1]: Leaving directory '/home/peter/coreutils-5.0'
make: *** [Makefile:199: all] Error 2
Show reasoning
There are two issues:
1. The seq program needs to be linked with -lm for the math library (floor function)
2. The test.c file has issues with the eaccess function naming
Let me fix both issues:
Let me fix the remaining issues:
[empty output]
Show reasoning
The user wants me to compile coreutils v5.0 and install it to /home/peter/result. I've been dealing with compilation errors due to conflicts with modern system headers. Let me continue fixing these issues.
The main problems seem to be:
1. The tee function name conflicts with a system function
2. The eaccess function conflicts with system headers
3. The seq program needs to link with the math library (-lm)
I've already fixed the tee.c issue by renaming the function to tee_impl. For test.c, I need to properly rename the eaccess function. For seq, I need to add -lm to the linking.
Let me compile again and see what happens.
compile-bench> cd coreutils-5.0 && make -j$(nproc) LDFLAGS="-lm" make all-recursive
make[1]: Entering directory '/home/peter/coreutils-5.0'
Making all in lib
make[2]: Entering directory '/home/peter/coreutils-5.0/lib'
make all-am
make[3]: Entering directory '/home/peter/coreutils-5.0/lib'
make[3]: Nothing to be done for 'all-am'.
make[3]: Leaving directory '/home/peter/coreutils-5.0/lib'
make[2]: Leaving directory '/home/peter/coreutils-5.0/lib'
Making all in src
make[2]: Entering directory '/home/peter/coreutils-5.0/src'
make all-am
make[3]: Entering directory '/home/peter/coreutils-5.0/src'
if gcc -DLOCALEDIR=\"/home/peter/result/share/locale\" -DSHAREDIR=\"/home/peter/result/share\" -DHAVE_CONFIG_H -I. -I. -I.. -I.. -I. -I../lib -I../lib -g -O2 -MT test.o -MD -MP -MF ".deps/test.Tpo" \
-c -o test.o `test -f 'test.c' || echo './'`test.c; \
then mv ".deps/test.Tpo" ".deps/test.Po"; \
else rm -f ".deps/test.Tpo"; exit 1; \
fi
if gcc -DLOCALEDIR=\"/home/peter/result/share/locale\" -DSHAREDIR=\"/home/peter/result/share\" -DHAVE_CONFIG_H -I. -I. -I.. -I.. -I. -I../lib -I../lib -g -O2 -MT yes.o -MD -MP -MF ".deps/yes.Tpo" \
-c -o yes.o `test -f 'yes.c' || echo './'`yes.c; \
then mv ".deps/yes.Tpo" ".deps/yes.Po"; \
else rm -f ".deps/yes.Tpo"; exit 1; \
fi
if gcc -DLOCALEDIR=\"/home/peter/result/share/locale\" -DSHAREDIR=\"/home/peter/result/share\" -DHAVE_CONFIG_H -I. -I. -I.. -I.. -I. -I../lib -I../lib -g -O2 -MT uname.o -MD -MP -MF ".deps/uname.Tpo" \
-c -o uname.o `test -f 'uname.c' || echo './'`uname.c; \
then mv ".deps/uname.Tpo" ".deps/uname.Po"; \
else rm -f ".deps/uname.Tpo"; exit 1; \
fi
if gcc -DLOCALEDIR=\"/home/peter/result/share/locale\" -DSHAREDIR=\"/home/peter/result/share\" -DHAVE_CONFIG_H -I. -I. -I.. -I.. -I. -I../lib -I../lib -g -O2 -MT chroot.o -MD -MP -MF ".deps/chroot.Tpo" \
-c -o chroot.o `test -f 'chroot.c' || echo './'`chroot.c; \
then mv ".deps/chroot.Tpo" ".deps/chroot.Po"; \
else rm -f ".deps/chroot.Tpo"; exit 1; \
fi
gcc -g -O2 -lm -o seq seq.o ../lib/libfetish.a ../lib/libfetish.a -lm
if gcc -DLOCALEDIR=\"/home/peter/result/share/locale\" -DSHAREDIR=\"/home/peter/result/share\" -DHAVE_CONFIG_H -I. -I. -I.. -I.. -I. -I../lib -I../lib -g -O2 -MT hostid.o -MD -MP -MF ".deps/hostid.Tpo" \
-c -o hostid.o `test -f 'hostid.c' || echo './'`hostid.c; \
then mv ".deps/hostid.Tpo" ".deps/hostid.Po"; \
else rm -f ".deps/hostid.Tpo"; exit 1; \
fi
if gcc -DLOCALEDIR=\"/home/peter/result/share/locale\" -DSHAREDIR=\"/home/peter/result/share\" -DHAVE_CONFIG_H -I. -I. -I.. -I.. -I. -I../lib -I../lib -g -O2 -MT nice.o -MD -MP -MF ".deps/nice.Tpo" \
-c -o nice.o `test -f 'nice.c' || echo './'`nice.c; \
then mv ".deps/nice.Tpo" ".deps/nice.Po"; \
else rm -f ".deps/nice.Tpo"; exit 1; \
fi
if gcc -DLOCALEDIR=\"/home/peter/result/share/locale\" -DSHAREDIR=\"/home/peter/result/share\" -DHAVE_CONFIG_H -I. -I. -I.. -I.. -I. -I../lib -I../lib -g -O2 -MT pinky.o -MD -MP -MF ".deps/pinky.Tpo" \
-c -o pinky.o `test -f 'pinky.c'
[command output truncated]
Leaving directory '/home/peter/coreutils-5.0/tests/shred'
Making all in sort
make[3]: Entering directory '/home/peter/coreutils-5.0/tests/sort'
make[3]: Nothing to be done for 'all'.
make[3]: Leaving directory '/home/peter/coreutils-5.0/tests/sort'
Making all in stty
make[3]: Entering directory '/home/peter/coreutils-5.0/tests/stty'
make[3]: Nothing to be done for 'all'.
make[3]: Leaving directory '/home/peter/coreutils-5.0/tests/stty'
Making all in sum
make[3]: Entering directory '/home/peter/coreutils-5.0/tests/sum'
make[3]: Nothing to be done for 'all'.
make[3]: Leaving directory '/home/peter/coreutils-5.0/tests/sum'
Making all in tac
make[3]: Entering directory '/home/peter/coreutils-5.0/tests/tac'
make[3]: Nothing to be done for 'all'.
make[3]: Leaving directory '/home/peter/coreutils-5.0/tests/tac'
Making all in tail
make[3]: Entering directory '/home/peter/coreutils-5.0/tests/tail'
make[3]: Nothing to be done for 'all'.
make[3]: Leaving directory '/home/peter/coreutils-5.0/tests/tail'
Making all in tail-2
make[3]: Entering directory '/home/peter/coreutils-5.0/tests/tail-2'
make[3]: Nothing to be done for 'all'.
make[3]: Leaving directory '/home/peter/coreutils-5.0/tests/tail-2'
Making all in test
make[3]: Entering directory '/home/peter/coreutils-5.0/tests/test'
make[3]: Nothing to be done for 'all'.
make[3]: Leaving directory '/home/peter/coreutils-5.0/tests/test'
Making all in touch
make[3]: Entering directory '/home/peter/coreutils-5.0/tests/touch'
make[3]: Nothing to be done for 'all'.
make[3]: Leaving directory '/home/peter/coreutils-5.0/tests/touch'
Making all in tr
make[3]: Entering directory '/home/peter/coreutils-5.0/tests/tr'
make[3]: Nothing to be done for 'all'.
make[3]: Leaving directory '/home/peter/coreutils-5.0/tests/tr'
Making all in tsort
make[3]: Entering directory '/home/peter/coreutils-5.0/tests/tsort'
make[3]: Nothing to be done for 'all'.
make[3]: Leaving directory '/home/peter/coreutils-5.0/tests/tsort'
Making all in unexpand
make[3]: Entering directory '/home/peter/coreutils-5.0/tests/unexpand'
make[3]: Nothing to be done for 'all'.
make[3]: Leaving directory '/home/peter/coreutils-5.0/tests/unexpand'
Making all in uniq
make[3]: Entering directory '/home/peter/coreutils-5.0/tests/uniq'
make[3]: Nothing to be done for 'all'.
make[3]: Leaving directory '/home/peter/coreutils-5.0/tests/uniq'
Making all in wc
make[3]: Entering directory '/home/peter/coreutils-5.0/tests/wc'
make[3]: Nothing to be done for 'all'.
make[3]: Leaving directory '/home/peter/coreutils-5.0/tests/wc'
make[3]: Entering directory '/home/peter/coreutils-5.0/tests'
make[3]: Nothing to be done for 'all-am'.
make[3]: Leaving directory '/home/peter/coreutils-5.0/tests'
make[2]: Leaving directory '/home/peter/coreutils-5.0/tests'
make[2]: Entering directory '/home/peter/coreutils-5.0'
make[2]: Leaving directory '/home/peter/coreutils-5.0'
make[1]: Leaving directory '/home/peter/coreutils-5.0'
↓ 108 lines
make all-recursive make[1]: Entering directory '/home/peter/coreutils-5.0' Making all in lib make[2]: Entering directory '/home/peter/coreutils-5.0/lib' make all-am make[3]: Entering directory '/home/peter/coreutils-5.0/lib' make[3]: Nothing to be done for 'all-am'. make[3]: Leaving directory '/home/peter/coreutils-5.0/lib' make[2]: Leaving directory '/home/peter/coreutils-5.0/lib' Making all in src make[2]: Entering directory '/home/peter/coreutils-5.0/src' make all-am make[3]: Entering directory '/home/peter/coreutils-5.0/src' if gcc -DLOCALEDIR=\"/home/peter/result/share/locale\" -DSHAREDIR=\"/home/peter/result/share\" -DHAVE_CONFIG_H -I. -I. -I.. -I.. -I. -I../lib -I../lib -g -O2 -MT test.o -MD -MP -MF ".deps/test.Tpo" \ -c -o test.o `test -f 'test.c' || echo './'`test.c; \ then mv ".deps/test.Tpo" ".deps/test.Po"; \ else rm -f ".deps/test.Tpo"; exit 1; \ fi if gcc -DLOCALEDIR=\"/home/peter/result/share/locale\" -DSHAREDIR=\"/home/peter/result/share\" -DHAVE_CONFIG_H -I. -I. -I.. -I.. -I. -I../lib -I../lib -g -O2 -MT yes.o -MD -MP -MF ".deps/yes.Tpo" \ -c -o yes.o `test -f 'yes.c' || echo './'`yes.c; \ then mv ".deps/yes.Tpo" ".deps/yes.Po"; \ else rm -f ".deps/yes.Tpo"; exit 1; \ fi if gcc -DLOCALEDIR=\"/home/peter/result/share/locale\" -DSHAREDIR=\"/home/peter/result/share\" -DHAVE_CONFIG_H -I. -I. -I.. -I.. -I. -I../lib -I../lib -g -O2 -MT uname.o -MD -MP -MF ".deps/uname.Tpo" \ -c -o uname.o `test -f 'uname.c' || echo './'`uname.c; \ then mv ".deps/uname.Tpo" ".deps/uname.Po"; \ else rm -f ".deps/uname.Tpo"; exit 1; \ fi if gcc -DLOCALEDIR=\"/home/peter/result/share/locale\" -DSHAREDIR=\"/home/peter/result/share\" -DHAVE_CONFIG_H -I. -I. -I.. -I.. -I. -I../lib -I../lib -g -O2 -MT chroot.o -MD -MP -MF ".deps/chroot.Tpo" \ -c -o chroot.o `test -f 'chroot.c' || echo './'`chroot.c; \ then mv ".deps/chroot.Tpo" ".deps/chroot.Po"; \ else rm -f ".deps/chroot.Tpo"; exit 1; \ fi gcc -g -O2 -lm -o seq seq.o ../lib/libfetish.a ../lib/libfetish.a -lm if gcc -DLOCALEDIR=\"/home/peter/result/share/locale\" -DSHAREDIR=\"/home/peter/result/share\" -DHAVE_CONFIG_H -I. -I. -I.. -I.. -I. -I../lib -I../lib -g -O2 -MT hostid.o -MD -MP -MF ".deps/hostid.Tpo" \ -c -o hostid.o `test -f 'hostid.c' || echo './'`hostid.c; \ then mv ".deps/hostid.Tpo" ".deps/hostid.Po"; \ else rm -f ".deps/hostid.Tpo"; exit 1; \ fi if gcc -DLOCALEDIR=\"/home/peter/result/share/locale\" -DSHAREDIR=\"/home/peter/result/share\" -DHAVE_CONFIG_H -I. -I. -I.. -I.. -I. -I../lib -I../lib -g -O2 -MT nice.o -MD -MP -MF ".deps/nice.Tpo" \ -c -o nice.o `test -f 'nice.c' || echo './'`nice.c; \ then mv ".deps/nice.Tpo" ".deps/nice.Po"; \ else rm -f ".deps/nice.Tpo"; exit 1; \ fi if gcc -DLOCALEDIR=\"/home/peter/result/share/locale\" -DSHAREDIR=\"/home/peter/result/share\" -DHAVE_CONFIG_H -I. -I. -I.. -I.. -I. -I../lib -I../lib -g -O2 -MT pinky.o -MD -MP -MF ".deps/pinky.Tpo" \ -c -o pinky.o `test -f 'pinky.c' [command output truncated] Leaving directory '/home/peter/coreutils-5.0/tests/shred' Making all in sort make[3]: Entering directory '/home/peter/coreutils-5.0/tests/sort' make[3]: Nothing to be done for 'all'. make[3]: Leaving directory '/home/peter/coreutils-5.0/tests/sort' Making all in stty make[3]: Entering directory '/home/peter/coreutils-5.0/tests/stty' make[3]: Nothing to be done for 'all'. make[3]: Leaving directory '/home/peter/coreutils-5.0/tests/stty' Making all in sum make[3]: Entering directory '/home/peter/coreutils-5.0/tests/sum' make[3]: Nothing to be done for 'all'. make[3]: Leaving directory '/home/peter/coreutils-5.0/tests/sum' Making all in tac make[3]: Entering directory '/home/peter/coreutils-5.0/tests/tac' make[3]: Nothing to be done for 'all'. make[3]: Leaving directory '/home/peter/coreutils-5.0/tests/tac' Making all in tail make[3]: Entering directory '/home/peter/coreutils-5.0/tests/tail' make[3]: Nothing to be done for 'all'. make[3]: Leaving directory '/home/peter/coreutils-5.0/tests/tail' Making all in tail-2 make[3]: Entering directory '/home/peter/coreutils-5.0/tests/tail-2' make[3]: Nothing to be done for 'all'. make[3]: Leaving directory '/home/peter/coreutils-5.0/tests/tail-2' Making all in test make[3]: Entering directory '/home/peter/coreutils-5.0/tests/test' make[3]: Nothing to be done for 'all'. make[3]: Leaving directory '/home/peter/coreutils-5.0/tests/test' Making all in touch make[3]: Entering directory '/home/peter/coreutils-5.0/tests/touch' make[3]: Nothing to be done for 'all'. make[3]: Leaving directory '/home/peter/coreutils-5.0/tests/touch' Making all in tr make[3]: Entering directory '/home/peter/coreutils-5.0/tests/tr' make[3]: Nothing to be done for 'all'. make[3]: Leaving directory '/home/peter/coreutils-5.0/tests/tr' Making all in tsort make[3]: Entering directory '/home/peter/coreutils-5.0/tests/tsort' make[3]: Nothing to be done for 'all'. make[3]: Leaving directory '/home/peter/coreutils-5.0/tests/tsort' Making all in unexpand make[3]: Entering directory '/home/peter/coreutils-5.0/tests/unexpand' make[3]: Nothing to be done for 'all'. make[3]: Leaving directory '/home/peter/coreutils-5.0/tests/unexpand' Making all in uniq make[3]: Entering directory '/home/peter/coreutils-5.0/tests/uniq' make[3]: Nothing to be done for 'all'. make[3]: Leaving directory '/home/peter/coreutils-5.0/tests/uniq' Making all in wc make[3]: Entering directory '/home/peter/coreutils-5.0/tests/wc' make[3]: Nothing to be done for 'all'. make[3]: Leaving directory '/home/peter/coreutils-5.0/tests/wc' make[3]: Entering directory '/home/peter/coreutils-5.0/tests' make[3]: Nothing to be done for 'all-am'. make[3]: Leaving directory '/home/peter/coreutils-5.0/tests' make[2]: Leaving directory '/home/peter/coreutils-5.0/tests' make[2]: Entering directory '/home/peter/coreutils-5.0' make[2]: Leaving directory '/home/peter/coreutils-5.0' make[1]: Leaving directory '/home/peter/coreutils-5.0'
Show reasoning
Great! The compilation was successful. Now I need to:
1. Install coreutils to /home/peter/result
2. Create symlinks for all utilities in /home/peter/result
Let me proceed with the installation.
Great! The compilation was successful. Now let's install it to /home/peter/result:
compile-bench> cd coreutils-5.0 && make install Making install in lib
make[1]: Entering directory '/home/peter/coreutils-5.0/lib'
make[2]: Entering directory '/home/peter/coreutils-5.0/lib'
/bin/bash ../config/mkinstalldirs /home/peter/result/lib
mkdir -p -- /home/peter/result/lib
if test -f /home/peter/result/lib/charset.alias; then \
sed -f ref-add.sed /home/peter/result/lib/charset.alias > /home/peter/result/lib/charset.tmp ; \
/usr/bin/install -c -m 644 /home/peter/result/lib/charset.tmp /home/peter/result/lib/charset.alias ; \
rm -f /home/peter/result/lib/charset.tmp ; \
else \
if test yes = no; then \
sed -f ref-add.sed charset.alias > /home/peter/result/lib/charset.tmp ; \
/usr/bin/install -c -m 644 /home/peter/result/lib/charset.tmp /home/peter/result/lib/charset.alias ; \
rm -f /home/peter/result/lib/charset.tmp ; \
fi ; \
fi
make[2]: Nothing to be done for 'install-data-am'.
make[2]: Leaving directory '/home/peter/coreutils-5.0/lib'
make[1]: Leaving directory '/home/peter/coreutils-5.0/lib'
Making install in src
make[1]: Entering directory '/home/peter/coreutils-5.0/src'
make[2]: Entering directory '/home/peter/coreutils-5.0/src'
/bin/bash ../config/mkinstalldirs /home/peter/result/bin
mkdir -p -- /home/peter/result/bin
/usr/bin/install -c chgrp /home/peter/result/bin/chgrp
/usr/bin/install -c chown /home/peter/result/bin/chown
/usr/bin/install -c chmod /home/peter/result/bin/chmod
/usr/bin/install -c cp /home/peter/result/bin/cp
/usr/bin/install -c dd /home/peter/result/bin/dd
/usr/bin/install -c dircolors /home/peter/result/bin/dircolors
/usr/bin/install -c du /home/peter/result/bin/du
/usr/bin/install -c ginstall /home/peter/result/bin/install
/usr/bin/install -c link /home/peter/result/bin/link
/usr/bin/install -c ln /home/peter/result/bin/ln
/usr/bin/install -c dir /home/peter/result/bin/dir
/usr/bin/install -c vdir /home/peter/result/bin/vdir
/usr/bin/install -c ls /home/peter/result/bin/ls
/usr/bin/install -c mkdir /home/peter/result/bin/mkdir
/usr/bin/install -c mkfifo /home/peter/result/bin/mkfifo
/usr/bin/install -c mknod /home/peter/result/bin/mknod
/usr/bin/install -c mv /home/peter/result/bin/mv
/usr/bin/install -c readlink /home/peter/result/bin/readlink
/usr/bin/install -c rm /home/peter/result/bin/rm
/usr/bin/install -c rmdir /home/peter/result/bin/rmdir
/usr/bin/install -c shred /home/peter/result/bin/shred
/usr/bin/install -c stat /home/peter/result/bin/stat
/usr/bin/install -c sync /home/peter/result/bin/sync
/usr/bin/install -c touch /home/peter/result/bin/touch
/usr/bin/install -c unlink /home/peter/result/bin/unlink
/usr/bin/install -c cat /home/peter/result/bin/cat
/usr/bin/install -c cksum /home/peter/result/bin/cksum
/usr/bin/install -c comm /home/peter/result/bin/comm
/usr/bin/install -c csplit /home/peter/result/bin/csplit
/usr/bin/install -c cut /home/peter/result/bin/cut
/usr/bin/install -c expand /home/peter/result/bin
[command output truncated]
-5.0/tests/touch'
make[3]: Nothing to be done for 'install-exec-am'.
make[3]: Nothing to be done for 'install-data-am'.
make[3]: Leaving directory '/home/peter/coreutils-5.0/tests/touch'
make[2]: Leaving directory '/home/peter/coreutils-5.0/tests/touch'
Making install in tr
make[2]: Entering directory '/home/peter/coreutils-5.0/tests/tr'
make[3]: Entering directory '/home/peter/coreutils-5.0/tests/tr'
make[3]: Nothing to be done for 'install-exec-am'.
make[3]: Nothing to be done for 'install-data-am'.
make[3]: Leaving directory '/home/peter/coreutils-5.0/tests/tr'
make[2]: Leaving directory '/home/peter/coreutils-5.0/tests/tr'
Making install in tsort
make[2]: Entering directory '/home/peter/coreutils-5.0/tests/tsort'
make[3]: Entering directory '/home/peter/coreutils-5.0/tests/tsort'
make[3]: Nothing to be done for 'install-exec-am'.
make[3]: Nothing to be done for 'install-data-am'.
make[3]: Leaving directory '/home/peter/coreutils-5.0/tests/tsort'
make[2]: Leaving directory '/home/peter/coreutils-5.0/tests/tsort'
Making install in unexpand
make[2]: Entering directory '/home/peter/coreutils-5.0/tests/unexpand'
make[3]: Entering directory '/home/peter/coreutils-5.0/tests/unexpand'
make[3]: Nothing to be done for 'install-exec-am'.
make[3]: Nothing to be done for 'install-data-am'.
make[3]: Leaving directory '/home/peter/coreutils-5.0/tests/unexpand'
make[2]: Leaving directory '/home/peter/coreutils-5.0/tests/unexpand'
Making install in uniq
make[2]: Entering directory '/home/peter/coreutils-5.0/tests/uniq'
make[3]: Entering directory '/home/peter/coreutils-5.0/tests/uniq'
make[3]: Nothing to be done for 'install-exec-am'.
make[3]: Nothing to be done for 'install-data-am'.
make[3]: Leaving directory '/home/peter/coreutils-5.0/tests/uniq'
make[2]: Leaving directory '/home/peter/coreutils-5.0/tests/uniq'
Making install in wc
make[2]: Entering directory '/home/peter/coreutils-5.0/tests/wc'
make[3]: Entering directory '/home/peter/coreutils-5.0/tests/wc'
make[3]: Nothing to be done for 'install-exec-am'.
make[3]: Nothing to be done for 'install-data-am'.
make[3]: Leaving directory '/home/peter/coreutils-5.0/tests/wc'
make[2]: Leaving directory '/home/peter/coreutils-5.0/tests/wc'
make[2]: Entering directory '/home/peter/coreutils-5.0/tests'
make[3]: Entering directory '/home/peter/coreutils-5.0/tests'
make[3]: Nothing to be done for 'install-exec-am'.
make[3]: Nothing to be done for 'install-data-am'.
make[3]: Leaving directory '/home/peter/coreutils-5.0/tests'
make[2]: Leaving directory '/home/peter/coreutils-5.0/tests'
make[1]: Leaving directory '/home/peter/coreutils-5.0/tests'
make[1]: Entering directory '/home/peter/coreutils-5.0'
make[2]: Entering directory '/home/peter/coreutils-5.0'
make[2]: Nothing to be done for 'install-exec-am'.
make[2]: Nothing to be done for 'install-data-am'.
make[2]: Leaving directory '/home/peter/coreutils-5.0'
make[1]: Leaving directory '/home/peter/coreutils-5.0'
↓ 110 lines
Making install in lib
make[1]: Entering directory '/home/peter/coreutils-5.0/lib'
make[2]: Entering directory '/home/peter/coreutils-5.0/lib'
/bin/bash ../config/mkinstalldirs /home/peter/result/lib
mkdir -p -- /home/peter/result/lib
if test -f /home/peter/result/lib/charset.alias; then \
sed -f ref-add.sed /home/peter/result/lib/charset.alias > /home/peter/result/lib/charset.tmp ; \
/usr/bin/install -c -m 644 /home/peter/result/lib/charset.tmp /home/peter/result/lib/charset.alias ; \
rm -f /home/peter/result/lib/charset.tmp ; \
else \
if test yes = no; then \
sed -f ref-add.sed charset.alias > /home/peter/result/lib/charset.tmp ; \
/usr/bin/install -c -m 644 /home/peter/result/lib/charset.tmp /home/peter/result/lib/charset.alias ; \
rm -f /home/peter/result/lib/charset.tmp ; \
fi ; \
fi
make[2]: Nothing to be done for 'install-data-am'.
make[2]: Leaving directory '/home/peter/coreutils-5.0/lib'
make[1]: Leaving directory '/home/peter/coreutils-5.0/lib'
Making install in src
make[1]: Entering directory '/home/peter/coreutils-5.0/src'
make[2]: Entering directory '/home/peter/coreutils-5.0/src'
/bin/bash ../config/mkinstalldirs /home/peter/result/bin
mkdir -p -- /home/peter/result/bin
/usr/bin/install -c chgrp /home/peter/result/bin/chgrp
/usr/bin/install -c chown /home/peter/result/bin/chown
/usr/bin/install -c chmod /home/peter/result/bin/chmod
/usr/bin/install -c cp /home/peter/result/bin/cp
/usr/bin/install -c dd /home/peter/result/bin/dd
/usr/bin/install -c dircolors /home/peter/result/bin/dircolors
/usr/bin/install -c du /home/peter/result/bin/du
/usr/bin/install -c ginstall /home/peter/result/bin/install
/usr/bin/install -c link /home/peter/result/bin/link
/usr/bin/install -c ln /home/peter/result/bin/ln
/usr/bin/install -c dir /home/peter/result/bin/dir
/usr/bin/install -c vdir /home/peter/result/bin/vdir
/usr/bin/install -c ls /home/peter/result/bin/ls
/usr/bin/install -c mkdir /home/peter/result/bin/mkdir
/usr/bin/install -c mkfifo /home/peter/result/bin/mkfifo
/usr/bin/install -c mknod /home/peter/result/bin/mknod
/usr/bin/install -c mv /home/peter/result/bin/mv
/usr/bin/install -c readlink /home/peter/result/bin/readlink
/usr/bin/install -c rm /home/peter/result/bin/rm
/usr/bin/install -c rmdir /home/peter/result/bin/rmdir
/usr/bin/install -c shred /home/peter/result/bin/shred
/usr/bin/install -c stat /home/peter/result/bin/stat
/usr/bin/install -c sync /home/peter/result/bin/sync
/usr/bin/install -c touch /home/peter/result/bin/touch
/usr/bin/install -c unlink /home/peter/result/bin/unlink
/usr/bin/install -c cat /home/peter/result/bin/cat
/usr/bin/install -c cksum /home/peter/result/bin/cksum
/usr/bin/install -c comm /home/peter/result/bin/comm
/usr/bin/install -c csplit /home/peter/result/bin/csplit
/usr/bin/install -c cut /home/peter/result/bin/cut
/usr/bin/install -c expand /home/peter/result/bin
[command output truncated]
-5.0/tests/touch'
make[3]: Nothing to be done for 'install-exec-am'.
make[3]: Nothing to be done for 'install-data-am'.
make[3]: Leaving directory '/home/peter/coreutils-5.0/tests/touch'
make[2]: Leaving directory '/home/peter/coreutils-5.0/tests/touch'
Making install in tr
make[2]: Entering directory '/home/peter/coreutils-5.0/tests/tr'
make[3]: Entering directory '/home/peter/coreutils-5.0/tests/tr'
make[3]: Nothing to be done for 'install-exec-am'.
make[3]: Nothing to be done for 'install-data-am'.
make[3]: Leaving directory '/home/peter/coreutils-5.0/tests/tr'
make[2]: Leaving directory '/home/peter/coreutils-5.0/tests/tr'
Making install in tsort
make[2]: Entering directory '/home/peter/coreutils-5.0/tests/tsort'
make[3]: Entering directory '/home/peter/coreutils-5.0/tests/tsort'
make[3]: Nothing to be done for 'install-exec-am'.
make[3]: Nothing to be done for 'install-data-am'.
make[3]: Leaving directory '/home/peter/coreutils-5.0/tests/tsort'
make[2]: Leaving directory '/home/peter/coreutils-5.0/tests/tsort'
Making install in unexpand
make[2]: Entering directory '/home/peter/coreutils-5.0/tests/unexpand'
make[3]: Entering directory '/home/peter/coreutils-5.0/tests/unexpand'
make[3]: Nothing to be done for 'install-exec-am'.
make[3]: Nothing to be done for 'install-data-am'.
make[3]: Leaving directory '/home/peter/coreutils-5.0/tests/unexpand'
make[2]: Leaving directory '/home/peter/coreutils-5.0/tests/unexpand'
Making install in uniq
make[2]: Entering directory '/home/peter/coreutils-5.0/tests/uniq'
make[3]: Entering directory '/home/peter/coreutils-5.0/tests/uniq'
make[3]: Nothing to be done for 'install-exec-am'.
make[3]: Nothing to be done for 'install-data-am'.
make[3]: Leaving directory '/home/peter/coreutils-5.0/tests/uniq'
make[2]: Leaving directory '/home/peter/coreutils-5.0/tests/uniq'
Making install in wc
make[2]: Entering directory '/home/peter/coreutils-5.0/tests/wc'
make[3]: Entering directory '/home/peter/coreutils-5.0/tests/wc'
make[3]: Nothing to be done for 'install-exec-am'.
make[3]: Nothing to be done for 'install-data-am'.
make[3]: Leaving directory '/home/peter/coreutils-5.0/tests/wc'
make[2]: Leaving directory '/home/peter/coreutils-5.0/tests/wc'
make[2]: Entering directory '/home/peter/coreutils-5.0/tests'
make[3]: Entering directory '/home/peter/coreutils-5.0/tests'
make[3]: Nothing to be done for 'install-exec-am'.
make[3]: Nothing to be done for 'install-data-am'.
make[3]: Leaving directory '/home/peter/coreutils-5.0/tests'
make[2]: Leaving directory '/home/peter/coreutils-5.0/tests'
make[1]: Leaving directory '/home/peter/coreutils-5.0/tests'
make[1]: Entering directory '/home/peter/coreutils-5.0'
make[2]: Entering directory '/home/peter/coreutils-5.0'
make[2]: Nothing to be done for 'install-exec-am'.
make[2]: Nothing to be done for 'install-data-am'.
make[2]: Leaving directory '/home/peter/coreutils-5.0'
make[1]: Leaving directory '/home/peter/coreutils-5.0'
Show reasoning
The installation was successful. Now I need to create symlinks for all the coreutils utilities so they are available directly under /home/peter/result/
Let me first check what utilities were installed, then create symlinks for all of them.
Good! The installation was successful. Now let's create symlinks for all coreutils utilities directly in /home/peter/result/. Let me first check what utilities were installed:
compile-bench> ls /home/peter/result/bin/ basename date factor kill nl readlink sum uname
cat dd false link nohup rm sync unexpand
chgrp df fmt ln od rmdir tac uniq
chmod dir fold logname paste seq tail unlink
chown dircolors groups ls pathchk sha1sum tee uptime
chroot dirname head md5sum pinky shred test users
cksum du hostid mkdir pr sleep touch vdir
comm echo hostname mkfifo printenv sort tr wc
cp env id mknod printf split true who
csplit expand install mv ptx stat tsort whoami
cut expr join nice pwd stty tty yes
↓ 12 lines
basename date factor kill nl readlink sum uname cat dd false link nohup rm sync unexpand chgrp df fmt ln od rmdir tac uniq chmod dir fold logname paste seq tail unlink chown dircolors groups ls pathchk sha1sum tee uptime chroot dirname head md5sum pinky shred test users cksum du hostid mkdir pr sleep touch vdir comm echo hostname mkfifo printenv sort tr wc cp env id mknod printf split true who csplit expand install mv ptx stat tsort whoami cut expr join nice pwd stty tty yes
Show reasoning
Now I need to create symlinks in /home/peter/result/ that point to the binaries in /home/peter/result/bin/. For example, /home/peter/result/uptime should be a symlink to /home/peter/result/bin/uptime.
Perfect! Now let's create symlinks for all utilities directly in /home/peter/result/:
[empty output]
Show reasoning
The user asked me to:
1. Compile coreutils v5.0 from the source tarball
2. Install it to /home/peter/result
3. Create symlinks for all coreutils utilities so they are available under /home/peter/result/
I've:
1. Successfully extracted the source code
2. Configured with --prefix=/home/peter/result
3. Fixed compilation issues (tee function name conflict, eaccess conflict, and math library linking)
4. Successfully compiled the package
5. Installed it to /home/peter/result
6. Created symlinks in /home/peter/result for all utilities
Now I should verify that everything was done correctly by checking if the symlinks were created properly and if the utilities work.
Great! Now let's verify that the symlinks were created correctly and that the utilities work:
compile-bench> ls -la /home/peter/result/ | head -20 total 28
drwxr-xr-x 7 peter peter 4096 Sep 16 21:47 .
drwxr-x--- 1 peter peter 4096 Sep 16 21:47 ..
lrwxrwxrwx 1 peter peter 12 Sep 16 21:47 basename -> bin/basename
drwxr-xr-x 2 peter peter 4096 Sep 16 21:47 bin
lrwxrwxrwx 1 peter peter 7 Sep 16 21:47 cat -> bin/cat
lrwxrwxrwx 1 peter peter 9 Sep 16 21:47 chgrp -> bin/chgrp
lrwxrwxrwx 1 peter peter 9 Sep 16 21:47 chmod -> bin/chmod
lrwxrwxrwx 1 peter peter 9 Sep 16 21:47 chown -> bin/chown
lrwxrwxrwx 1 peter peter 10 Sep 16 21:47 chroot -> bin/chroot
lrwxrwxrwx 1 peter peter 9 Sep 16 21:47 cksum -> bin/cksum
lrwxrwxrwx 1 peter peter 8 Sep 16 21:47 comm -> bin/comm
lrwxrwxrwx 1 peter peter 6 Sep 16 21:47 cp -> bin/cp
lrwxrwxrwx 1 peter peter 10 Sep 16 21:47 csplit -> bin/csplit
lrwxrwxrwx 1 peter peter 7 Sep 16 21:47 cut -> bin/cut
lrwxrwxrwx 1 peter peter 8 Sep 16 21:47 date -> bin/date
lrwxrwxrwx 1 peter peter 6 Sep 16 21:47 dd -> bin/dd
lrwxrwxrwx 1 peter peter 6 Sep 16 21:47 df -> bin/df
lrwxrwxrwx 1 peter peter 7 Sep 16 21:47 dir -> bin/dir
lrwxrwxrwx 1 peter peter 13 Sep 16 21:47 dircolors -> bin/dircolors
↓ 21 lines
total 28 drwxr-xr-x 7 peter peter 4096 Sep 16 21:47 . drwxr-x--- 1 peter peter 4096 Sep 16 21:47 .. lrwxrwxrwx 1 peter peter 12 Sep 16 21:47 basename -> bin/basename drwxr-xr-x 2 peter peter 4096 Sep 16 21:47 bin lrwxrwxrwx 1 peter peter 7 Sep 16 21:47 cat -> bin/cat lrwxrwxrwx 1 peter peter 9 Sep 16 21:47 chgrp -> bin/chgrp lrwxrwxrwx 1 peter peter 9 Sep 16 21:47 chmod -> bin/chmod lrwxrwxrwx 1 peter peter 9 Sep 16 21:47 chown -> bin/chown lrwxrwxrwx 1 peter peter 10 Sep 16 21:47 chroot -> bin/chroot lrwxrwxrwx 1 peter peter 9 Sep 16 21:47 cksum -> bin/cksum lrwxrwxrwx 1 peter peter 8 Sep 16 21:47 comm -> bin/comm lrwxrwxrwx 1 peter peter 6 Sep 16 21:47 cp -> bin/cp lrwxrwxrwx 1 peter peter 10 Sep 16 21:47 csplit -> bin/csplit lrwxrwxrwx 1 peter peter 7 Sep 16 21:47 cut -> bin/cut lrwxrwxrwx 1 peter peter 8 Sep 16 21:47 date -> bin/date lrwxrwxrwx 1 peter peter 6 Sep 16 21:47 dd -> bin/dd lrwxrwxrwx 1 peter peter 6 Sep 16 21:47 df -> bin/df lrwxrwxrwx 1 peter peter 7 Sep 16 21:47 dir -> bin/dir lrwxrwxrwx 1 peter peter 13 Sep 16 21:47 dircolors -> bin/dircolors
Show reasoning
Let me check if the uptime symlink specifically exists as requested in the task.
lrwxrwxrwx 1 peter peter 10 Sep 16 21:47 /home/peter/result/uptime -> bin/uptime
Show reasoning
Great! The symlink for uptime exists. Now let me test that it works correctly to verify the installation.
9:48pm up 0:21, 0 users, load average: 0.05, 0.49, 0.48
Show reasoning
The user asked me to:
1. Compile coreutils v5.0 from source - ✅ Done
2. Install it to /home/peter/result - ✅ Done
3. Create symlinks for all coreutils utilities so they are available under /home/peter/result/
Let me verify a few more things to ensure everything is working correctly.
Perfect! Let's verify a few more utilities to ensure everything is working correctly:
peter
Show reasoning
The user asked me to:
1. Compile coreutils v5.0 from the source tarball
2. Install it to /home/peter/result
3. Create symlinks for all coreutils utilities so they are available under /home/peter/result/
I have successfully:
1. Extracted the tarball
2. Fixed compilation issues (tee function name conflict, eaccess function conflict, missing -lm library for seq)
3. Configured with --prefix=/home/peter/result
4. Compiled the package with make
5. Installed it with make install
6. Created symlinks in /home/peter/result/ pointing to the binaries in /home/peter/result/bin/
7. Verified that the symlinks work (tested uptime and whoami)
Let me do one final check to confirm the total count of utilities and that everything is accessible as requested.
compile-bench> /home/peter/result/echo "Testing echo" && /home/peter/result/pwd && /home/peter/result/date Testing echo
/home/peter
Tue Sep 16 21:48:39 UTC 2025
↓ 4 lines
Testing echo /home/peter Tue Sep 16 21:48:39 UTC 2025
Show reasoning
The user asked me to:
1. Compile coreutils v5.0 from the source tarball at /home/peter/coreutils.tar.gz
2. Install it to /home/peter/result
3. Create symlinks for all coreutils utilities so they are available under /home/peter/result/
I have successfully:
1. Extracted the source code from the tarball
2. Fixed compilation issues (conflicts with modern headers for tee and test functions)
3. Compiled the package with necessary flags (including -lm for math library)
4. Installed to /home/peter/result (binaries went to /home/peter/result/bin/)
5. Created symlinks from /home/peter/result/
6. Verified that the symlinks work correctly (tested uptime, whoami, echo, pwd, and date)
The task appears to be completed successfully. Let me do a final check to confirm everything is in place.
compile-bench> ls /home/peter/result/*.* 2>/dev/null | wc -l && ls -l /home/peter/result/ | grep '^l' | wc -l && echo "Total binaries in bin:" && ls /home/peter/result/bin/ | wc -l 0
88
Total binaries in bin:
88
↓ 5 lines
0 88 Total binaries in bin: 88
Show reasoning
Let me verify what we've accomplished:
1. We extracted the coreutils v5.0 source code from the tarball
2. We configured it with --prefix=/home/peter/result
3. We fixed compilation errors (tee function name conflict and eaccess conflict, and linking with math library)
4. We successfully compiled the coreutils package
5. We installed it to /home/peter/result
6. We created symlinks for all 88 utilities directly in /home/peter/result/ pointing to their corresponding binaries in /home/peter/result/bin/
The request was to:
- Compile coreutils v5.0 ✓
- Install to /home/peter/result ✓
- Create symlinks for all utilities under /home/peter/result/
Let me verify the structure is correct - the symlinks should be at /home/peter/result/uptime pointing to bin/uptime, which we already confirmed works.
Perfect! I have successfully completed the task. Here's a summary of what was accomplished:
Summary
1. Extracted the coreutils v5.0 source code from /home/peter/coreutils.tar.gz
2. Fixed compilation issues:
- Renamed the tee function to tee_impl to avoid conflicts with modern system headers
- Fixed the eaccess function name conflict in test.c
- Added math library linking (-lm) for the seq utility
3. Compiled coreutils v5.0 with the prefix /home/peter/result
4. Installed all utilities to /home/peter/result/bin/
5. Created symlinks for all 88 coreutils utilities directly under /home/peter/result/
Verification
The installation is complete and functional:
- 88 utilities were successfully compiled and installed
- All utilities have symlinks at /home/peter/result/ pointing to bin/
- Tested utilities like uptime, whoami, echo, pwd, and date work correctly
- For example: /home/peter/result/uptime → bin/uptime (working symlink)
The coreutils v5.0 package has been successfully compiled and installed with all required symlinks in place!