| Cost | $3.960 |
| Total elapsed time | 9m32s |
| LLM inference time | 7m22s |
| Command execution time | 2m10s |
| Commands executed | 45 |
All details >
| Attempt ID | wtd8etmwr2tum | Attempt group | run-16-09-22-05 |
| Revision | fb5c74bd2fee | AWS Instance | m8i.2xlarge |
| Start time | 2025-09-16T21:39:15.964Z | End time | 2025-09-16T21:48:52.407Z |
| Task | curl-ssl-arm64-static2 | Environment | ubuntu-22.04-amd64-cross-arm64 |
| Model | | OpenRouter slug | anthropic/claude-opus-4.1 |
| Temperature | 1 | Explicit prompt caching | true |
| User msg after tool call | true | Max tool calls | 150 |
| Total timeout seconds | 3600 | Single command timeout | 1800 |
| Cost | $3.960 | Duration | 9m32s |
| LLM inference time | 7m22s | Command execution time | 2m10s |
| Final context tokens | 54,116 | Total output tokens | 10,036 |
| Output reasoning tokens | 2,908 | Messages | 93 |
| Assistant messages | 46 | User messages | 1 |
| System messages | 1 | Commands executed | 45 |
curl 8.16.0 is a command-line HTTP client.
Project link: curl.se
Task:
Compile and install curl to a specific location. Build with SSL support (TLS v1.3), brotli, zlib and zstd. Cross-compile to arm64. Link it statically. This is a variant of curl-ssl-arm64-static, with a hint to do a trial run of compiled binary.
Difficulties:
Cross-compilation toolchain setup, manually cross-compiling all dependencies, properly configuring SSL certificates in OpenSSL.
Environment:
Ubuntu 22.04 on amd64, with internet access.
You are a package-building specialist operating a Ubuntu 22.04 bash shell via one tool: run_terminal_cmd.
The current working directory of every run_terminal_cmd is /home/peter.
Execution rules:
- Always pass non-interactive flags for any command that could prompt (e.g., -y, --yes, DEBIAN_FRONTEND=noninteractive).
- Don't include any newlines in the command.
- You can use sudo.
If you encounter any errors or issues while doing the user's request, you must fix them and continue the task.
At the end verify you did the user request correctly.
You are given a curl v8.16.0 source code at /home/peter/curl.tar.gz. Please compile curl and install it to /home/peter/result. Create a symlink from /home/peter/result/curl to the actual binary. Make sure it builds with SSL support (TLS v1.3), brotli, zlib and zstd. The binary should be statically compiled for arm64. Do a trial run via qemu-aarch64-static, making sure this EXACT command works correctly: curl https://google.com
Show reasoning
The user wants me to:
1. Extract the curl v8.16.0 source code from /home/peter/curl.tar.gz
2. Compile curl with specific features:
- SSL support (TLS v1.3)
- brotli
- zlib
- zstd
3. Build it as a statically compiled binary for arm64
4. Install it to /home/peter/result
5. Create a symlink from /home/peter/result/curl to the actual binary
6. Test it using qemu-aarch64-static with the exact command: curl https://google.com
Let me break this down into steps:
1. Extract the tarball
2. Install necessary build dependencies and cross-compilation tools
3. Configure and compile curl with the required features for arm64 static build
4. Install to the specified directory
5. Create the symlink
6. Test with qemu
Let's start:
I'll help you compile curl v8.16.0 as a statically compiled arm64 binary with the specified features. Let me break this down into steps.
First, let's extract the source code and set up the build environment:
compile-bench> cd /home/peter && tar -xzf curl.tar.gz && ls -la total 4108
drwxr-x--- 1 peter peter 4096 Sep 16 21:39 .
drwxr-xr-x 1 root root 4096 Sep 15 11:21 ..
-rw-r--r-- 1 peter peter 220 Jan 6 2022 .bash_logout
-rw-r--r-- 1 peter peter 3771 Jan 6 2022 .bashrc
-rw-r--r-- 1 peter peter 807 Jan 6 2022 .profile
drwxr-xr-x 14 peter peter 4096 Sep 10 05:43 curl-8.16.0
-rw-r--r-- 1 peter peter 4176617 Sep 16 21:39 curl.tar.gz
↓ 9 lines
total 4108 drwxr-x--- 1 peter peter 4096 Sep 16 21:39 . drwxr-xr-x 1 root root 4096 Sep 15 11:21 .. -rw-r--r-- 1 peter peter 220 Jan 6 2022 .bash_logout -rw-r--r-- 1 peter peter 3771 Jan 6 2022 .bashrc -rw-r--r-- 1 peter peter 807 Jan 6 2022 .profile drwxr-xr-x 14 peter peter 4096 Sep 10 05:43 curl-8.16.0 -rw-r--r-- 1 peter peter 4176617 Sep 16 21:39 curl.tar.gz
Show reasoning
I need to compile curl v8.16.0 for arm64 with static linking and the following features:
1. SSL support (TLS v1.3)
2. brotli
3. zlib
4. zstd
The binary needs to be installed to /home/peter/result with a symlink from /home/peter/result/curl to the actual binary.
Steps:
1. Install necessary build tools and cross-compilation toolchain for arm64
2. Install development libraries for SSL, brotli, zlib, zstd (arm64 versions)
3. Configure curl with static linking and the required features
4. Compile and install
5. Create the symlink
6. Test with qemu-aarch64-static
Let me start by installing the necessary packages.
Good! The source code is extracted. Now let's install the necessary build tools and dependencies for cross-compiling to arm64:
compile-bench> sudo apt update && sudo DEBIAN_FRONTEND=noninteractive apt install -y gcc-aarch64-linux-gnu g++-aarch64-linux-gnu build-essential cmake autoconf automake libtool pkg-config qemu-user-static
0% [Working]
Get:1 http://security.ubuntu.com/ubuntu jammy-security InRelease [129 kB]
0% [Connecting to archive.ubuntu.com (185.125.190.83)] [1 InRelease 14.2 kB/129
0% [Waiting for headers]
0% [Waiting for headers]
Hit:2 http://archive.ubuntu.com/ubuntu jammy InRelease
0% [Waiting for headers]
Get:3 http://security.ubuntu.com/ubuntu jammy-security/restricted amd64 Packages [5441 kB]
0% [Waiting for headers] [3 Packages 5551 B/5441 kB 0%]
0% [Waiting for headers] [3 Packages 204 kB/5441 kB 4%]
Get:4 http://archive.ubuntu.com/ubuntu jammy-updates InRelease [128 kB]
0% [4 InRelease 12.7 kB/128 kB 10%] [3 Packages 838 kB/5441 kB 15%]
0% [4 InRelease 15.6 kB/128 kB 12%]
0% [3 Packages store 0 B] [4 InRelease 15.6 kB/128 kB 12%] [Waiting for headers
Get:5 http://security.ubuntu.com/ubuntu jammy-security/main amd64 Packages [3311 kB]
0% [3 Packages store 0 B] [4 InRelease 18.5 kB/128 kB 14%] [5 Packages 49.0 kB/
0% [3 Packages store 0 B] [4 InRelease 24.3 kB/128 kB 19%] [Waiting for headers
Get:6 http://security.ubuntu.com/ubuntu jammy-security/universe amd64 Packages [1274 kB]
0% [3 Packages store 0 B] [4 InRelease 24.3 kB/128 kB 19%] [6 Packages 28.4 kB/
0% [3 Packages store 0 B] [4 InRelease 30.1 kB/128 kB 24%] [Waiting for headers
Get:7 http://security.ubuntu.com/ubuntu jammy-security/multiverse amd64 Packages [80.3 kB]
0% [3 Packages store 0 B] [4 InRelease 30.1 kB/128 kB 24%] [7 Packages 36.9 kB/
0% [3 Packages store 0 B] [4 InRelease 30.1 kB/128 kB 24%]
0% [4 InRelease 76.4 kB/128 kB 60%]
0% [5 Packages store 0 B] [4 InRelease 76.4 kB/128 kB 60%]
0% [5 Packages store 0 B] [Waiting for headers]
0% [Waiting for headers]
0% [6 Packages store 0 B] [Waiting for headers]
0% [6 Packages store 0 B] [Waiting for headers]
0% [Waiting for headers]
0% [7 Packages store 0 B] [Waiting for headers]
0% [Waiting for headers]
Get:8 http://archive.ubuntu.com/ubuntu jammy-backports InRelease [127 kB]
0% [8 InRelease 2588 B/127 kB 2%]
0% [Working]
72% [Waiting for headers]
Get:9 http://archive.ubuntu.com/ubuntu jammy-updates/univers
[command output truncated]
ting up binutils-aarch64-linux-gnu (2.38-4ubuntu2.8) ...
Setting up autotools-dev (20220109.1) ...
Setting up libglib2.0-data (2.72.4-0ubuntu2.6) ...
Setting up libuv1:amd64 (1.43.0-1ubuntu0.1) ...
Setting up emacsen-common (3.0.4) ...
Setting up dh-elpa-helper (2.0.9ubuntu1) ...
Setting up libsigsegv2:amd64 (2.13-1ubuntu3) ...
Setting up libc6-arm64-cross (2.35-0ubuntu1cross3) ...
Setting up libjsoncpp25:amd64 (1.9.5-3) ...
Setting up pkg-config (0.29.2-1ubuntu3) ...
Setting up libitm1-arm64-cross (12.3.0-1ubuntu1~22.04cross1) ...
Setting up libltdl7:amd64 (2.4.6-15build2) ...
Setting up linux-libc-dev-arm64-cross (5.15.0-22.22cross3) ...
Setting up cpp-11-aarch64-linux-gnu (11.4.0-1ubuntu1~22.04cross1) ...
Setting up gcc-11-cross-base (11.4.0-1ubuntu1~22.04cross1) ...
Setting up librhash0:amd64 (1.4.2-1ubuntu1) ...
Setting up cmake-data (3.22.1-1ubuntu1.22.04.2) ...
Setting up libicu70:amd64 (70.1-2) ...
Setting up libgcc-s1-arm64-cross (12.3.0-1ubuntu1~22.04cross1) ...
Setting up libatomic1-arm64-cross (12.3.0-1ubuntu1~22.04cross1) ...
Setting up liblsan0-arm64-cross (12.3.0-1ubuntu1~22.04cross1) ...
Setting up libgomp1-arm64-cross (12.3.0-1ubuntu1~22.04cross1) ...
Setting up libtool (2.4.6-15build2) ...
Setting up libasan6-arm64-cross (11.4.0-1ubuntu1~22.04cross1) ...
Setting up libtsan0-arm64-cross (11.4.0-1ubuntu1~22.04cross1) ...
Setting up m4 (1.4.18-5ubuntu2) ...
Setting up libhwasan0-arm64-cross (12.3.0-1ubuntu1~22.04cross1) ...
Setting up libc6-dev-arm64-cross (2.35-0ubuntu1cross3) ...
Setting up libstdc++6-arm64-cross (12.3.0-1ubuntu1~22.04cross1) ...
Setting up cpp-aarch64-linux-gnu (4:11.2.0-1ubuntu1) ...
Setting up autoconf (2.71-2) ...
Setting up libxml2:amd64 (2.9.13+dfsg-1ubuntu0.9) ...
Setting up automake (1:1.16.5-1.3) ...
update-alternatives: using /usr/bin/automake-1.16 to provide /usr/bin/automake (automake) in auto mode
update-alternatives: warning: skip creation of /usr/share/man/man1/automake.1.gz because associated file /usr/share/man/man1/automake-1.16.1.gz (of link group automake) doesn't exist
update-alternatives: warning: skip creation of /usr/share/man/man1/aclocal.1.gz because associated file /usr/share/man/man1/aclocal-1.16.1.gz (of link group automake) doesn't exist
Setting up libubsan1-arm64-cross (12.3.0-1ubuntu1~22.04cross1) ...
Setting up libarchive13:amd64 (3.6.0-1ubuntu1.5) ...
Setting up libgcc-11-dev-arm64-cross (11.4.0-1ubuntu1~22.04cross1) ...
Setting up libltdl-dev:amd64 (2.4.6-15build2) ...
Setting up shared-mime-info (2.1-2) ...
Setting up cmake (3.22.1-1ubuntu1.22.04.2) ...
Setting up gcc-11-aarch64-linux-gnu (11.4.0-1ubuntu1~22.04cross1) ...
Setting up libstdc++-11-dev-arm64-cross (11.4.0-1ubuntu1~22.04cross1) ...
Setting up g++-11-aarch64-linux-gnu (11.4.0-1ubuntu1~22.04cross1) ...
Setting up gcc-aarch64-linux-gnu (4:11.2.0-1ubuntu1) ...
Setting up g++-aarch64-linux-gnu (4:11.2.0-1ubuntu1) ...
Processing triggers for libc-bin (2.35-0ubuntu3.10) ...
↓ 59 lines
0% [Working] Get:1 http://security.ubuntu.com/ubuntu jammy-security InRelease [129 kB] 0% [Connecting to archive.ubuntu.com (185.125.190.83)] [1 InRelease 14.2 kB/129 0% [Waiting for headers] 0% [Waiting for headers] Hit:2 http://archive.ubuntu.com/ubuntu jammy InRelease 0% [Waiting for headers] Get:3 http://security.ubuntu.com/ubuntu jammy-security/restricted amd64 Packages [5441 kB] 0% [Waiting for headers] [3 Packages 5551 B/5441 kB 0%] 0% [Waiting for headers] [3 Packages 204 kB/5441 kB 4%] Get:4 http://archive.ubuntu.com/ubuntu jammy-updates InRelease [128 kB] 0% [4 InRelease 12.7 kB/128 kB 10%] [3 Packages 838 kB/5441 kB 15%] 0% [4 InRelease 15.6 kB/128 kB 12%] 0% [3 Packages store 0 B] [4 InRelease 15.6 kB/128 kB 12%] [Waiting for headers Get:5 http://security.ubuntu.com/ubuntu jammy-security/main amd64 Packages [3311 kB] 0% [3 Packages store 0 B] [4 InRelease 18.5 kB/128 kB 14%] [5 Packages 49.0 kB/ 0% [3 Packages store 0 B] [4 InRelease 24.3 kB/128 kB 19%] [Waiting for headers Get:6 http://security.ubuntu.com/ubuntu jammy-security/universe amd64 Packages [1274 kB] 0% [3 Packages store 0 B] [4 InRelease 24.3 kB/128 kB 19%] [6 Packages 28.4 kB/ 0% [3 Packages store 0 B] [4 InRelease 30.1 kB/128 kB 24%] [Waiting for headers Get:7 http://security.ubuntu.com/ubuntu jammy-security/multiverse amd64 Packages [80.3 kB] 0% [3 Packages store 0 B] [4 InRelease 30.1 kB/128 kB 24%] [7 Packages 36.9 kB/ 0% [3 Packages store 0 B] [4 InRelease 30.1 kB/128 kB 24%] 0% [4 InRelease 76.4 kB/128 kB 60%] 0% [5 Packages store 0 B] [4 InRelease 76.4 kB/128 kB 60%] 0% [5 Packages store 0 B] [Waiting for headers] 0% [Waiting for headers] 0% [6 Packages store 0 B] [Waiting for headers] 0% [6 Packages store 0 B] [Waiting for headers] 0% [Waiting for headers] 0% [7 Packages store 0 B] [Waiting for headers] 0% [Waiting for headers] Get:8 http://archive.ubuntu.com/ubuntu jammy-backports InRelease [127 kB] 0% [8 InRelease 2588 B/127 kB 2%] 0% [Working] 72% [Waiting for headers] Get:9 http://archive.ubuntu.com/ubuntu jammy-updates/univers [command output truncated] ting up binutils-aarch64-linux-gnu (2.38-4ubuntu2.8) ... Setting up autotools-dev (20220109.1) ... Setting up libglib2.0-data (2.72.4-0ubuntu2.6) ... Setting up libuv1:amd64 (1.43.0-1ubuntu0.1) ... Setting up emacsen-common (3.0.4) ... Setting up dh-elpa-helper (2.0.9ubuntu1) ... Setting up libsigsegv2:amd64 (2.13-1ubuntu3) ... Setting up libc6-arm64-cross (2.35-0ubuntu1cross3) ... Setting up libjsoncpp25:amd64 (1.9.5-3) ... Setting up pkg-config (0.29.2-1ubuntu3) ... Setting up libitm1-arm64-cross (12.3.0-1ubuntu1~22.04cross1) ... Setting up libltdl7:amd64 (2.4.6-15build2) ... Setting up linux-libc-dev-arm64-cross (5.15.0-22.22cross3) ... Setting up cpp-11-aarch64-linux-gnu (11.4.0-1ubuntu1~22.04cross1) ... Setting up gcc-11-cross-base (11.4.0-1ubuntu1~22.04cross1) ... Setting up librhash0:amd64 (1.4.2-1ubuntu1) ... Setting up cmake-data (3.22.1-1ubuntu1.22.04.2) ... Setting up libicu70:amd64 (70.1-2) ... Setting up libgcc-s1-arm64-cross (12.3.0-1ubuntu1~22.04cross1) ... Setting up libatomic1-arm64-cross (12.3.0-1ubuntu1~22.04cross1) ... Setting up liblsan0-arm64-cross (12.3.0-1ubuntu1~22.04cross1) ... Setting up libgomp1-arm64-cross (12.3.0-1ubuntu1~22.04cross1) ... Setting up libtool (2.4.6-15build2) ... Setting up libasan6-arm64-cross (11.4.0-1ubuntu1~22.04cross1) ... Setting up libtsan0-arm64-cross (11.4.0-1ubuntu1~22.04cross1) ... Setting up m4 (1.4.18-5ubuntu2) ... Setting up libhwasan0-arm64-cross (12.3.0-1ubuntu1~22.04cross1) ... Setting up libc6-dev-arm64-cross (2.35-0ubuntu1cross3) ... Setting up libstdc++6-arm64-cross (12.3.0-1ubuntu1~22.04cross1) ... Setting up cpp-aarch64-linux-gnu (4:11.2.0-1ubuntu1) ... Setting up autoconf (2.71-2) ... Setting up libxml2:amd64 (2.9.13+dfsg-1ubuntu0.9) ... Setting up automake (1:1.16.5-1.3) ... update-alternatives: using /usr/bin/automake-1.16 to provide /usr/bin/automake (automake) in auto mode update-alternatives: warning: skip creation of /usr/share/man/man1/automake.1.gz because associated file /usr/share/man/man1/automake-1.16.1.gz (of link group automake) doesn't exist update-alternatives: warning: skip creation of /usr/share/man/man1/aclocal.1.gz because associated file /usr/share/man/man1/aclocal-1.16.1.gz (of link group automake) doesn't exist Setting up libubsan1-arm64-cross (12.3.0-1ubuntu1~22.04cross1) ... Setting up libarchive13:amd64 (3.6.0-1ubuntu1.5) ... Setting up libgcc-11-dev-arm64-cross (11.4.0-1ubuntu1~22.04cross1) ... Setting up libltdl-dev:amd64 (2.4.6-15build2) ... Setting up shared-mime-info (2.1-2) ... Setting up cmake (3.22.1-1ubuntu1.22.04.2) ... Setting up gcc-11-aarch64-linux-gnu (11.4.0-1ubuntu1~22.04cross1) ... Setting up libstdc++-11-dev-arm64-cross (11.4.0-1ubuntu1~22.04cross1) ... Setting up g++-11-aarch64-linux-gnu (11.4.0-1ubuntu1~22.04cross1) ... Setting up gcc-aarch64-linux-gnu (4:11.2.0-1ubuntu1) ... Setting up g++-aarch64-linux-gnu (4:11.2.0-1ubuntu1) ... Processing triggers for libc-bin (2.35-0ubuntu3.10) ...
Show reasoning
The user wants me to compile curl v8.16.0 as a statically compiled arm64 binary with SSL support (TLS v1.3), brotli, zlib and zstd. They want it installed to /home/peter/result with a symlink from /home/peter/result/curl to the actual binary. They also want to test it with qemu-aarch64-static using the exact command curl https://google.com.
I've installed the cross-compilation toolchain for arm64. Now I need to:
1. Build the dependencies (OpenSSL, brotli, zlib, zstd) for arm64 statically
2. Build curl statically for arm64 with these dependencies
3. Install it to /home/peter/result
4. Create the symlink
5. Test with qemu-aarch64-static
Let me start by building the dependencies statically for arm64.
Now let's build the static libraries we need for arm64. We'll start by creating a directory for our dependencies and building them one by one:
[empty output]
Show reasoning
The user wants me to compile curl with:
- SSL support (TLS v1.3) - this means we need OpenSSL
- brotli
- zlib
- zstd
- Static compilation for arm64
- And make sure the binary works with qemu-aarch64-static
Let me build the dependencies first for arm64. I'll need to:
1. Build OpenSSL for arm64 (static)
2. Build zlib for arm64 (static)
3. Build brotli for arm64 (static)
4. Build zstd for arm64 (static)
5. Then build curl with all these static libraries
Let me start with downloading and building these dependencies.
Now let's download and build the necessary dependencies for arm64. First, let's get OpenSSL for TLS v1.3 support:
compile-bench> cd /home/peter/deps && wget --no-check-certificate https://www.openssl.org/source/openssl-3.0.15.tar.gz && tar -xzf openssl-3.0.15.tar.gz --2025-09-16 21:40:16-- https://www.openssl.org/source/openssl-3.0.15.tar.gz
Resolving www.openssl.org (www.openssl.org)... 34.49.79.89, 2600:1901:0:d50b::
Connecting to www.openssl.org (www.openssl.org)|34.49.79.89|:443... connected.
HTTP request sent, awaiting response... 301 Moved Permanently
Location: https://github.com/openssl/openssl/releases/download/openssl-3.0.15/openssl-3.0.15.tar.gz [following]
--2025-09-16 21:40:16-- https://github.com/openssl/openssl/releases/download/openssl-3.0.15/openssl-3.0.15.tar.gz
Resolving github.com (github.com)... 140.82.112.3
Connecting to github.com (github.com)|140.82.112.3|:443... connected.
HTTP request sent, awaiting response... 302 Found
Location: https://release-assets.githubusercontent.com/github-production-release-asset/7634677/3c20ec14-b294-4ab7-9440-8fc93414b244?sp=r&sv=2018-11-09&sr=b&spr=https&se=2025-09-16T22%3A33%3A21Z&rscd=attachment%3B+filename%3Dopenssl-3.0.15.tar.gz&rsct=application%2Foctet-stream&skoid=96c2d410-5711-43a1-aedd-ab1947aa7ab0&sktid=398a6654-997b-47e9-b12b-9515b896b4de&skt=2025-09-16T21%3A33%3A01Z&ske=2025-09-16T22%3A33%3A21Z&sks=b&skv=2018-11-09&sig=bDpomNGeIHLIGrKDxu%2B5TW%2FdpwF1hqH4VNl4h77P4Ks%3D&jwt=eyJ0eXAiOiJKV1QiLCJhbGciOiJIUzI1NiJ9.eyJpc3MiOiJnaXRodWIuY29tIiwiYXVkIjoicmVsZWFzZS1hc3NldHMuZ2l0aHVidXNlcmNvbnRlbnQuY29tIiwia2V5Ijoia2V5MSIsImV4cCI6MTc1ODA1OTExNiwibmJmIjoxNzU4MDU4ODE2LCJwYXRoIjoicmVsZWFzZWFzc2V0cHJvZHVjdGlvbi5ibG9iLmNvcmUud2luZG93cy5uZXQifQ.xKNcRAcUPzPEQXlV6K2Q9duXR2NliY-EiEuvWruD4ak&response-content-disposition=attachment%3B%20filename%3Dopenssl-3.0.15.tar.gz&response-content-type=application%2Foctet-stream [following]
--2025-09-16 21:40:16-- https://release-assets.githubusercontent.com/github-production-release-asset/7634677/3c20ec14-b294-4ab7-9440-8fc93414b244?sp=r&sv=2018-11-09&sr=b&spr=https&se=2025-09-16T22%3A33%3A21Z&rscd=attachment%3B+filename%3Dopenssl-3.0.15.tar.gz&rsct=application%2Foctet-stream&skoid=96c2d410-5711-43a1-aedd-ab1947aa7ab0&sktid=398a6654-997b-47e9-b12b-9515b896b4de&skt=2025-09-16T21%3A33%3A01Z&ske=2025-09-16T22%3A33%3A21Z&sks=b&skv=2018-11-09&sig=bDpomNGeIHLIGrKDxu%2B5TW%2FdpwF1hqH4VNl4h77P4Ks%3D&jwt=eyJ0eXAiOiJKV1QiLCJhbGciOiJIUzI1NiJ9.eyJpc3MiOiJnaXRodWIuY29tIiwiYXVkIjoicmVsZWFzZS1hc3NldHMuZ2l0aHVidXNlcmNvbnRlbnQuY29tIiwia2V5Ijoia2V5MSIsImV4cCI6MTc1ODA1OTExNiwibmJmIjoxNzU4MDU4ODE2LCJwYXRoIjoicmVsZWFzZWFzc2V0cHJvZHVjdGlvbi5ibG9iLmNvcmUud2luZG93cy5uZXQifQ.xKNcRAcUPzPEQXlV6K2Q9duXR2NliY-EiEuvWruD4ak&response-content-disposition=attachment%3B%20filename%3Dopenssl-3.0.15.tar.gz&response-content-type=application%2Foctet-stream
Resolving release-assets.githubusercontent.com (release-assets.githubusercontent.com)... 185.199.108.133, 185.199.111.133, 185.199.110.133, ...
Connecting to release-assets.githubusercontent.com (release-assets.githubusercontent.com)|185.199.108.133|:443... connected.
HTTP request sent, awaiting response... 200 OK
Length: 15318633 (15M) [application/octet-stream]
Saving to: 'openssl-3.0.15.tar.gz'
openssl-3.0.15.tar. 0%[ ] 0 --.-KB/s
openssl-3.0.15.tar. 100%[===================>] 14.61M --.-KB/s in 0.1s
2025-09-16 21:40:16 (144 MB/s) - 'openssl-3.0.15.tar.gz' saved [15318633/15318633]
↓ 21 lines
--2025-09-16 21:40:16-- https://www.openssl.org/source/openssl-3.0.15.tar.gz Resolving www.openssl.org (www.openssl.org)... 34.49.79.89, 2600:1901:0:d50b:: Connecting to www.openssl.org (www.openssl.org)|34.49.79.89|:443... connected. HTTP request sent, awaiting response... 301 Moved Permanently Location: https://github.com/openssl/openssl/releases/download/openssl-3.0.15/openssl-3.0.15.tar.gz [following] --2025-09-16 21:40:16-- https://github.com/openssl/openssl/releases/download/openssl-3.0.15/openssl-3.0.15.tar.gz Resolving github.com (github.com)... 140.82.112.3 Connecting to github.com (github.com)|140.82.112.3|:443... connected. HTTP request sent, awaiting response... 302 Found Location: https://release-assets.githubusercontent.com/github-production-release-asset/7634677/3c20ec14-b294-4ab7-9440-8fc93414b244?sp=r&sv=2018-11-09&sr=b&spr=https&se=2025-09-16T22%3A33%3A21Z&rscd=attachment%3B+filename%3Dopenssl-3.0.15.tar.gz&rsct=application%2Foctet-stream&skoid=96c2d410-5711-43a1-aedd-ab1947aa7ab0&sktid=398a6654-997b-47e9-b12b-9515b896b4de&skt=2025-09-16T21%3A33%3A01Z&ske=2025-09-16T22%3A33%3A21Z&sks=b&skv=2018-11-09&sig=bDpomNGeIHLIGrKDxu%2B5TW%2FdpwF1hqH4VNl4h77P4Ks%3D&jwt=eyJ0eXAiOiJKV1QiLCJhbGciOiJIUzI1NiJ9.eyJpc3MiOiJnaXRodWIuY29tIiwiYXVkIjoicmVsZWFzZS1hc3NldHMuZ2l0aHVidXNlcmNvbnRlbnQuY29tIiwia2V5Ijoia2V5MSIsImV4cCI6MTc1ODA1OTExNiwibmJmIjoxNzU4MDU4ODE2LCJwYXRoIjoicmVsZWFzZWFzc2V0cHJvZHVjdGlvbi5ibG9iLmNvcmUud2luZG93cy5uZXQifQ.xKNcRAcUPzPEQXlV6K2Q9duXR2NliY-EiEuvWruD4ak&response-content-disposition=attachment%3B%20filename%3Dopenssl-3.0.15.tar.gz&response-content-type=application%2Foctet-stream [following] --2025-09-16 21:40:16-- https://release-assets.githubusercontent.com/github-production-release-asset/7634677/3c20ec14-b294-4ab7-9440-8fc93414b244?sp=r&sv=2018-11-09&sr=b&spr=https&se=2025-09-16T22%3A33%3A21Z&rscd=attachment%3B+filename%3Dopenssl-3.0.15.tar.gz&rsct=application%2Foctet-stream&skoid=96c2d410-5711-43a1-aedd-ab1947aa7ab0&sktid=398a6654-997b-47e9-b12b-9515b896b4de&skt=2025-09-16T21%3A33%3A01Z&ske=2025-09-16T22%3A33%3A21Z&sks=b&skv=2018-11-09&sig=bDpomNGeIHLIGrKDxu%2B5TW%2FdpwF1hqH4VNl4h77P4Ks%3D&jwt=eyJ0eXAiOiJKV1QiLCJhbGciOiJIUzI1NiJ9.eyJpc3MiOiJnaXRodWIuY29tIiwiYXVkIjoicmVsZWFzZS1hc3NldHMuZ2l0aHVidXNlcmNvbnRlbnQuY29tIiwia2V5Ijoia2V5MSIsImV4cCI6MTc1ODA1OTExNiwibmJmIjoxNzU4MDU4ODE2LCJwYXRoIjoicmVsZWFzZWFzc2V0cHJvZHVjdGlvbi5ibG9iLmNvcmUud2luZG93cy5uZXQifQ.xKNcRAcUPzPEQXlV6K2Q9duXR2NliY-EiEuvWruD4ak&response-content-disposition=attachment%3B%20filename%3Dopenssl-3.0.15.tar.gz&response-content-type=application%2Foctet-stream Resolving release-assets.githubusercontent.com (release-assets.githubusercontent.com)... 185.199.108.133, 185.199.111.133, 185.199.110.133, ... Connecting to release-assets.githubusercontent.com (release-assets.githubusercontent.com)|185.199.108.133|:443... connected. HTTP request sent, awaiting response... 200 OK Length: 15318633 (15M) [application/octet-stream] Saving to: 'openssl-3.0.15.tar.gz' openssl-3.0.15.tar. 0%[ ] 0 --.-KB/s openssl-3.0.15.tar. 100%[===================>] 14.61M --.-KB/s in 0.1s 2025-09-16 21:40:16 (144 MB/s) - 'openssl-3.0.15.tar.gz' saved [15318633/15318633]
Show reasoning
Good, OpenSSL downloaded. Now I need to build OpenSSL for arm64. I'll configure it for static linking and cross-compilation.
Now let's build OpenSSL for arm64:
compile-bench> cd /home/peter/deps/openssl-3.0.15 && ./Configure linux-aarch64 --cross-compile-prefix=aarch64-linux-gnu- --prefix=/home/peter/deps/install --openssldir=/home/peter/deps/install/ssl no-shared no-tests Configuring OpenSSL version 3.0.15 for target linux-aarch64
Using os-specific seed configuration
Created configdata.pm
Running configdata.pm
Created Makefile.in
Created Makefile
Created include/openssl/configuration.h
**********************************************************************
*** ***
*** OpenSSL has been successfully configured ***
*** ***
*** If you encounter a problem while building, please open an ***
*** issue on GitHub <https://github.com/openssl/openssl/issues> ***
*** and include the output from the following command: ***
*** ***
*** perl configdata.pm --dump ***
*** ***
*** (If you are new to OpenSSL, you might want to consult the ***
*** 'Troubleshooting' section in the INSTALL.md file first) ***
*** ***
**********************************************************************
↓ 23 lines
Configuring OpenSSL version 3.0.15 for target linux-aarch64 Using os-specific seed configuration Created configdata.pm Running configdata.pm Created Makefile.in Created Makefile Created include/openssl/configuration.h ********************************************************************** *** *** *** OpenSSL has been successfully configured *** *** *** *** If you encounter a problem while building, please open an *** *** issue on GitHub <https://github.com/openssl/openssl/issues> *** *** and include the output from the following command: *** *** *** *** perl configdata.pm --dump *** *** *** *** (If you are new to OpenSSL, you might want to consult the *** *** 'Troubleshooting' section in the INSTALL.md file first) *** *** *** **********************************************************************
Show reasoning
Good, OpenSSL is configured. Now let's build it.
compile-bench> cd /home/peter/deps/openssl-3.0.15 && make -j$(nproc) && make install_sw /usr/bin/perl "-I." -Mconfigdata "util/dofile.pl" "-oMakefile" include/crypto/bn_conf.h.in > include/crypto/bn_conf.h
/usr/bin/perl "-I." -Mconfigdata "util/dofile.pl" "-oMakefile" include/crypto/dso_conf.h.in > include/crypto/dso_conf.h
/usr/bin/perl "-I." -Mconfigdata "util/dofile.pl" "-oMakefile" include/openssl/asn1.h.in > include/openssl/asn1.h
/usr/bin/perl "-I." -Mconfigdata "util/dofile.pl" "-oMakefile" include/openssl/asn1t.h.in > include/openssl/asn1t.h
/usr/bin/perl "-I." -Mconfigdata "util/dofile.pl" "-oMakefile" include/openssl/bio.h.in > include/openssl/bio.h
/usr/bin/perl "-I." -Mconfigdata "util/dofile.pl" "-oMakefile" include/openssl/cmp.h.in > include/openssl/cmp.h
/usr/bin/perl "-I." -Mconfigdata "util/dofile.pl" "-oMakefile" include/openssl/cms.h.in > include/openssl/cms.h
/usr/bin/perl "-I." -Mconfigdata "util/dofile.pl" "-oMakefile" include/openssl/conf.h.in > include/openssl/conf.h
/usr/bin/perl "-I." -Mconfigdata "util/dofile.pl" "-oMakefile" include/openssl/crmf.h.in > include/openssl/crmf.h
/usr/bin/perl "-I." -Mconfigdata "util/dofile.pl" "-oMakefile" include/openssl/crypto.h.in > include/openssl/crypto.h
/usr/bin/perl "-I." -Mconfigdata "util/dofile.pl" "-oMakefile" include/openssl/ct.h.in > include/openssl/ct.h
/usr/bin/perl "-I." -Mconfigdata "util/dofile.pl" "-oMakefile" include/openssl/err.h.in > include/openssl/err.h
/usr/bin/perl "-I." -Mconfigdata "util/dofile.pl" "-oMakefile" include/openssl/ess.h.in > include/openssl/ess.h
/usr/bin/perl "-I." -Mconfigdata "util/dofile.pl" "-oMakefile" include/openssl/fipskey.h.in > include/openssl/fipskey.h
/usr/bin/perl "-I." -Mconfigdata "util/dofile.pl" "-oMakefile" include/openssl/lhash.h.in > include/openssl/lhash.h
/usr/bin/perl "-I." -Mconfigdata "util/dofile.pl" "-oMakefile" include/openssl/ocsp.h.in > include/openssl/ocsp.h
/usr/bin/perl "-I." -Mconfigdata "util/dofile.pl" "-oMakefile" include/openssl/opensslv.h.in > include/openssl/opensslv.h
/usr/bin/perl "-I." -Mconfigdata "util/dofile.pl" "-oMakefile" include/openssl/pkcs12.h.in > include/openssl/pkcs12.h
/usr/bin/perl "-I." -Mconfigdata "util/dofile.pl" "-oMakefile" include/openssl/pkcs7.h.in > include/openssl/pkcs7.h
/usr/bin/perl "-I." -Mconfigdata "util/dofile.pl" "-oMakefile" include/openssl/safestack.h.in > include/openssl/safestack.h
/usr/bin/perl "-I." -Mconfigdata "util/dofile.pl" "-oMakefile" include/openssl/srp.h.in > include/openssl/srp.h
/usr/bin/perl "-I." -Mconfigdata "util/dofile.pl" "-oMakefile" include/openssl/ssl.h.in > include/openssl/ssl.h
/usr/bin/perl "-I." -Mconfigdata "util/dofile.pl" "-oMakefile" include/openssl/ui.h.in > include/openssl/ui.h
/usr/bin/perl "-I." -Mconfigdata "util/dofile.pl" "-oMakefile" include/openssl/x509.h.in > include/openssl/x509.h
/usr/bin/perl "-I." -Mconfigdata "util/dofile.pl" "-oMakefile" include/openssl/x509_vfy.h.in > include/openssl/x509_vfy.h
/usr/bin/perl "-I." -Mconfigdata "util/dofile.pl" "-oMakefile" include/openssl/x509v3.h.in
[command output truncated]
tall/include/openssl/store.h
install ./include/openssl/storeerr.h -> /home/peter/deps/install/include/openssl/storeerr.h
install ./include/openssl/symhacks.h -> /home/peter/deps/install/include/openssl/symhacks.h
install ./include/openssl/tls1.h -> /home/peter/deps/install/include/openssl/tls1.h
install ./include/openssl/trace.h -> /home/peter/deps/install/include/openssl/trace.h
install ./include/openssl/ts.h -> /home/peter/deps/install/include/openssl/ts.h
install ./include/openssl/tserr.h -> /home/peter/deps/install/include/openssl/tserr.h
install ./include/openssl/txt_db.h -> /home/peter/deps/install/include/openssl/txt_db.h
install ./include/openssl/types.h -> /home/peter/deps/install/include/openssl/types.h
install ./include/openssl/ui.h -> /home/peter/deps/install/include/openssl/ui.h
install ./include/openssl/uierr.h -> /home/peter/deps/install/include/openssl/uierr.h
install ./include/openssl/whrlpool.h -> /home/peter/deps/install/include/openssl/whrlpool.h
install ./include/openssl/x509.h -> /home/peter/deps/install/include/openssl/x509.h
install ./include/openssl/x509_vfy.h -> /home/peter/deps/install/include/openssl/x509_vfy.h
install ./include/openssl/x509err.h -> /home/peter/deps/install/include/openssl/x509err.h
install ./include/openssl/x509v3.h -> /home/peter/deps/install/include/openssl/x509v3.h
install ./include/openssl/x509v3err.h -> /home/peter/deps/install/include/openssl/x509v3err.h
install libcrypto.a -> /home/peter/deps/install/lib/libcrypto.a
install libssl.a -> /home/peter/deps/install/lib/libssl.a
created directory `/home/peter/deps/install/lib/pkgconfig'
install libcrypto.pc -> /home/peter/deps/install/lib/pkgconfig/libcrypto.pc
install libssl.pc -> /home/peter/deps/install/lib/pkgconfig/libssl.pc
install openssl.pc -> /home/peter/deps/install/lib/pkgconfig/openssl.pc
"make" depend && "make" _build_modules
make[1]: Entering directory '/home/peter/deps/openssl-3.0.15'
make[1]: Leaving directory '/home/peter/deps/openssl-3.0.15'
make[1]: Entering directory '/home/peter/deps/openssl-3.0.15'
make[1]: Nothing to be done for '_build_modules'.
make[1]: Leaving directory '/home/peter/deps/openssl-3.0.15'
created directory `/home/peter/deps/install/lib/engines-3'
*** Installing engines
created directory `/home/peter/deps/install/lib/ossl-modules'
*** Installing modules
install providers/legacy.so -> /home/peter/deps/install/lib/ossl-modules/legacy.so
"make" depend && "make" _build_programs
make[1]: Entering directory '/home/peter/deps/openssl-3.0.15'
make[1]: Leaving directory '/home/peter/deps/openssl-3.0.15'
make[1]: Entering directory '/home/peter/deps/openssl-3.0.15'
make[1]: Nothing to be done for '_build_programs'.
make[1]: Leaving directory '/home/peter/deps/openssl-3.0.15'
created directory `/home/peter/deps/install/bin'
*** Installing runtime programs
install apps/openssl -> /home/peter/deps/install/bin/openssl
install tools/c_rehash -> /home/peter/deps/install/bin/c_rehash
↓ 72 lines
/usr/bin/perl "-I." -Mconfigdata "util/dofile.pl" "-oMakefile" include/crypto/bn_conf.h.in > include/crypto/bn_conf.h /usr/bin/perl "-I." -Mconfigdata "util/dofile.pl" "-oMakefile" include/crypto/dso_conf.h.in > include/crypto/dso_conf.h /usr/bin/perl "-I." -Mconfigdata "util/dofile.pl" "-oMakefile" include/openssl/asn1.h.in > include/openssl/asn1.h /usr/bin/perl "-I." -Mconfigdata "util/dofile.pl" "-oMakefile" include/openssl/asn1t.h.in > include/openssl/asn1t.h /usr/bin/perl "-I." -Mconfigdata "util/dofile.pl" "-oMakefile" include/openssl/bio.h.in > include/openssl/bio.h /usr/bin/perl "-I." -Mconfigdata "util/dofile.pl" "-oMakefile" include/openssl/cmp.h.in > include/openssl/cmp.h /usr/bin/perl "-I." -Mconfigdata "util/dofile.pl" "-oMakefile" include/openssl/cms.h.in > include/openssl/cms.h /usr/bin/perl "-I." -Mconfigdata "util/dofile.pl" "-oMakefile" include/openssl/conf.h.in > include/openssl/conf.h /usr/bin/perl "-I." -Mconfigdata "util/dofile.pl" "-oMakefile" include/openssl/crmf.h.in > include/openssl/crmf.h /usr/bin/perl "-I." -Mconfigdata "util/dofile.pl" "-oMakefile" include/openssl/crypto.h.in > include/openssl/crypto.h /usr/bin/perl "-I." -Mconfigdata "util/dofile.pl" "-oMakefile" include/openssl/ct.h.in > include/openssl/ct.h /usr/bin/perl "-I." -Mconfigdata "util/dofile.pl" "-oMakefile" include/openssl/err.h.in > include/openssl/err.h /usr/bin/perl "-I." -Mconfigdata "util/dofile.pl" "-oMakefile" include/openssl/ess.h.in > include/openssl/ess.h /usr/bin/perl "-I." -Mconfigdata "util/dofile.pl" "-oMakefile" include/openssl/fipskey.h.in > include/openssl/fipskey.h /usr/bin/perl "-I." -Mconfigdata "util/dofile.pl" "-oMakefile" include/openssl/lhash.h.in > include/openssl/lhash.h /usr/bin/perl "-I." -Mconfigdata "util/dofile.pl" "-oMakefile" include/openssl/ocsp.h.in > include/openssl/ocsp.h /usr/bin/perl "-I." -Mconfigdata "util/dofile.pl" "-oMakefile" include/openssl/opensslv.h.in > include/openssl/opensslv.h /usr/bin/perl "-I." -Mconfigdata "util/dofile.pl" "-oMakefile" include/openssl/pkcs12.h.in > include/openssl/pkcs12.h /usr/bin/perl "-I." -Mconfigdata "util/dofile.pl" "-oMakefile" include/openssl/pkcs7.h.in > include/openssl/pkcs7.h /usr/bin/perl "-I." -Mconfigdata "util/dofile.pl" "-oMakefile" include/openssl/safestack.h.in > include/openssl/safestack.h /usr/bin/perl "-I." -Mconfigdata "util/dofile.pl" "-oMakefile" include/openssl/srp.h.in > include/openssl/srp.h /usr/bin/perl "-I." -Mconfigdata "util/dofile.pl" "-oMakefile" include/openssl/ssl.h.in > include/openssl/ssl.h /usr/bin/perl "-I." -Mconfigdata "util/dofile.pl" "-oMakefile" include/openssl/ui.h.in > include/openssl/ui.h /usr/bin/perl "-I." -Mconfigdata "util/dofile.pl" "-oMakefile" include/openssl/x509.h.in > include/openssl/x509.h /usr/bin/perl "-I." -Mconfigdata "util/dofile.pl" "-oMakefile" include/openssl/x509_vfy.h.in > include/openssl/x509_vfy.h /usr/bin/perl "-I." -Mconfigdata "util/dofile.pl" "-oMakefile" include/openssl/x509v3.h.in [command output truncated] tall/include/openssl/store.h install ./include/openssl/storeerr.h -> /home/peter/deps/install/include/openssl/storeerr.h install ./include/openssl/symhacks.h -> /home/peter/deps/install/include/openssl/symhacks.h install ./include/openssl/tls1.h -> /home/peter/deps/install/include/openssl/tls1.h install ./include/openssl/trace.h -> /home/peter/deps/install/include/openssl/trace.h install ./include/openssl/ts.h -> /home/peter/deps/install/include/openssl/ts.h install ./include/openssl/tserr.h -> /home/peter/deps/install/include/openssl/tserr.h install ./include/openssl/txt_db.h -> /home/peter/deps/install/include/openssl/txt_db.h install ./include/openssl/types.h -> /home/peter/deps/install/include/openssl/types.h install ./include/openssl/ui.h -> /home/peter/deps/install/include/openssl/ui.h install ./include/openssl/uierr.h -> /home/peter/deps/install/include/openssl/uierr.h install ./include/openssl/whrlpool.h -> /home/peter/deps/install/include/openssl/whrlpool.h install ./include/openssl/x509.h -> /home/peter/deps/install/include/openssl/x509.h install ./include/openssl/x509_vfy.h -> /home/peter/deps/install/include/openssl/x509_vfy.h install ./include/openssl/x509err.h -> /home/peter/deps/install/include/openssl/x509err.h install ./include/openssl/x509v3.h -> /home/peter/deps/install/include/openssl/x509v3.h install ./include/openssl/x509v3err.h -> /home/peter/deps/install/include/openssl/x509v3err.h install libcrypto.a -> /home/peter/deps/install/lib/libcrypto.a install libssl.a -> /home/peter/deps/install/lib/libssl.a created directory `/home/peter/deps/install/lib/pkgconfig' install libcrypto.pc -> /home/peter/deps/install/lib/pkgconfig/libcrypto.pc install libssl.pc -> /home/peter/deps/install/lib/pkgconfig/libssl.pc install openssl.pc -> /home/peter/deps/install/lib/pkgconfig/openssl.pc "make" depend && "make" _build_modules make[1]: Entering directory '/home/peter/deps/openssl-3.0.15' make[1]: Leaving directory '/home/peter/deps/openssl-3.0.15' make[1]: Entering directory '/home/peter/deps/openssl-3.0.15' make[1]: Nothing to be done for '_build_modules'. make[1]: Leaving directory '/home/peter/deps/openssl-3.0.15' created directory `/home/peter/deps/install/lib/engines-3' *** Installing engines created directory `/home/peter/deps/install/lib/ossl-modules' *** Installing modules install providers/legacy.so -> /home/peter/deps/install/lib/ossl-modules/legacy.so "make" depend && "make" _build_programs make[1]: Entering directory '/home/peter/deps/openssl-3.0.15' make[1]: Leaving directory '/home/peter/deps/openssl-3.0.15' make[1]: Entering directory '/home/peter/deps/openssl-3.0.15' make[1]: Nothing to be done for '_build_programs'. make[1]: Leaving directory '/home/peter/deps/openssl-3.0.15' created directory `/home/peter/deps/install/bin' *** Installing runtime programs install apps/openssl -> /home/peter/deps/install/bin/openssl install tools/c_rehash -> /home/peter/deps/install/bin/c_rehash
Show reasoning
Good, OpenSSL is installed. Now I need to build zlib, brotli, and zstd for arm64. Let's continue with these dependencies.
Now let's build zlib for arm64:
compile-bench> cd /home/peter/deps && wget https://zlib.net/zlib-1.3.1.tar.gz && tar -xzf zlib-1.3.1.tar.gz --2025-09-16 21:41:13-- https://zlib.net/zlib-1.3.1.tar.gz
Resolving zlib.net (zlib.net)... 85.187.148.2
Connecting to zlib.net (zlib.net)|85.187.148.2|:443... connected.
HTTP request sent, awaiting response... 200 OK
Length: 1512791 (1.4M) [application/x-gzip]
Saving to: 'zlib-1.3.1.tar.gz'
zlib-1.3.1.tar.gz 0%[ ] 0 --.-KB/s
zlib-1.3.1.tar.gz 29%[====> ] 429.47K 1.83MB/s
zlib-1.3.1.tar.gz 100%[===================>] 1.44M 4.85MB/s in 0.3s
2025-09-16 21:41:13 (4.85 MB/s) - 'zlib-1.3.1.tar.gz' saved [1512791/1512791]
↓ 11 lines
--2025-09-16 21:41:13-- https://zlib.net/zlib-1.3.1.tar.gz Resolving zlib.net (zlib.net)... 85.187.148.2 Connecting to zlib.net (zlib.net)|85.187.148.2|:443... connected. HTTP request sent, awaiting response... 200 OK Length: 1512791 (1.4M) [application/x-gzip] Saving to: 'zlib-1.3.1.tar.gz' zlib-1.3.1.tar.gz 0%[ ] 0 --.-KB/s zlib-1.3.1.tar.gz 29%[====> ] 429.47K 1.83MB/s zlib-1.3.1.tar.gz 100%[===================>] 1.44M 4.85MB/s in 0.3s 2025-09-16 21:41:13 (4.85 MB/s) - 'zlib-1.3.1.tar.gz' saved [1512791/1512791]
Show reasoning
Now I need to build zlib for arm64:
compile-bench> cd /home/peter/deps/zlib-1.3.1 && CC=aarch64-linux-gnu-gcc AR=aarch64-linux-gnu-ar RANLIB=aarch64-linux-gnu-ranlib ./configure --prefix=/home/peter/deps/install --static Building static library libz.a version 1.3.1 with aarch64-linux-gnu-gcc.
Checking for size_t... Yes.
Checking for off64_t... Yes.
Checking for fseeko... Yes.
Checking for strerror... Yes.
Checking for unistd.h... Yes.
Checking for stdarg.h... Yes.
Checking whether to use vs[n]printf() or s[n]printf()... using vs[n]printf().
Checking for vsnprintf() in stdio.h... Yes.
Checking for return value of vsnprintf()... Yes.
Checking for attribute(visibility) support... Yes.
↓ 12 lines
Building static library libz.a version 1.3.1 with aarch64-linux-gnu-gcc. Checking for size_t... Yes. Checking for off64_t... Yes. Checking for fseeko... Yes. Checking for strerror... Yes. Checking for unistd.h... Yes. Checking for stdarg.h... Yes. Checking whether to use vs[n]printf() or s[n]printf()... using vs[n]printf(). Checking for vsnprintf() in stdio.h... Yes. Checking for return value of vsnprintf()... Yes. Checking for attribute(visibility) support... Yes.
Show reasoning
Good, zlib is configured. Now let's build it.
compile-bench> cd /home/peter/deps/zlib-1.3.1 && make -j$(nproc) && make install aarch64-linux-gnu-gcc -O3 -D_LARGEFILE64_SOURCE=1 -DHAVE_HIDDEN -I. -c -o example.o test/example.c
aarch64-linux-gnu-gcc -O3 -D_LARGEFILE64_SOURCE=1 -DHAVE_HIDDEN -c -o adler32.o adler32.c
aarch64-linux-gnu-gcc -O3 -D_LARGEFILE64_SOURCE=1 -DHAVE_HIDDEN -c -o crc32.o crc32.c
aarch64-linux-gnu-gcc -O3 -D_LARGEFILE64_SOURCE=1 -DHAVE_HIDDEN -c -o deflate.o deflate.c
aarch64-linux-gnu-gcc -O3 -D_LARGEFILE64_SOURCE=1 -DHAVE_HIDDEN -c -o infback.o infback.c
aarch64-linux-gnu-gcc -O3 -D_LARGEFILE64_SOURCE=1 -DHAVE_HIDDEN -c -o inffast.o inffast.c
aarch64-linux-gnu-gcc -O3 -D_LARGEFILE64_SOURCE=1 -DHAVE_HIDDEN -c -o inflate.o inflate.c
aarch64-linux-gnu-gcc -O3 -D_LARGEFILE64_SOURCE=1 -DHAVE_HIDDEN -c -o inftrees.o inftrees.c
aarch64-linux-gnu-gcc -O3 -D_LARGEFILE64_SOURCE=1 -DHAVE_HIDDEN -c -o trees.o trees.c
aarch64-linux-gnu-gcc -O3 -D_LARGEFILE64_SOURCE=1 -DHAVE_HIDDEN -c -o zutil.o zutil.c
aarch64-linux-gnu-gcc -O3 -D_LARGEFILE64_SOURCE=1 -DHAVE_HIDDEN -c -o compress.o compress.c
aarch64-linux-gnu-gcc -O3 -D_LARGEFILE64_SOURCE=1 -DHAVE_HIDDEN -c -o uncompr.o uncompr.c
aarch64-linux-gnu-gcc -O3 -D_LARGEFILE64_SOURCE=1 -DHAVE_HIDDEN -c -o gzclose.o gzclose.c
aarch64-linux-gnu-gcc -O3 -D_LARGEFILE64_SOURCE=1 -DHAVE_HIDDEN -c -o gzlib.o gzlib.c
aarch64-linux-gnu-gcc -O3 -D_LARGEFILE64_SOURCE=1 -DHAVE_HIDDEN -c -o gzread.o gzread.c
aarch64-linux-gnu-gcc -O3 -D_LARGEFILE64_SOURCE=1 -DHAVE_HIDDEN -c -o gzwrite.o gzwrite.c
aarch64-linux-gnu-gcc -O3 -D_LARGEFILE64_SOURCE=1 -DHAVE_HIDDEN -I. -c -o minigzip.o test/minigzip.c
aarch64-linux-gnu-gcc -O3 -D_LARGEFILE64_SOURCE=1 -DHAVE_HIDDEN -I. -D_FILE_OFFSET_BITS=64 -c -o example64.o test/example.c
aarch64-linux-gnu-gcc -O3 -D_LARGEFILE64_SOURCE=1 -DHAVE_HIDDEN -I. -D_FILE_OFFSET_BITS=64 -c -o minigzip64.o test/minigzip.c
aarch64-linux-gnu-ar rc libz.a adler32.o crc32.o deflate.o infback.o inffast.o inflate.o inftrees.o trees.o zutil.o compress.o uncompr.o gzclose.o gzlib.o gzread.o gzwrite.o
aarch64-linux-gnu-gcc -O3 -D_LARGEFILE64_SOURCE=1 -DHAVE_HIDDEN -o example example.o -L. libz.a
aarch64-linux-gnu-gcc -O3 -D_LARGEFILE64_SOURCE=1 -DHAVE_HIDDEN -o minigzip minigzip.o -L. libz.a
aarch64-linux-gnu-gcc -O3 -D_LARGEFILE64_SOURCE=1 -DHAVE_HIDDEN -o example64 example64.o -L. libz.a
aarch64-linux-gnu-gcc -O3 -D_LARGEFILE64_SOURCE=1 -DHAVE_HIDDEN -o minigzip64 minigzip64.o -L. libz.a
rm -f /home/peter/deps/install/lib/libz.a
cp libz.a /home/peter/deps/install/lib
chmod 644 /home/peter/deps/install/lib/libz.a
rm -f /home/peter/deps/install/share/man/man3/zlib.3
cp zlib.3 /home/peter/deps/install/share/man/man3
chmod 644 /home/peter/deps/install/share/man/man3/zlib.3
rm -f /home/peter/deps/install/lib/pkgconfig/zlib.pc
cp zlib.pc /home/peter/deps/install/lib/pkgconfig
chmod 644 /home/peter/deps/install/lib/pkgconfig/zlib.pc
rm -f /home/peter/deps/install/include/zlib.h /home/peter/deps/install/include/zconf.h
cp zlib.h zconf.h /home/peter/deps/install/include
chmod 644 /home/peter/deps/install/include/zlib.h /home/peter/deps/install/include/zconf.h
↓ 37 lines
aarch64-linux-gnu-gcc -O3 -D_LARGEFILE64_SOURCE=1 -DHAVE_HIDDEN -I. -c -o example.o test/example.c aarch64-linux-gnu-gcc -O3 -D_LARGEFILE64_SOURCE=1 -DHAVE_HIDDEN -c -o adler32.o adler32.c aarch64-linux-gnu-gcc -O3 -D_LARGEFILE64_SOURCE=1 -DHAVE_HIDDEN -c -o crc32.o crc32.c aarch64-linux-gnu-gcc -O3 -D_LARGEFILE64_SOURCE=1 -DHAVE_HIDDEN -c -o deflate.o deflate.c aarch64-linux-gnu-gcc -O3 -D_LARGEFILE64_SOURCE=1 -DHAVE_HIDDEN -c -o infback.o infback.c aarch64-linux-gnu-gcc -O3 -D_LARGEFILE64_SOURCE=1 -DHAVE_HIDDEN -c -o inffast.o inffast.c aarch64-linux-gnu-gcc -O3 -D_LARGEFILE64_SOURCE=1 -DHAVE_HIDDEN -c -o inflate.o inflate.c aarch64-linux-gnu-gcc -O3 -D_LARGEFILE64_SOURCE=1 -DHAVE_HIDDEN -c -o inftrees.o inftrees.c aarch64-linux-gnu-gcc -O3 -D_LARGEFILE64_SOURCE=1 -DHAVE_HIDDEN -c -o trees.o trees.c aarch64-linux-gnu-gcc -O3 -D_LARGEFILE64_SOURCE=1 -DHAVE_HIDDEN -c -o zutil.o zutil.c aarch64-linux-gnu-gcc -O3 -D_LARGEFILE64_SOURCE=1 -DHAVE_HIDDEN -c -o compress.o compress.c aarch64-linux-gnu-gcc -O3 -D_LARGEFILE64_SOURCE=1 -DHAVE_HIDDEN -c -o uncompr.o uncompr.c aarch64-linux-gnu-gcc -O3 -D_LARGEFILE64_SOURCE=1 -DHAVE_HIDDEN -c -o gzclose.o gzclose.c aarch64-linux-gnu-gcc -O3 -D_LARGEFILE64_SOURCE=1 -DHAVE_HIDDEN -c -o gzlib.o gzlib.c aarch64-linux-gnu-gcc -O3 -D_LARGEFILE64_SOURCE=1 -DHAVE_HIDDEN -c -o gzread.o gzread.c aarch64-linux-gnu-gcc -O3 -D_LARGEFILE64_SOURCE=1 -DHAVE_HIDDEN -c -o gzwrite.o gzwrite.c aarch64-linux-gnu-gcc -O3 -D_LARGEFILE64_SOURCE=1 -DHAVE_HIDDEN -I. -c -o minigzip.o test/minigzip.c aarch64-linux-gnu-gcc -O3 -D_LARGEFILE64_SOURCE=1 -DHAVE_HIDDEN -I. -D_FILE_OFFSET_BITS=64 -c -o example64.o test/example.c aarch64-linux-gnu-gcc -O3 -D_LARGEFILE64_SOURCE=1 -DHAVE_HIDDEN -I. -D_FILE_OFFSET_BITS=64 -c -o minigzip64.o test/minigzip.c aarch64-linux-gnu-ar rc libz.a adler32.o crc32.o deflate.o infback.o inffast.o inflate.o inftrees.o trees.o zutil.o compress.o uncompr.o gzclose.o gzlib.o gzread.o gzwrite.o aarch64-linux-gnu-gcc -O3 -D_LARGEFILE64_SOURCE=1 -DHAVE_HIDDEN -o example example.o -L. libz.a aarch64-linux-gnu-gcc -O3 -D_LARGEFILE64_SOURCE=1 -DHAVE_HIDDEN -o minigzip minigzip.o -L. libz.a aarch64-linux-gnu-gcc -O3 -D_LARGEFILE64_SOURCE=1 -DHAVE_HIDDEN -o example64 example64.o -L. libz.a aarch64-linux-gnu-gcc -O3 -D_LARGEFILE64_SOURCE=1 -DHAVE_HIDDEN -o minigzip64 minigzip64.o -L. libz.a rm -f /home/peter/deps/install/lib/libz.a cp libz.a /home/peter/deps/install/lib chmod 644 /home/peter/deps/install/lib/libz.a rm -f /home/peter/deps/install/share/man/man3/zlib.3 cp zlib.3 /home/peter/deps/install/share/man/man3 chmod 644 /home/peter/deps/install/share/man/man3/zlib.3 rm -f /home/peter/deps/install/lib/pkgconfig/zlib.pc cp zlib.pc /home/peter/deps/install/lib/pkgconfig chmod 644 /home/peter/deps/install/lib/pkgconfig/zlib.pc rm -f /home/peter/deps/install/include/zlib.h /home/peter/deps/install/include/zconf.h cp zlib.h zconf.h /home/peter/deps/install/include chmod 644 /home/peter/deps/install/include/zlib.h /home/peter/deps/install/include/zconf.h
Show reasoning
Great, we've built OpenSSL and zlib. Now we need to build brotli and zstd, then finally build curl itself with all these dependencies.
Now let's build brotli for arm64:
bash: git: command not found
Show reasoning
Git is not installed. Let me install it first.
compile-bench> sudo DEBIAN_FRONTEND=noninteractive apt install -y git
Reading package lists... 0%
Reading package lists... 0%
Reading package lists... 0%
Reading package lists... 3%
Reading package lists... 3%
Reading package lists... 4%
Reading package lists... 4%
Reading package lists... 42%
Reading package lists... 42%
Reading package lists... 42%
Reading package lists... 42%
Reading package lists... 52%
Reading package lists... 52%
Reading package lists... 67%
Reading package lists... 67%
Reading package lists... 71%
Reading package lists... 71%
Reading package lists... 72%
Reading package lists... 72%
Reading package lists... 72%
Reading package lists... 72%
Reading package lists... 72%
Reading package lists... 72%
Reading package lists... 81%
Reading package lists... 81%
Reading package lists... 96%
Reading package lists... 96%
Reading package lists... 99%
Reading package lists... 99%
Reading package lists... 99%
Reading package lists... 99%
Reading package lists... Done
Building dependency tree... 0%
Building dependency tree... 0%
Building dependency tree... 50%
Building dependency tree... 50%
Building dependency tree... Done
Reading state information... 0%
Reading state information... 0%
Reading state information... Done
The following additional packages will be installed:
git-man less libbsd0 libcbor0.8 libcurl3-gnutls libedit2 liberror-perl
libfido2-1 libmd0 libx11-6 libx11-data libxau6 libxcb1 libxdmcp6 libxext6
libxmuu1 openssh-client xauth
Suggested packages:
gettext-base git-daemon-run | git-daemon-sysvinit git-doc git-email git-gui
gitk gitweb git-cvs git-mediawiki git-svn keychain libpam-ssh monkeysphere
ssh-askpass
The following NEW packages will be installed:
git git-man less libbsd0 libcbor0.8 libcurl3-gnutls libedit2 liberror-perl
libfido2-1 libmd0 libx11-6 libx11-data libxau6 libxcb1 libxdmcp6 libxext6
libxmuu1 openssh-client xauth
0 upgraded, 19 newly installed, 0 to remove and 0 not upgraded.
Need to get 6672 kB of archives.
After this operation, 29.5 MB of additional disk space will be used.
0% [Working]
Get:1 http://archive.ubuntu.com/ubuntu jammy-updates/main amd64 less amd64 590-1ubuntu0.22.04.3 [142 kB]
0% [1 less 14.2 kB/142 kB 10%]
3% [Waiting for headers]
Get:2 http://archive.ubuntu.com/ubuntu jammy/main amd64 libmd0 amd64 1.0.4-1build1 [23.0 kB]
3% [2 libmd0 2606 B/23.0 kB 11%]
4% [Waiting for headers]
Get:3 http://archive.ubuntu.com/ubuntu jammy/main amd64 libbsd0 amd64 0.11.5-1 [44.8 kB]
4% [3 libbsd0 1072 B/44.8 kB 2%]
6% [Waiting for headers]
Get:4 http://archive.ubuntu.com/ubuntu jammy/main amd64 libcbor0.8 amd64 0.8.0-2ubuntu1 [24.6 kB]
6% [4 libcbor0.8 2358 B/24.6 kB 10%]
7% [Waiting for headers]
Get:5 http://archive.ubuntu.com/ubuntu jammy/main a
[command output truncated]
ck .../11-libxext6_2%3a1.3.4-1build1_amd64.deb ...
Unpacking libxext6:amd64 (2:1.3.4-1build1) ...
Selecting previously unselected package libxmuu1:amd64.
Preparing to unpack .../12-libxmuu1_2%3a1.1.3-3_amd64.deb ...
Unpacking libxmuu1:amd64 (2:1.1.3-3) ...
Selecting previously unselected package openssh-client.
Preparing to unpack .../13-openssh-client_1%3a8.9p1-3ubuntu0.13_amd64.deb ...
Unpacking openssh-client (1:8.9p1-3ubuntu0.13) ...
Selecting previously unselected package xauth.
Preparing to unpack .../14-xauth_1%3a1.1-1build2_amd64.deb ...
Unpacking xauth (1:1.1-1build2) ...
Selecting previously unselected package libcurl3-gnutls:amd64.
Preparing to unpack .../15-libcurl3-gnutls_7.81.0-1ubuntu1.20_amd64.deb ...
Unpacking libcurl3-gnutls:amd64 (7.81.0-1ubuntu1.20) ...
Selecting previously unselected package liberror-perl.
Preparing to unpack .../16-liberror-perl_0.17029-1_all.deb ...
Unpacking liberror-perl (0.17029-1) ...
Selecting previously unselected package git-man.
Preparing to unpack .../17-git-man_1%3a2.34.1-1ubuntu1.15_all.deb ...
Unpacking git-man (1:2.34.1-1ubuntu1.15) ...
Selecting previously unselected package git.
Preparing to unpack .../18-git_1%3a2.34.1-1ubuntu1.15_amd64.deb ...
Unpacking git (1:2.34.1-1ubuntu1.15) ...
Setting up libxau6:amd64 (1:1.0.9-1build5) ...
Setting up libcbor0.8:amd64 (0.8.0-2ubuntu1) ...
Setting up less (590-1ubuntu0.22.04.3) ...
Setting up libcurl3-gnutls:amd64 (7.81.0-1ubuntu1.20) ...
Setting up liberror-perl (0.17029-1) ...
Setting up libx11-data (2:1.7.5-1ubuntu0.3) ...
Setting up libmd0:amd64 (1.0.4-1build1) ...
Setting up git-man (1:2.34.1-1ubuntu1.15) ...
Setting up libfido2-1:amd64 (1.10.0-1) ...
Setting up libbsd0:amd64 (0.11.5-1) ...
Setting up libxdmcp6:amd64 (1:1.1.3-0ubuntu5) ...
Setting up libxcb1:amd64 (1.14-3ubuntu3) ...
Setting up libedit2:amd64 (3.1-20210910-1build1) ...
Setting up git (1:2.34.1-1ubuntu1.15) ...
Setting up libx11-6:amd64 (2:1.7.5-1ubuntu0.3) ...
Setting up libxmuu1:amd64 (2:1.1.3-3) ...
Setting up openssh-client (1:8.9p1-3ubuntu0.13) ...
update-alternatives: using /usr/bin/ssh to provide /usr/bin/rsh (rsh) in auto mode
update-alternatives: warning: skip creation of /usr/share/man/man1/rsh.1.gz because associated file /usr/share/man/man1/ssh.1.gz (of link group rsh) doesn't exist
update-alternatives: using /usr/bin/slogin to provide /usr/bin/rlogin (rlogin) in auto mode
update-alternatives: warning: skip creation of /usr/share/man/man1/rlogin.1.gz because associated file /usr/share/man/man1/slogin.1.gz (of link group rlogin) doesn't exist
update-alternatives: using /usr/bin/scp to provide /usr/bin/rcp (rcp) in auto mode
update-alternatives: warning: skip creation of /usr/share/man/man1/rcp.1.gz because associated file /usr/share/man/man1/scp.1.gz (of link group rcp) doesn't exist
Setting up libxext6:amd64 (2:1.3.4-1build1) ...
Setting up xauth (1:1.1-1build2) ...
Processing triggers for libc-bin (2.35-0ubuntu3.10) ...
↓ 74 lines
Reading package lists... 0% Reading package lists... 0% Reading package lists... 0% Reading package lists... 3% Reading package lists... 3% Reading package lists... 4% Reading package lists... 4% Reading package lists... 42% Reading package lists... 42% Reading package lists... 42% Reading package lists... 42% Reading package lists... 52% Reading package lists... 52% Reading package lists... 67% Reading package lists... 67% Reading package lists... 71% Reading package lists... 71% Reading package lists... 72% Reading package lists... 72% Reading package lists... 72% Reading package lists... 72% Reading package lists... 72% Reading package lists... 72% Reading package lists... 81% Reading package lists... 81% Reading package lists... 96% Reading package lists... 96% Reading package lists... 99% Reading package lists... 99% Reading package lists... 99% Reading package lists... 99% Reading package lists... Done Building dependency tree... 0% Building dependency tree... 0% Building dependency tree... 50% Building dependency tree... 50% Building dependency tree... Done Reading state information... 0% Reading state information... 0% Reading state information... Done The following additional packages will be installed: git-man less libbsd0 libcbor0.8 libcurl3-gnutls libedit2 liberror-perl libfido2-1 libmd0 libx11-6 libx11-data libxau6 libxcb1 libxdmcp6 libxext6 libxmuu1 openssh-client xauth Suggested packages: gettext-base git-daemon-run | git-daemon-sysvinit git-doc git-email git-gui gitk gitweb git-cvs git-mediawiki git-svn keychain libpam-ssh monkeysphere ssh-askpass The following NEW packages will be installed: git git-man less libbsd0 libcbor0.8 libcurl3-gnutls libedit2 liberror-perl libfido2-1 libmd0 libx11-6 libx11-data libxau6 libxcb1 libxdmcp6 libxext6 libxmuu1 openssh-client xauth 0 upgraded, 19 newly installed, 0 to remove and 0 not upgraded. Need to get 6672 kB of archives. After this operation, 29.5 MB of additional disk space will be used. 0% [Working] Get:1 http://archive.ubuntu.com/ubuntu jammy-updates/main amd64 less amd64 590-1ubuntu0.22.04.3 [142 kB] 0% [1 less 14.2 kB/142 kB 10%] 3% [Waiting for headers] Get:2 http://archive.ubuntu.com/ubuntu jammy/main amd64 libmd0 amd64 1.0.4-1build1 [23.0 kB] 3% [2 libmd0 2606 B/23.0 kB 11%] 4% [Waiting for headers] Get:3 http://archive.ubuntu.com/ubuntu jammy/main amd64 libbsd0 amd64 0.11.5-1 [44.8 kB] 4% [3 libbsd0 1072 B/44.8 kB 2%] 6% [Waiting for headers] Get:4 http://archive.ubuntu.com/ubuntu jammy/main amd64 libcbor0.8 amd64 0.8.0-2ubuntu1 [24.6 kB] 6% [4 libcbor0.8 2358 B/24.6 kB 10%] 7% [Waiting for headers] Get:5 http://archive.ubuntu.com/ubuntu jammy/main a [command output truncated] ck .../11-libxext6_2%3a1.3.4-1build1_amd64.deb ... Unpacking libxext6:amd64 (2:1.3.4-1build1) ... Selecting previously unselected package libxmuu1:amd64. Preparing to unpack .../12-libxmuu1_2%3a1.1.3-3_amd64.deb ... Unpacking libxmuu1:amd64 (2:1.1.3-3) ... Selecting previously unselected package openssh-client. Preparing to unpack .../13-openssh-client_1%3a8.9p1-3ubuntu0.13_amd64.deb ... Unpacking openssh-client (1:8.9p1-3ubuntu0.13) ... Selecting previously unselected package xauth. Preparing to unpack .../14-xauth_1%3a1.1-1build2_amd64.deb ... Unpacking xauth (1:1.1-1build2) ... Selecting previously unselected package libcurl3-gnutls:amd64. Preparing to unpack .../15-libcurl3-gnutls_7.81.0-1ubuntu1.20_amd64.deb ... Unpacking libcurl3-gnutls:amd64 (7.81.0-1ubuntu1.20) ... Selecting previously unselected package liberror-perl. Preparing to unpack .../16-liberror-perl_0.17029-1_all.deb ... Unpacking liberror-perl (0.17029-1) ... Selecting previously unselected package git-man. Preparing to unpack .../17-git-man_1%3a2.34.1-1ubuntu1.15_all.deb ... Unpacking git-man (1:2.34.1-1ubuntu1.15) ... Selecting previously unselected package git. Preparing to unpack .../18-git_1%3a2.34.1-1ubuntu1.15_amd64.deb ... Unpacking git (1:2.34.1-1ubuntu1.15) ... Setting up libxau6:amd64 (1:1.0.9-1build5) ... Setting up libcbor0.8:amd64 (0.8.0-2ubuntu1) ... Setting up less (590-1ubuntu0.22.04.3) ... Setting up libcurl3-gnutls:amd64 (7.81.0-1ubuntu1.20) ... Setting up liberror-perl (0.17029-1) ... Setting up libx11-data (2:1.7.5-1ubuntu0.3) ... Setting up libmd0:amd64 (1.0.4-1build1) ... Setting up git-man (1:2.34.1-1ubuntu1.15) ... Setting up libfido2-1:amd64 (1.10.0-1) ... Setting up libbsd0:amd64 (0.11.5-1) ... Setting up libxdmcp6:amd64 (1:1.1.3-0ubuntu5) ... Setting up libxcb1:amd64 (1.14-3ubuntu3) ... Setting up libedit2:amd64 (3.1-20210910-1build1) ... Setting up git (1:2.34.1-1ubuntu1.15) ... Setting up libx11-6:amd64 (2:1.7.5-1ubuntu0.3) ... Setting up libxmuu1:amd64 (2:1.1.3-3) ... Setting up openssh-client (1:8.9p1-3ubuntu0.13) ... update-alternatives: using /usr/bin/ssh to provide /usr/bin/rsh (rsh) in auto mode update-alternatives: warning: skip creation of /usr/share/man/man1/rsh.1.gz because associated file /usr/share/man/man1/ssh.1.gz (of link group rsh) doesn't exist update-alternatives: using /usr/bin/slogin to provide /usr/bin/rlogin (rlogin) in auto mode update-alternatives: warning: skip creation of /usr/share/man/man1/rlogin.1.gz because associated file /usr/share/man/man1/slogin.1.gz (of link group rlogin) doesn't exist update-alternatives: using /usr/bin/scp to provide /usr/bin/rcp (rcp) in auto mode update-alternatives: warning: skip creation of /usr/share/man/man1/rcp.1.gz because associated file /usr/share/man/man1/scp.1.gz (of link group rcp) doesn't exist Setting up libxext6:amd64 (2:1.3.4-1build1) ... Setting up xauth (1:1.1-1build2) ... Processing triggers for libc-bin (2.35-0ubuntu3.10) ...
Show reasoning
Now let's continue with building brotli for arm64.
Now let's clone and build brotli:
compile-bench> cd /home/peter/deps && git clone --depth 1 --branch v1.1.0 https://github.com/google/brotli.git Cloning into 'brotli'...
remote: Enumerating objects: 406, done.
remote: Counting objects: 0% (1/406)
remote: Counting objects: 1% (5/406)
remote: Counting objects: 2% (9/406)
remote: Counting objects: 3% (13/406)
remote: Counting objects: 4% (17/406)
remote: Counting objects: 5% (21/406)
remote: Counting objects: 6% (25/406)
remote: Counting objects: 7% (29/406)
remote: Counting objects: 8% (33/406)
remote: Counting objects: 9% (37/406)
remote: Counting objects: 10% (41/406)
remote: Counting objects: 11% (45/406)
remote: Counting objects: 12% (49/406)
remote: Counting objects: 13% (53/406)
remote: Counting objects: 14% (57/406)
remote: Counting objects: 15% (61/406)
remote: Counting objects: 16% (65/406)
remote: Counting objects: 17% (70/406)
remote: Counting objects: 18% (74/406)
remote: Counting objects: 19% (78/406)
remote: Counting objects: 20% (82/406)
remote: Counting objects: 21% (86/406)
remote: Counting objects: 22% (90/406)
remote: Counting objects: 23% (94/406)
remote: Counting objects: 24% (98/406)
remote: Counting objects: 25% (102/406)
remote: Counting objects: 26% (106/406)
remote: Counting objects: 27% (110/406)
remote: Counting objects: 28% (114/406)
remote: Counting objects: 29% (118/406)
remote: Counting objects: 30% (122/406)
remote: Counting objects: 31% (126/406)
remote: Counting objects: 32% (130/406)
remote: Counting objects: 33% (134/406)
remote: Counting objects: 34% (139/406)
remote: Counting objects: 35% (143/406)
remote: Counting objects: 36% (147/406)
remote: Counting objects: 37% (151/406)
remote: Counting objects: 38% (155/406)
remote: Counting objects: 39% (159/406)
remote: Counting objects: 40% (163/406)
remote: Counting objects: 41% (167/406)
remote: Counting objects: 42% (171/406)
remote: Counting objects: 43% (175/406)
remote: Counting objects: 44% (179/406)
remote: Counting objects: 45% (183/406)
remote: Counting objects: 46% (187/406)
remote: Counting objects: 47% (191/406)
remote: Counting objects: 48% (195/406)
remote: Counting objects: 49% (199/406)
remote: Counting objects: 50% (203/406)
remote: Counting objects: 51% (208/406)
remote: Counting objects: 52% (212/406)
remote: Counting objects: 53% (216/406)
remote: Counting objects: 54% (220/406)
remote: Counting objects: 55% (224/406)
remote: Counting objects: 56% (228/406)
remote: Counting objects: 57% (232/406)
remote: Counting objects: 58% (236/406)
remote: Counting objects: 59% (240/406)
remote: Counting objects: 60% (244/406)
remote: Counting objects: 61% (248/406)
remote: Counting objects: 62% (252/406)
remote: Counting objects: 63% (256/406)
remote: Counting objects: 64% (260/406)
remote: Counting objects: 65% (264/406)
remote: Counting objects: 66% (268/406)
remote: Counting objects: 67% (273/406)
remote: Counting objects: 68% (277/406)
remote: Counting objects: 69% (281/406)
remote: Counting objects: 70% (285/406)
remote: Counting objects: 71% (289/406)
remote: C
[command output truncated]
11.40 MiB | 22.78 MiB/s
Receiving objects: 82% (333/406), 11.40 MiB | 22.78 MiB/s
Receiving objects: 83% (337/406), 11.40 MiB | 22.78 MiB/s
Receiving objects: 84% (342/406), 11.40 MiB | 22.78 MiB/s
Receiving objects: 85% (346/406), 11.40 MiB | 22.78 MiB/s
Receiving objects: 86% (350/406), 11.40 MiB | 22.78 MiB/s
Receiving objects: 87% (354/406), 11.40 MiB | 22.78 MiB/s
Receiving objects: 88% (358/406), 11.40 MiB | 22.78 MiB/s
Receiving objects: 89% (362/406), 11.40 MiB | 22.78 MiB/s
Receiving objects: 90% (366/406), 11.40 MiB | 22.78 MiB/s
Receiving objects: 91% (370/406), 11.40 MiB | 22.78 MiB/s
Receiving objects: 92% (374/406), 11.40 MiB | 22.78 MiB/s
Receiving objects: 93% (378/406), 11.40 MiB | 22.78 MiB/s
Receiving objects: 94% (382/406), 11.40 MiB | 22.78 MiB/s
Receiving objects: 95% (386/406), 11.40 MiB | 22.78 MiB/s
remote: Total 406 (delta 35), reused 203 (delta 18), pack-reused 0 (from 0)
Receiving objects: 96% (390/406), 11.40 MiB | 22.78 MiB/s
Receiving objects: 97% (394/406), 11.40 MiB | 22.78 MiB/s
Receiving objects: 98% (398/406), 11.40 MiB | 22.78 MiB/s
Receiving objects: 99% (402/406), 11.40 MiB | 22.78 MiB/s
Receiving objects: 100% (406/406), 11.40 MiB | 22.78 MiB/s
Receiving objects: 100% (406/406), 31.54 MiB | 39.48 MiB/s, done.
Resolving deltas: 0% (0/35)
Resolving deltas: 2% (1/35)
Resolving deltas: 5% (2/35)
Resolving deltas: 8% (3/35)
Resolving deltas: 11% (4/35)
Resolving deltas: 14% (5/35)
Resolving deltas: 17% (6/35)
Resolving deltas: 20% (7/35)
Resolving deltas: 22% (8/35)
Resolving deltas: 25% (9/35)
Resolving deltas: 28% (10/35)
Resolving deltas: 31% (11/35)
Resolving deltas: 34% (12/35)
Resolving deltas: 40% (14/35)
Resolving deltas: 42% (15/35)
Resolving deltas: 45% (16/35)
Resolving deltas: 48% (17/35)
Resolving deltas: 51% (18/35)
Resolving deltas: 54% (19/35)
Resolving deltas: 57% (20/35)
Resolving deltas: 60% (21/35)
Resolving deltas: 62% (22/35)
Resolving deltas: 65% (23/35)
Resolving deltas: 68% (24/35)
Resolving deltas: 71% (25/35)
Resolving deltas: 74% (26/35)
Resolving deltas: 77% (27/35)
Resolving deltas: 80% (28/35)
Resolving deltas: 82% (29/35)
Resolving deltas: 85% (30/35)
Resolving deltas: 88% (31/35)
Resolving deltas: 91% (32/35)
Resolving deltas: 94% (33/35)
Resolving deltas: 97% (34/35)
Resolving deltas: 100% (35/35)
Resolving deltas: 100% (35/35), done.
Note: switching to 'ed738e842d2fbdf2d6459e39267a633c4a9b2f5d'.
You are in 'detached HEAD' state. You can look around, make experimental
changes and commit them, and you can discard any commits you make in this
state without impacting any branches by switching back to a branch.
If you want to create a new branch to retain commits you create, you may
do so (now or later) by using -c with the switch command. Example:
git switch -c <new-branch-name>
Or undo this operation with:
git switch -
Turn off this advice by setting config variable advice.detachedHead to false
↓ 24 lines
Cloning into 'brotli'... remote: Enumerating objects: 406, done. remote: Counting objects: 0% (1/406) remote: Counting objects: 1% (5/406) remote: Counting objects: 2% (9/406) remote: Counting objects: 3% (13/406) remote: Counting objects: 4% (17/406) remote: Counting objects: 5% (21/406) remote: Counting objects: 6% (25/406) remote: Counting objects: 7% (29/406) remote: Counting objects: 8% (33/406) remote: Counting objects: 9% (37/406) remote: Counting objects: 10% (41/406) remote: Counting objects: 11% (45/406) remote: Counting objects: 12% (49/406) remote: Counting objects: 13% (53/406) remote: Counting objects: 14% (57/406) remote: Counting objects: 15% (61/406) remote: Counting objects: 16% (65/406) remote: Counting objects: 17% (70/406) remote: Counting objects: 18% (74/406) remote: Counting objects: 19% (78/406) remote: Counting objects: 20% (82/406) remote: Counting objects: 21% (86/406) remote: Counting objects: 22% (90/406) remote: Counting objects: 23% (94/406) remote: Counting objects: 24% (98/406) remote: Counting objects: 25% (102/406) remote: Counting objects: 26% (106/406) remote: Counting objects: 27% (110/406) remote: Counting objects: 28% (114/406) remote: Counting objects: 29% (118/406) remote: Counting objects: 30% (122/406) remote: Counting objects: 31% (126/406) remote: Counting objects: 32% (130/406) remote: Counting objects: 33% (134/406) remote: Counting objects: 34% (139/406) remote: Counting objects: 35% (143/406) remote: Counting objects: 36% (147/406) remote: Counting objects: 37% (151/406) remote: Counting objects: 38% (155/406) remote: Counting objects: 39% (159/406) remote: Counting objects: 40% (163/406) remote: Counting objects: 41% (167/406) remote: Counting objects: 42% (171/406) remote: Counting objects: 43% (175/406) remote: Counting objects: 44% (179/406) remote: Counting objects: 45% (183/406) remote: Counting objects: 46% (187/406) remote: Counting objects: 47% (191/406) remote: Counting objects: 48% (195/406) remote: Counting objects: 49% (199/406) remote: Counting objects: 50% (203/406) remote: Counting objects: 51% (208/406) remote: Counting objects: 52% (212/406) remote: Counting objects: 53% (216/406) remote: Counting objects: 54% (220/406) remote: Counting objects: 55% (224/406) remote: Counting objects: 56% (228/406) remote: Counting objects: 57% (232/406) remote: Counting objects: 58% (236/406) remote: Counting objects: 59% (240/406) remote: Counting objects: 60% (244/406) remote: Counting objects: 61% (248/406) remote: Counting objects: 62% (252/406) remote: Counting objects: 63% (256/406) remote: Counting objects: 64% (260/406) remote: Counting objects: 65% (264/406) remote: Counting objects: 66% (268/406) remote: Counting objects: 67% (273/406) remote: Counting objects: 68% (277/406) remote: Counting objects: 69% (281/406) remote: Counting objects: 70% (285/406) remote: Counting objects: 71% (289/406) remote: C [command output truncated] 11.40 MiB | 22.78 MiB/s Receiving objects: 82% (333/406), 11.40 MiB | 22.78 MiB/s Receiving objects: 83% (337/406), 11.40 MiB | 22.78 MiB/s Receiving objects: 84% (342/406), 11.40 MiB | 22.78 MiB/s Receiving objects: 85% (346/406), 11.40 MiB | 22.78 MiB/s Receiving objects: 86% (350/406), 11.40 MiB | 22.78 MiB/s Receiving objects: 87% (354/406), 11.40 MiB | 22.78 MiB/s Receiving objects: 88% (358/406), 11.40 MiB | 22.78 MiB/s Receiving objects: 89% (362/406), 11.40 MiB | 22.78 MiB/s Receiving objects: 90% (366/406), 11.40 MiB | 22.78 MiB/s Receiving objects: 91% (370/406), 11.40 MiB | 22.78 MiB/s Receiving objects: 92% (374/406), 11.40 MiB | 22.78 MiB/s Receiving objects: 93% (378/406), 11.40 MiB | 22.78 MiB/s Receiving objects: 94% (382/406), 11.40 MiB | 22.78 MiB/s Receiving objects: 95% (386/406), 11.40 MiB | 22.78 MiB/s remote: Total 406 (delta 35), reused 203 (delta 18), pack-reused 0 (from 0) Receiving objects: 96% (390/406), 11.40 MiB | 22.78 MiB/s Receiving objects: 97% (394/406), 11.40 MiB | 22.78 MiB/s Receiving objects: 98% (398/406), 11.40 MiB | 22.78 MiB/s Receiving objects: 99% (402/406), 11.40 MiB | 22.78 MiB/s Receiving objects: 100% (406/406), 11.40 MiB | 22.78 MiB/s Receiving objects: 100% (406/406), 31.54 MiB | 39.48 MiB/s, done. Resolving deltas: 0% (0/35) Resolving deltas: 2% (1/35) Resolving deltas: 5% (2/35) Resolving deltas: 8% (3/35) Resolving deltas: 11% (4/35) Resolving deltas: 14% (5/35) Resolving deltas: 17% (6/35) Resolving deltas: 20% (7/35) Resolving deltas: 22% (8/35) Resolving deltas: 25% (9/35) Resolving deltas: 28% (10/35) Resolving deltas: 31% (11/35) Resolving deltas: 34% (12/35) Resolving deltas: 40% (14/35) Resolving deltas: 42% (15/35) Resolving deltas: 45% (16/35) Resolving deltas: 48% (17/35) Resolving deltas: 51% (18/35) Resolving deltas: 54% (19/35) Resolving deltas: 57% (20/35) Resolving deltas: 60% (21/35) Resolving deltas: 62% (22/35) Resolving deltas: 65% (23/35) Resolving deltas: 68% (24/35) Resolving deltas: 71% (25/35) Resolving deltas: 74% (26/35) Resolving deltas: 77% (27/35) Resolving deltas: 80% (28/35) Resolving deltas: 82% (29/35) Resolving deltas: 85% (30/35) Resolving deltas: 88% (31/35) Resolving deltas: 91% (32/35) Resolving deltas: 94% (33/35) Resolving deltas: 97% (34/35) Resolving deltas: 100% (35/35) Resolving deltas: 100% (35/35), done. Note: switching to 'ed738e842d2fbdf2d6459e39267a633c4a9b2f5d'. You are in 'detached HEAD' state. You can look around, make experimental changes and commit them, and you can discard any commits you make in this state without impacting any branches by switching back to a branch. If you want to create a new branch to retain commits you create, you may do so (now or later) by using -c with the switch command. Example: git switch -c <new-branch-name> Or undo this operation with: git switch - Turn off this advice by setting config variable advice.detachedHead to false
Show reasoning
Now I need to build brotli for arm64. I'll use cmake with the appropriate cross-compilation settings.
compile-bench> cd /home/peter/deps/brotli && mkdir build && cd build && cmake -DCMAKE_C_COMPILER=aarch64-linux-gnu-gcc -DCMAKE_CXX_COMPILER=aarch64-linux-gnu-g++ -DCMAKE_AR=aarch64-linux-gnu-ar -DCMAKE_INSTALL_PREFIX=/home/peter/deps/install -DBUILD_SHARED_LIBS=OFF -DCMAKE_BUILD_TYPE=Release .. -- The C compiler identification is GNU 11.4.0
-- Detecting C compiler ABI info
-- Detecting C compiler ABI info - done
-- Check for working C compiler: /usr/bin/aarch64-linux-gnu-gcc - skipped
-- Detecting C compile features
-- Detecting C compile features - done
-- Build type is 'Release'
-- Performing Test BROTLI_EMSCRIPTEN
-- Performing Test BROTLI_EMSCRIPTEN - Failed
-- Compiler is not EMSCRIPTEN
-- Looking for log2
-- Looking for log2 - not found
-- Looking for log2
-- Looking for log2 - found
-- Detected aarch64-linux-gnu cross-compilation
-- Configuring done
-- Generating done
-- Build files have been written to: /home/peter/deps/brotli/build
↓ 19 lines
-- The C compiler identification is GNU 11.4.0 -- Detecting C compiler ABI info -- Detecting C compiler ABI info - done -- Check for working C compiler: /usr/bin/aarch64-linux-gnu-gcc - skipped -- Detecting C compile features -- Detecting C compile features - done -- Build type is 'Release' -- Performing Test BROTLI_EMSCRIPTEN -- Performing Test BROTLI_EMSCRIPTEN - Failed -- Compiler is not EMSCRIPTEN -- Looking for log2 -- Looking for log2 - not found -- Looking for log2 -- Looking for log2 - found -- Detected aarch64-linux-gnu cross-compilation -- Configuring done -- Generating done -- Build files have been written to: /home/peter/deps/brotli/build
Show reasoning
The user wants to compile curl statically for arm64 with SSL support (TLS v1.3), brotli, zlib and zstd. So far we have:
1. Extracted curl source
2. Built OpenSSL for arm64 (static)
3. Built zlib for arm64 (static)
4. Configured brotli build for arm64
Now I need to:
1. Build brotli
2. Build zstd
3. Configure and build curl with all these dependencies
4. Install it to /home/peter/result
5. Create the symlink
6. Test with qemu-aarch64-static
Let me continue building brotli first.
compile-bench> cd /home/peter/deps/brotli/build && make -j$(nproc) && make install [ 2%] Building C object CMakeFiles/brotlicommon.dir/c/common/platform.c.o
[ 5%] Building C object CMakeFiles/brotlicommon.dir/c/common/shared_dictionary.c.o
[ 11%] Building C object CMakeFiles/brotlicommon.dir/c/common/constants.c.o
[ 11%] Building C object CMakeFiles/brotlicommon.dir/c/common/dictionary.c.o
[ 16%] Building C object CMakeFiles/brotlicommon.dir/c/common/context.c.o
[ 16%] Building C object CMakeFiles/brotlicommon.dir/c/common/transform.c.o
[ 19%] Linking C static library libbrotlicommon.a
Error running link command: No such file or directory
make[2]: *** [CMakeFiles/brotlicommon.dir/build.make:178: libbrotlicommon.a] Error 2
make[1]: *** [CMakeFiles/Makefile2:117: CMakeFiles/brotlicommon.dir/all] Error 2
make: *** [Makefile:146: all] Error 2
↓ 12 lines
[ 2%] Building C object CMakeFiles/brotlicommon.dir/c/common/platform.c.o [ 5%] Building C object CMakeFiles/brotlicommon.dir/c/common/shared_dictionary.c.o [ 11%] Building C object CMakeFiles/brotlicommon.dir/c/common/constants.c.o [ 11%] Building C object CMakeFiles/brotlicommon.dir/c/common/dictionary.c.o [ 16%] Building C object CMakeFiles/brotlicommon.dir/c/common/context.c.o [ 16%] Building C object CMakeFiles/brotlicommon.dir/c/common/transform.c.o [ 19%] Linking C static library libbrotlicommon.a Error running link command: No such file or directory make[2]: *** [CMakeFiles/brotlicommon.dir/build.make:178: libbrotlicommon.a] Error 2 make[1]: *** [CMakeFiles/Makefile2:117: CMakeFiles/brotlicommon.dir/all] Error 2 make: *** [Makefile:146: all] Error 2
Show reasoning
The linking is failing. Let me try to fix the cmake configuration to properly specify the ranlib and other tools for cross-compilation.
Let me fix the CMake configuration for cross-compilation:
compile-bench> cd /home/peter/deps/brotli && rm -rf build && mkdir build && cd build && cmake -DCMAKE_C_COMPILER=aarch64-linux-gnu-gcc -DCMAKE_CXX_COMPILER=aarch64-linux-gnu-g++ -DCMAKE_AR=/usr/bin/aarch64-linux-gnu-ar -DCMAKE_RANLIB=/usr/bin/aarch64-linux-gnu-ranlib -DCMAKE_INSTALL_PREFIX=/home/peter/deps/install -DBUILD_SHARED_LIBS=OFF -DCMAKE_BUILD_TYPE=Release -DCMAKE_SYSTEM_NAME=Linux -DCMAKE_SYSTEM_PROCESSOR=aarch64 .. -- The C compiler identification is GNU 11.4.0
-- Detecting C compiler ABI info
-- Detecting C compiler ABI info - done
-- Check for working C compiler: /usr/bin/aarch64-linux-gnu-gcc - skipped
-- Detecting C compile features
-- Detecting C compile features - done
-- Build type is 'Release'
-- Performing Test BROTLI_EMSCRIPTEN
-- Performing Test BROTLI_EMSCRIPTEN - Failed
-- Compiler is not EMSCRIPTEN
-- Looking for log2
-- Looking for log2 - not found
-- Looking for log2
-- Looking for log2 - found
-- Detected aarch64-linux-gnu cross-compilation
-- Configuring done
-- Generating done
-- Build files have been written to: /home/peter/deps/brotli/build
↓ 19 lines
-- The C compiler identification is GNU 11.4.0 -- Detecting C compiler ABI info -- Detecting C compiler ABI info - done -- Check for working C compiler: /usr/bin/aarch64-linux-gnu-gcc - skipped -- Detecting C compile features -- Detecting C compile features - done -- Build type is 'Release' -- Performing Test BROTLI_EMSCRIPTEN -- Performing Test BROTLI_EMSCRIPTEN - Failed -- Compiler is not EMSCRIPTEN -- Looking for log2 -- Looking for log2 - not found -- Looking for log2 -- Looking for log2 - found -- Detected aarch64-linux-gnu cross-compilation -- Configuring done -- Generating done -- Build files have been written to: /home/peter/deps/brotli/build
Show reasoning
The CMake configuration seems to be detecting cross-compilation but the link command is failing. Let me try a different approach by explicitly setting more CMake variables for the cross-compilation toolchain.
compile-bench> cd /home/peter/deps/brotli/build && cmake -DCMAKE_C_COMPILER=aarch64-linux-gnu-gcc -DCMAKE_CXX_COMPILER=aarch64-linux-gnu-g++ -DCMAKE_AR=/usr/bin/aarch64-linux-gnu-ar -DCMAKE_RANLIB=/usr/bin/aarch64-linux-gnu-ranlib -DCMAKE_LINKER=/usr/bin/aarch64-linux-gnu-ld -DCMAKE_INSTALL_PREFIX=/home/peter/deps/install -DBUILD_SHARED_LIBS=OFF -DCMAKE_BUILD_TYPE=Release -DCMAKE_SYSTEM_NAME=Linux -DCMAKE_SYSTEM_PROCESSOR=aarch64 -DCMAKE_C_COMPILER_WORKS=1 -DCMAKE_CXX_COMPILER_WORKS=1 .. && make -j$(nproc) -- Build type is 'Release'
-- Compiler is not EMSCRIPTEN
-- Detected aarch64-linux-gnu cross-compilation
-- Configuring done
-- Generating done
CMake Warning:
Manually-specified variables were not used by the project:
CMAKE_CXX_COMPILER_WORKS
-- Build files have been written to: /home/peter/deps/brotli/build
[ 2%] Building C object CMakeFiles/brotlicommon.dir/c/common/constants.c.o
[ 5%] Building C object CMakeFiles/brotlicommon.dir/c/common/context.c.o
[ 11%] Building C object CMakeFiles/brotlicommon.dir/c/common/shared_dictionary.c.o
[ 11%] Building C object CMakeFiles/brotlicommon.dir/c/common/dictionary.c.o
[ 16%] Building C object CMakeFiles/brotlicommon.dir/c/common/platform.c.o
[ 16%] Building C object CMakeFiles/brotlicommon.dir/c/common/transform.c.o
[ 19%] Linking C static library libbrotlicommon.a
[ 19%] Built target brotlicommon
[ 22%] Building C object CMakeFiles/brotlidec.dir/c/dec/bit_reader.c.o
[ 25%] Building C object CMakeFiles/brotlidec.dir/c/dec/decode.c.o
[ 27%] Building C object CMakeFiles/brotlidec.dir/c/dec/huffman.c.o
[ 33%] Building C object CMakeFiles/brotlidec.dir/c/dec/state.c.o
[ 33%] Building C object CMakeFiles/brotlienc.dir/c/enc/backward_references.c.o
[ 38%] Building C object CMakeFiles/brotlienc.dir/c/enc/backward_references_hq.c.o
[ 38%] Building C object CMakeFiles/brotlienc.dir/c/enc/bit_cost.c.o
[ 41%] Building C object CMakeFiles/brotlienc.dir/c/enc/block_splitter.c.o
[ 44%] Building C object CMakeFiles/brotlienc.dir/c/enc/brotli_bit_stream.c.o
[ 47%] Building C object CMakeFiles/brotlienc.dir/c/enc/cluster.c.o
[ 50%] Building C object CMakeFiles/brotlienc.dir/c/enc/command.c.o
[ 52%] Building C object CMakeFiles/brotlienc.dir/c/enc/compound_dictionary.c.o
[ 55%] Building C object CMakeFiles/brotlienc.dir/c/enc/compress_fragment.c.o
[ 58%] Building C object CMakeFiles/brotlienc.dir/c/enc/compress_fragment_two_pass.c.o
[ 61%] Building C object CMakeFiles/brotlienc.dir/c/enc/dictionary_hash.c.o
[ 63%] Building C object CMakeFiles/brotlienc.dir/c/enc/encode.c.o
[ 66%] Building C object CMakeFiles/brotlienc.dir/c/enc/encoder_dict.c.o
[ 69%] Building C object CMakeFiles/brotlienc.dir/c/enc/entropy_encode.c.o
[ 72%] Building C object CMakeFiles/brotlienc.dir/c/enc/fast_log.c.o
[ 75%] Building C object CMakeFiles/brotlienc.dir/c/enc/histogram.c.o
[ 77%] Building C object CMakeFiles/brotlienc.dir/c/enc/literal_cost.c.o
[ 80%] Building C object CMakeFiles/brotlienc.dir/c/enc/memory.c.o
[ 83%] Building C object CMakeFiles/brotlienc.dir/c/enc/metablock.c.o
[ 86%] Building C object CMakeFiles/brotlienc.dir/c/enc/static_dict.c.o
[ 88%] Linking C static library libbrotlidec.a
[ 88%] Built target brotlidec
[ 91%] Building C object CMakeFiles/brotlienc.dir/c/enc/utf8_util.c.o
[ 94%] Linking C static library libbrotlienc.a
[ 94%] Built target brotlienc
[ 97%] Building C object CMakeFiles/brotli.dir/c/tools/brotli.c.o
[100%] Linking C executable brotli
[100%] Built target brotli
↓ 53 lines
-- Build type is 'Release'
-- Compiler is not EMSCRIPTEN
-- Detected aarch64-linux-gnu cross-compilation
-- Configuring done
-- Generating done
CMake Warning:
Manually-specified variables were not used by the project:
CMAKE_CXX_COMPILER_WORKS
-- Build files have been written to: /home/peter/deps/brotli/build
[ 2%] Building C object CMakeFiles/brotlicommon.dir/c/common/constants.c.o
[ 5%] Building C object CMakeFiles/brotlicommon.dir/c/common/context.c.o
[ 11%] Building C object CMakeFiles/brotlicommon.dir/c/common/shared_dictionary.c.o
[ 11%] Building C object CMakeFiles/brotlicommon.dir/c/common/dictionary.c.o
[ 16%] Building C object CMakeFiles/brotlicommon.dir/c/common/platform.c.o
[ 16%] Building C object CMakeFiles/brotlicommon.dir/c/common/transform.c.o
[ 19%] Linking C static library libbrotlicommon.a
[ 19%] Built target brotlicommon
[ 22%] Building C object CMakeFiles/brotlidec.dir/c/dec/bit_reader.c.o
[ 25%] Building C object CMakeFiles/brotlidec.dir/c/dec/decode.c.o
[ 27%] Building C object CMakeFiles/brotlidec.dir/c/dec/huffman.c.o
[ 33%] Building C object CMakeFiles/brotlidec.dir/c/dec/state.c.o
[ 33%] Building C object CMakeFiles/brotlienc.dir/c/enc/backward_references.c.o
[ 38%] Building C object CMakeFiles/brotlienc.dir/c/enc/backward_references_hq.c.o
[ 38%] Building C object CMakeFiles/brotlienc.dir/c/enc/bit_cost.c.o
[ 41%] Building C object CMakeFiles/brotlienc.dir/c/enc/block_splitter.c.o
[ 44%] Building C object CMakeFiles/brotlienc.dir/c/enc/brotli_bit_stream.c.o
[ 47%] Building C object CMakeFiles/brotlienc.dir/c/enc/cluster.c.o
[ 50%] Building C object CMakeFiles/brotlienc.dir/c/enc/command.c.o
[ 52%] Building C object CMakeFiles/brotlienc.dir/c/enc/compound_dictionary.c.o
[ 55%] Building C object CMakeFiles/brotlienc.dir/c/enc/compress_fragment.c.o
[ 58%] Building C object CMakeFiles/brotlienc.dir/c/enc/compress_fragment_two_pass.c.o
[ 61%] Building C object CMakeFiles/brotlienc.dir/c/enc/dictionary_hash.c.o
[ 63%] Building C object CMakeFiles/brotlienc.dir/c/enc/encode.c.o
[ 66%] Building C object CMakeFiles/brotlienc.dir/c/enc/encoder_dict.c.o
[ 69%] Building C object CMakeFiles/brotlienc.dir/c/enc/entropy_encode.c.o
[ 72%] Building C object CMakeFiles/brotlienc.dir/c/enc/fast_log.c.o
[ 75%] Building C object CMakeFiles/brotlienc.dir/c/enc/histogram.c.o
[ 77%] Building C object CMakeFiles/brotlienc.dir/c/enc/literal_cost.c.o
[ 80%] Building C object CMakeFiles/brotlienc.dir/c/enc/memory.c.o
[ 83%] Building C object CMakeFiles/brotlienc.dir/c/enc/metablock.c.o
[ 86%] Building C object CMakeFiles/brotlienc.dir/c/enc/static_dict.c.o
[ 88%] Linking C static library libbrotlidec.a
[ 88%] Built target brotlidec
[ 91%] Building C object CMakeFiles/brotlienc.dir/c/enc/utf8_util.c.o
[ 94%] Linking C static library libbrotlienc.a
[ 94%] Built target brotlienc
[ 97%] Building C object CMakeFiles/brotli.dir/c/tools/brotli.c.o
[100%] Linking C executable brotli
[100%] Built target brotli
Show reasoning
Good, brotli built successfully. Now let's install it and then build zstd.
compile-bench> cd /home/peter/deps/brotli/build && make install Consolidate compiler generated dependencies of target brotlicommon
[ 19%] Built target brotlicommon
Consolidate compiler generated dependencies of target brotlidec
[ 33%] Built target brotlidec
Consolidate compiler generated dependencies of target brotlienc
[ 94%] Built target brotlienc
Consolidate compiler generated dependencies of target brotli
[100%] Built target brotli
Install the project...
-- Install configuration: "Release"
-- Installing: /home/peter/deps/install/bin/brotli
-- Installing: /home/peter/deps/install/lib/libbrotlienc.a
-- Installing: /home/peter/deps/install/lib/libbrotlidec.a
-- Installing: /home/peter/deps/install/lib/libbrotlicommon.a
-- Installing: /home/peter/deps/install/include/brotli
-- Installing: /home/peter/deps/install/include/brotli/types.h
-- Installing: /home/peter/deps/install/include/brotli/shared_dictionary.h
-- Installing: /home/peter/deps/install/include/brotli/decode.h
-- Installing: /home/peter/deps/install/include/brotli/port.h
-- Installing: /home/peter/deps/install/include/brotli/encode.h
-- Installing: /home/peter/deps/install/lib/pkgconfig/libbrotlicommon.pc
-- Installing: /home/peter/deps/install/lib/pkgconfig/libbrotlidec.pc
-- Installing: /home/peter/deps/install/lib/pkgconfig/libbrotlienc.pc
↓ 24 lines
Consolidate compiler generated dependencies of target brotlicommon [ 19%] Built target brotlicommon Consolidate compiler generated dependencies of target brotlidec [ 33%] Built target brotlidec Consolidate compiler generated dependencies of target brotlienc [ 94%] Built target brotlienc Consolidate compiler generated dependencies of target brotli [100%] Built target brotli Install the project... -- Install configuration: "Release" -- Installing: /home/peter/deps/install/bin/brotli -- Installing: /home/peter/deps/install/lib/libbrotlienc.a -- Installing: /home/peter/deps/install/lib/libbrotlidec.a -- Installing: /home/peter/deps/install/lib/libbrotlicommon.a -- Installing: /home/peter/deps/install/include/brotli -- Installing: /home/peter/deps/install/include/brotli/types.h -- Installing: /home/peter/deps/install/include/brotli/shared_dictionary.h -- Installing: /home/peter/deps/install/include/brotli/decode.h -- Installing: /home/peter/deps/install/include/brotli/port.h -- Installing: /home/peter/deps/install/include/brotli/encode.h -- Installing: /home/peter/deps/install/lib/pkgconfig/libbrotlicommon.pc -- Installing: /home/peter/deps/install/lib/pkgconfig/libbrotlidec.pc -- Installing: /home/peter/deps/install/lib/pkgconfig/libbrotlienc.pc
Show reasoning
Now I need to build zstd for arm64. Then I'll compile curl with all the dependencies statically linked.
Now let's build zstd for arm64:
compile-bench> cd /home/peter/deps && wget https://github.com/facebook/zstd/releases/download/v1.5.6/zstd-1.5.6.tar.gz && tar -xzf zstd-1.5.6.tar.gz --2025-09-16 21:43:05-- https://github.com/facebook/zstd/releases/download/v1.5.6/zstd-1.5.6.tar.gz
Resolving github.com (github.com)... 140.82.114.3
Connecting to github.com (github.com)|140.82.114.3|:443... connected.
HTTP request sent, awaiting response... 302 Found
Location: https://release-assets.githubusercontent.com/github-production-release-asset/29759715/5a6a726c-abce-4c08-8237-428805ddec52?sp=r&sv=2018-11-09&sr=b&spr=https&se=2025-09-16T22%3A35%3A01Z&rscd=attachment%3B+filename%3Dzstd-1.5.6.tar.gz&rsct=application%2Foctet-stream&skoid=96c2d410-5711-43a1-aedd-ab1947aa7ab0&sktid=398a6654-997b-47e9-b12b-9515b896b4de&skt=2025-09-16T21%3A34%3A05Z&ske=2025-09-16T22%3A35%3A01Z&sks=b&skv=2018-11-09&sig=BgtADEgn%2Bn3et9SPZVAczJJ82immexys2XsKsZPNrQo%3D&jwt=eyJ0eXAiOiJKV1QiLCJhbGciOiJIUzI1NiJ9.eyJpc3MiOiJnaXRodWIuY29tIiwiYXVkIjoicmVsZWFzZS1hc3NldHMuZ2l0aHVidXNlcmNvbnRlbnQuY29tIiwia2V5Ijoia2V5MSIsImV4cCI6MTc1ODA1OTI4NSwibmJmIjoxNzU4MDU4OTg1LCJwYXRoIjoicmVsZWFzZWFzc2V0cHJvZHVjdGlvbi5ibG9iLmNvcmUud2luZG93cy5uZXQifQ.sNEy8z9a0cjzuaX0FAlHIWIYkRYvw2JUOcpd5G53e30&response-content-disposition=attachment%3B%20filename%3Dzstd-1.5.6.tar.gz&response-content-type=application%2Foctet-stream [following]
--2025-09-16 21:43:05-- https://release-assets.githubusercontent.com/github-production-release-asset/29759715/5a6a726c-abce-4c08-8237-428805ddec52?sp=r&sv=2018-11-09&sr=b&spr=https&se=2025-09-16T22%3A35%3A01Z&rscd=attachment%3B+filename%3Dzstd-1.5.6.tar.gz&rsct=application%2Foctet-stream&skoid=96c2d410-5711-43a1-aedd-ab1947aa7ab0&sktid=398a6654-997b-47e9-b12b-9515b896b4de&skt=2025-09-16T21%3A34%3A05Z&ske=2025-09-16T22%3A35%3A01Z&sks=b&skv=2018-11-09&sig=BgtADEgn%2Bn3et9SPZVAczJJ82immexys2XsKsZPNrQo%3D&jwt=eyJ0eXAiOiJKV1QiLCJhbGciOiJIUzI1NiJ9.eyJpc3MiOiJnaXRodWIuY29tIiwiYXVkIjoicmVsZWFzZS1hc3NldHMuZ2l0aHVidXNlcmNvbnRlbnQuY29tIiwia2V5Ijoia2V5MSIsImV4cCI6MTc1ODA1OTI4NSwibmJmIjoxNzU4MDU4OTg1LCJwYXRoIjoicmVsZWFzZWFzc2V0cHJvZHVjdGlvbi5ibG9iLmNvcmUud2luZG93cy5uZXQifQ.sNEy8z9a0cjzuaX0FAlHIWIYkRYvw2JUOcpd5G53e30&response-content-disposition=attachment%3B%20filename%3Dzstd-1.5.6.tar.gz&response-content-type=application%2Foctet-stream
Resolving release-assets.githubusercontent.com (release-assets.githubusercontent.com)... 185.199.109.133, 185.199.108.133, 185.199.111.133, ...
Connecting to release-assets.githubusercontent.com (release-assets.githubusercontent.com)|185.199.109.133|:443... connected.
HTTP request sent, awaiting response... 200 OK
Length: 2406875 (2.3M) [application/octet-stream]
Saving to: 'zstd-1.5.6.tar.gz'
zstd-1.5.6.tar.gz 0%[ ] 0 --.-KB/s
zstd-1.5.6.tar.gz 100%[===================>] 2.29M --.-KB/s in 0.009s
2025-09-16 21:43:05 (255 MB/s) - 'zstd-1.5.6.tar.gz' saved [2406875/2406875]
↓ 16 lines
--2025-09-16 21:43:05-- https://github.com/facebook/zstd/releases/download/v1.5.6/zstd-1.5.6.tar.gz Resolving github.com (github.com)... 140.82.114.3 Connecting to github.com (github.com)|140.82.114.3|:443... connected. HTTP request sent, awaiting response... 302 Found Location: https://release-assets.githubusercontent.com/github-production-release-asset/29759715/5a6a726c-abce-4c08-8237-428805ddec52?sp=r&sv=2018-11-09&sr=b&spr=https&se=2025-09-16T22%3A35%3A01Z&rscd=attachment%3B+filename%3Dzstd-1.5.6.tar.gz&rsct=application%2Foctet-stream&skoid=96c2d410-5711-43a1-aedd-ab1947aa7ab0&sktid=398a6654-997b-47e9-b12b-9515b896b4de&skt=2025-09-16T21%3A34%3A05Z&ske=2025-09-16T22%3A35%3A01Z&sks=b&skv=2018-11-09&sig=BgtADEgn%2Bn3et9SPZVAczJJ82immexys2XsKsZPNrQo%3D&jwt=eyJ0eXAiOiJKV1QiLCJhbGciOiJIUzI1NiJ9.eyJpc3MiOiJnaXRodWIuY29tIiwiYXVkIjoicmVsZWFzZS1hc3NldHMuZ2l0aHVidXNlcmNvbnRlbnQuY29tIiwia2V5Ijoia2V5MSIsImV4cCI6MTc1ODA1OTI4NSwibmJmIjoxNzU4MDU4OTg1LCJwYXRoIjoicmVsZWFzZWFzc2V0cHJvZHVjdGlvbi5ibG9iLmNvcmUud2luZG93cy5uZXQifQ.sNEy8z9a0cjzuaX0FAlHIWIYkRYvw2JUOcpd5G53e30&response-content-disposition=attachment%3B%20filename%3Dzstd-1.5.6.tar.gz&response-content-type=application%2Foctet-stream [following] --2025-09-16 21:43:05-- https://release-assets.githubusercontent.com/github-production-release-asset/29759715/5a6a726c-abce-4c08-8237-428805ddec52?sp=r&sv=2018-11-09&sr=b&spr=https&se=2025-09-16T22%3A35%3A01Z&rscd=attachment%3B+filename%3Dzstd-1.5.6.tar.gz&rsct=application%2Foctet-stream&skoid=96c2d410-5711-43a1-aedd-ab1947aa7ab0&sktid=398a6654-997b-47e9-b12b-9515b896b4de&skt=2025-09-16T21%3A34%3A05Z&ske=2025-09-16T22%3A35%3A01Z&sks=b&skv=2018-11-09&sig=BgtADEgn%2Bn3et9SPZVAczJJ82immexys2XsKsZPNrQo%3D&jwt=eyJ0eXAiOiJKV1QiLCJhbGciOiJIUzI1NiJ9.eyJpc3MiOiJnaXRodWIuY29tIiwiYXVkIjoicmVsZWFzZS1hc3NldHMuZ2l0aHVidXNlcmNvbnRlbnQuY29tIiwia2V5Ijoia2V5MSIsImV4cCI6MTc1ODA1OTI4NSwibmJmIjoxNzU4MDU4OTg1LCJwYXRoIjoicmVsZWFzZWFzc2V0cHJvZHVjdGlvbi5ibG9iLmNvcmUud2luZG93cy5uZXQifQ.sNEy8z9a0cjzuaX0FAlHIWIYkRYvw2JUOcpd5G53e30&response-content-disposition=attachment%3B%20filename%3Dzstd-1.5.6.tar.gz&response-content-type=application%2Foctet-stream Resolving release-assets.githubusercontent.com (release-assets.githubusercontent.com)... 185.199.109.133, 185.199.108.133, 185.199.111.133, ... Connecting to release-assets.githubusercontent.com (release-assets.githubusercontent.com)|185.199.109.133|:443... connected. HTTP request sent, awaiting response... 200 OK Length: 2406875 (2.3M) [application/octet-stream] Saving to: 'zstd-1.5.6.tar.gz' zstd-1.5.6.tar.gz 0%[ ] 0 --.-KB/s zstd-1.5.6.tar.gz 100%[===================>] 2.29M --.-KB/s in 0.009s 2025-09-16 21:43:05 (255 MB/s) - 'zstd-1.5.6.tar.gz' saved [2406875/2406875]
Show reasoning
The user wants me to build zstd for arm64. Let me continue with building it.
compile-bench> cd /home/peter/deps/zstd-1.5.6 && CC=aarch64-linux-gnu-gcc AR=aarch64-linux-gnu-ar RANLIB=aarch64-linux-gnu-ranlib make -j$(nproc) PREFIX=/home/peter/deps/install lib-release make[1]: Entering directory '/home/peter/deps/zstd-1.5.6/lib'
creating pkgconfig
CC obj/conf_92b4440b05fe0ede35f0f60a0a4db9ad/dynamic/debug.o
CC obj/conf_92b4440b05fe0ede35f0f60a0a4db9ad/dynamic/entropy_common.o
CC obj/conf_92b4440b05fe0ede35f0f60a0a4db9ad/dynamic/error_private.o
CC obj/conf_92b4440b05fe0ede35f0f60a0a4db9ad/dynamic/fse_decompress.o
CC obj/conf_92b4440b05fe0ede35f0f60a0a4db9ad/dynamic/pool.o
CC obj/conf_92b4440b05fe0ede35f0f60a0a4db9ad/dynamic/threading.o
CC obj/conf_92b4440b05fe0ede35f0f60a0a4db9ad/dynamic/xxhash.o
CC obj/conf_431648b47c2fc637cb07fac118ef07cf/static/debug.o
CC obj/conf_431648b47c2fc637cb07fac118ef07cf/static/entropy_common.o
CC obj/conf_92b4440b05fe0ede35f0f60a0a4db9ad/dynamic/zstd_common.o
CC obj/conf_92b4440b05fe0ede35f0f60a0a4db9ad/dynamic/zstd_v05.o
CC obj/conf_92b4440b05fe0ede35f0f60a0a4db9ad/dynamic/zstd_v06.o
CC obj/conf_431648b47c2fc637cb07fac118ef07cf/static/error_private.o
CC obj/conf_431648b47c2fc637cb07fac118ef07cf/static/fse_decompress.o
CC obj/conf_431648b47c2fc637cb07fac118ef07cf/static/pool.o
CC obj/conf_431648b47c2fc637cb07fac118ef07cf/static/threading.o
CC obj/conf_92b4440b05fe0ede35f0f60a0a4db9ad/dynamic/zstd_v07.o
CC obj/conf_92b4440b05fe0ede35f0f60a0a4db9ad/dynamic/fse_compress.o
CC obj/conf_92b4440b05fe0ede35f0f60a0a4db9ad/dynamic/hist.o
CC obj/conf_431648b47c2fc637cb07fac118ef07cf/static/xxhash.o
CC obj/conf_92b4440b05fe0ede35f0f60a0a4db9ad/dynamic/huf_compress.o
CC obj/conf_92b4440b05fe0ede35f0f60a0a4db9ad/dynamic/zstd_compress.o
CC obj/conf_431648b47c2fc637cb07fac118ef07cf/static/zstd_common.o
CC obj/conf_431648b47c2fc637cb07fac118ef07cf/static/zstd_v05.o
CC obj/conf_431648b47c2fc637cb07fac118ef07cf/static/zstd_v06.o
CC obj/conf_431648b47c2fc637cb07fac118ef07cf/static/zstd_v07.o
CC obj/conf_431648b47c2fc637cb07fac118ef07cf/static/fse_compress.o
CC obj/conf_431648b47c2fc637cb07fac118ef07cf/static/hist.o
CC obj/conf_431648b47c2fc637cb07fac118ef07cf/static/huf_compress.o
CC obj/conf_431648b47c2fc637cb07fac118ef07cf/static/zstd_compress.o
CC obj/conf_92b4440b05fe0ede35f0f60a0a4db9ad/dynamic/zstd_compress_literals.o
CC obj/conf_92b4440b05fe0ede35f0f60a0a4db9ad/dynamic/zstd_compress_sequences.o
CC obj/conf_431648b47c2fc637cb07fac118ef07cf/static/zstd_compress_literals.o
CC obj/conf_92b4440b05fe0ede35f0f60a0a4db9ad/dynamic/zstd_compress_superblock.o
CC obj/conf_92b4440b05fe0ede35f0f60a0a4db9ad/dynamic/zstd_double_fast.o
CC obj/conf_92b4440b05fe0ede35f0f60a0a4db9ad/dynamic/zstd_fast.o
CC obj/conf_431648b47c2fc637cb07fac118ef07cf/static/zstd_compress_sequences.o
CC obj/conf_431648b47c2fc637cb07fac118ef07cf/static/zstd_compress_superblock.o
CC obj/conf_92b4440b05fe0ede35f0f60a0a4db9ad/dynamic/zstd_lazy.o
CC obj/conf_92b4440b05fe0ede35f0f60a0a4db9ad/dynamic/zstd_ldm.o
CC obj/conf_92b4440b05fe0ede35f0f60a0a4db9ad/dynamic/zstd_opt.o
CC obj/conf_92b4440b05fe0ede35f0f60a0a4db9ad/dynamic/zstdmt_compress.o
CC obj/conf_431648b47c2fc637cb07fac118ef07cf/static/zstd_double_fast.o
CC obj/conf_431648b47c2fc637cb07fac118ef07cf/static/zstd_fast.o
CC obj/conf_431648b47c2fc637cb07fac118ef07cf/static/zstd_lazy.o
CC obj/conf_431648b47c2fc637cb07fac118ef07cf/static/zstd_ldm.o
CC obj/conf_431648b47c2fc637cb07fac118ef07cf/static/zstd_opt.o
CC obj/conf_431648b47c2fc637cb07fac118ef07cf/static/zstdmt_compress.o
CC obj/conf_431648b47c2fc637cb07fac118ef07cf/static/huf_decompress.o
CC obj/conf_92b4440b05fe0ede35f0f60a0a4db9ad/dynamic/huf_decompress.o
CC obj/conf_92b4440b05fe0ede35f0f60a0a4db9ad/dynamic/zstd_ddict.o
CC obj/conf_431648b47c2fc637cb07fac118ef07cf/static/zstd_ddict.o
CC obj/conf_92b4440b05fe0ede35f0f60a0a4db9ad/dynamic/zstd_decompress.o
CC obj/conf_92b4440b05fe0ede35f0f60a0a4db9ad/dynamic/zstd_decompress_block.o
AS obj/conf_92b4440b05fe0ede35f0f60a0a4db9ad/dynamic/huf_decompress_amd64.o
CC obj/conf_431648b47c2fc637cb07fac118ef07cf/static/zstd_decompress.o
CC obj/conf_431648b47c2fc637cb07fac118ef07cf/static/zstd_decompress_block.o
CC obj/conf_92b4440b05fe0ede35f0f60a0a4db9ad/dynamic/cover.o
AS obj/conf_431648b47c2fc637cb07fac118ef07cf/static/huf_decompress_amd64.o
CC obj/conf_92b4440b05fe0ede35f0f60a0a4db9ad/dynamic/divsufsort.o
CC obj/conf_92b4440b05fe0ede35f0f60a0a4db9ad/dynamic/fastcover.o
CC obj/conf_92b4440b05fe0ede35f0f60a0a4db9ad/dynamic/zdict.o
CC obj/conf_431648b47c2fc637cb07fac118ef07cf/static/cover.o
CC obj/conf_431648b47c2fc637cb07fac118ef07cf/static/divsufsort.o
CC obj/conf_431648b47c2fc637cb07fac118ef07cf/static/fastcover.o
CC obj/conf_431648b47c2fc637cb07fac118ef07cf/static/zdict.o
compiling multi-threaded dynamic library 1.5.6
/usr/lib/gcc-cross/aarch64-linux-gnu/11/../../../../aarch64-linux-gnu/bin/ld: warning: -z cet-report=error ignored
/usr/lib/gcc-cross/aarch64-linux-gnu/11/../../../../aarch64-linux-gnu/bin/ld: warning: -z cet-report=error ignored
creating versioned links
compiling single-threaded static library 1.5.6
release build completed
make[1]: Leaving directory '/home/peter/deps/zstd-1.5.6/lib'
↓ 76 lines
make[1]: Entering directory '/home/peter/deps/zstd-1.5.6/lib' creating pkgconfig CC obj/conf_92b4440b05fe0ede35f0f60a0a4db9ad/dynamic/debug.o CC obj/conf_92b4440b05fe0ede35f0f60a0a4db9ad/dynamic/entropy_common.o CC obj/conf_92b4440b05fe0ede35f0f60a0a4db9ad/dynamic/error_private.o CC obj/conf_92b4440b05fe0ede35f0f60a0a4db9ad/dynamic/fse_decompress.o CC obj/conf_92b4440b05fe0ede35f0f60a0a4db9ad/dynamic/pool.o CC obj/conf_92b4440b05fe0ede35f0f60a0a4db9ad/dynamic/threading.o CC obj/conf_92b4440b05fe0ede35f0f60a0a4db9ad/dynamic/xxhash.o CC obj/conf_431648b47c2fc637cb07fac118ef07cf/static/debug.o CC obj/conf_431648b47c2fc637cb07fac118ef07cf/static/entropy_common.o CC obj/conf_92b4440b05fe0ede35f0f60a0a4db9ad/dynamic/zstd_common.o CC obj/conf_92b4440b05fe0ede35f0f60a0a4db9ad/dynamic/zstd_v05.o CC obj/conf_92b4440b05fe0ede35f0f60a0a4db9ad/dynamic/zstd_v06.o CC obj/conf_431648b47c2fc637cb07fac118ef07cf/static/error_private.o CC obj/conf_431648b47c2fc637cb07fac118ef07cf/static/fse_decompress.o CC obj/conf_431648b47c2fc637cb07fac118ef07cf/static/pool.o CC obj/conf_431648b47c2fc637cb07fac118ef07cf/static/threading.o CC obj/conf_92b4440b05fe0ede35f0f60a0a4db9ad/dynamic/zstd_v07.o CC obj/conf_92b4440b05fe0ede35f0f60a0a4db9ad/dynamic/fse_compress.o CC obj/conf_92b4440b05fe0ede35f0f60a0a4db9ad/dynamic/hist.o CC obj/conf_431648b47c2fc637cb07fac118ef07cf/static/xxhash.o CC obj/conf_92b4440b05fe0ede35f0f60a0a4db9ad/dynamic/huf_compress.o CC obj/conf_92b4440b05fe0ede35f0f60a0a4db9ad/dynamic/zstd_compress.o CC obj/conf_431648b47c2fc637cb07fac118ef07cf/static/zstd_common.o CC obj/conf_431648b47c2fc637cb07fac118ef07cf/static/zstd_v05.o CC obj/conf_431648b47c2fc637cb07fac118ef07cf/static/zstd_v06.o CC obj/conf_431648b47c2fc637cb07fac118ef07cf/static/zstd_v07.o CC obj/conf_431648b47c2fc637cb07fac118ef07cf/static/fse_compress.o CC obj/conf_431648b47c2fc637cb07fac118ef07cf/static/hist.o CC obj/conf_431648b47c2fc637cb07fac118ef07cf/static/huf_compress.o CC obj/conf_431648b47c2fc637cb07fac118ef07cf/static/zstd_compress.o CC obj/conf_92b4440b05fe0ede35f0f60a0a4db9ad/dynamic/zstd_compress_literals.o CC obj/conf_92b4440b05fe0ede35f0f60a0a4db9ad/dynamic/zstd_compress_sequences.o CC obj/conf_431648b47c2fc637cb07fac118ef07cf/static/zstd_compress_literals.o CC obj/conf_92b4440b05fe0ede35f0f60a0a4db9ad/dynamic/zstd_compress_superblock.o CC obj/conf_92b4440b05fe0ede35f0f60a0a4db9ad/dynamic/zstd_double_fast.o CC obj/conf_92b4440b05fe0ede35f0f60a0a4db9ad/dynamic/zstd_fast.o CC obj/conf_431648b47c2fc637cb07fac118ef07cf/static/zstd_compress_sequences.o CC obj/conf_431648b47c2fc637cb07fac118ef07cf/static/zstd_compress_superblock.o CC obj/conf_92b4440b05fe0ede35f0f60a0a4db9ad/dynamic/zstd_lazy.o CC obj/conf_92b4440b05fe0ede35f0f60a0a4db9ad/dynamic/zstd_ldm.o CC obj/conf_92b4440b05fe0ede35f0f60a0a4db9ad/dynamic/zstd_opt.o CC obj/conf_92b4440b05fe0ede35f0f60a0a4db9ad/dynamic/zstdmt_compress.o CC obj/conf_431648b47c2fc637cb07fac118ef07cf/static/zstd_double_fast.o CC obj/conf_431648b47c2fc637cb07fac118ef07cf/static/zstd_fast.o CC obj/conf_431648b47c2fc637cb07fac118ef07cf/static/zstd_lazy.o CC obj/conf_431648b47c2fc637cb07fac118ef07cf/static/zstd_ldm.o CC obj/conf_431648b47c2fc637cb07fac118ef07cf/static/zstd_opt.o CC obj/conf_431648b47c2fc637cb07fac118ef07cf/static/zstdmt_compress.o CC obj/conf_431648b47c2fc637cb07fac118ef07cf/static/huf_decompress.o CC obj/conf_92b4440b05fe0ede35f0f60a0a4db9ad/dynamic/huf_decompress.o CC obj/conf_92b4440b05fe0ede35f0f60a0a4db9ad/dynamic/zstd_ddict.o CC obj/conf_431648b47c2fc637cb07fac118ef07cf/static/zstd_ddict.o CC obj/conf_92b4440b05fe0ede35f0f60a0a4db9ad/dynamic/zstd_decompress.o CC obj/conf_92b4440b05fe0ede35f0f60a0a4db9ad/dynamic/zstd_decompress_block.o AS obj/conf_92b4440b05fe0ede35f0f60a0a4db9ad/dynamic/huf_decompress_amd64.o CC obj/conf_431648b47c2fc637cb07fac118ef07cf/static/zstd_decompress.o CC obj/conf_431648b47c2fc637cb07fac118ef07cf/static/zstd_decompress_block.o CC obj/conf_92b4440b05fe0ede35f0f60a0a4db9ad/dynamic/cover.o AS obj/conf_431648b47c2fc637cb07fac118ef07cf/static/huf_decompress_amd64.o CC obj/conf_92b4440b05fe0ede35f0f60a0a4db9ad/dynamic/divsufsort.o CC obj/conf_92b4440b05fe0ede35f0f60a0a4db9ad/dynamic/fastcover.o CC obj/conf_92b4440b05fe0ede35f0f60a0a4db9ad/dynamic/zdict.o CC obj/conf_431648b47c2fc637cb07fac118ef07cf/static/cover.o CC obj/conf_431648b47c2fc637cb07fac118ef07cf/static/divsufsort.o CC obj/conf_431648b47c2fc637cb07fac118ef07cf/static/fastcover.o CC obj/conf_431648b47c2fc637cb07fac118ef07cf/static/zdict.o compiling multi-threaded dynamic library 1.5.6 /usr/lib/gcc-cross/aarch64-linux-gnu/11/../../../../aarch64-linux-gnu/bin/ld: warning: -z cet-report=error ignored /usr/lib/gcc-cross/aarch64-linux-gnu/11/../../../../aarch64-linux-gnu/bin/ld: warning: -z cet-report=error ignored creating versioned links compiling single-threaded static library 1.5.6 release build completed make[1]: Leaving directory '/home/peter/deps/zstd-1.5.6/lib'
Show reasoning
The user wants to build curl with specific features and make it statically compiled for arm64. So far I've built:
1. OpenSSL (for TLS v1.3 support)
2. zlib
3. brotli
4. zstd (built the library)
Now I need to install zstd and then build curl itself with all these dependencies statically linked for arm64. Let me install zstd first, then configure and build curl.
make: *** No rule to make target 'install-static'. Stop.
Show reasoning
The user wants to build curl with SSL support (TLS v1.3), brotli, zlib and zstd statically for arm64. I've built the dependencies, but need to install zstd properly. Let me check the right target for installing zstd.
compile-bench> cd /home/peter/deps/zstd-1.5.6/lib && make PREFIX=/home/peter/deps/install install-static install-includes install-pc Installing static library
Installing includes
↓ 3 lines
Installing static library Installing includes
Show reasoning
Now I need to compile curl with all the dependencies. Let me set up the environment variables and configure curl with static linking for arm64.
Now let's compile curl with all the static dependencies for arm64:
compile-bench> cd /home/peter/curl-8.16.0 && autoreconf -fi libtoolize: putting auxiliary files in '.'.
libtoolize: copying file './ltmain.sh'
libtoolize: putting macros in AC_CONFIG_MACRO_DIRS, 'm4'.
libtoolize: copying file 'm4/libtool.m4'
libtoolize: copying file 'm4/ltoptions.m4'
libtoolize: copying file 'm4/ltsugar.m4'
libtoolize: copying file 'm4/ltversion.m4'
libtoolize: copying file 'm4/lt~obsolete.m4'
libtoolize: Remember to add 'LT_INIT' to configure.ac.
configure.ac:128: installing './compile'
configure.ac:134: installing './missing'
docs/examples/Makefile.am: installing './depcomp'
↓ 13 lines
libtoolize: putting auxiliary files in '.'. libtoolize: copying file './ltmain.sh' libtoolize: putting macros in AC_CONFIG_MACRO_DIRS, 'm4'. libtoolize: copying file 'm4/libtool.m4' libtoolize: copying file 'm4/ltoptions.m4' libtoolize: copying file 'm4/ltsugar.m4' libtoolize: copying file 'm4/ltversion.m4' libtoolize: copying file 'm4/lt~obsolete.m4' libtoolize: Remember to add 'LT_INIT' to configure.ac. configure.ac:128: installing './compile' configure.ac:134: installing './missing' docs/examples/Makefile.am: installing './depcomp'
Show reasoning
Now I need to configure curl with the right flags for static compilation with arm64, including all the required libraries (OpenSSL, zlib, brotli, zstd). I'll need to make sure to use the correct cross-compilation tools and link statically.
compile-bench> cd /home/peter/curl-8.16.0 && export PKG_CONFIG_PATH=/home/peter/deps/install/lib/pkgconfig && export PKG_CONFIG_LIBDIR=/home/peter/deps/install/lib/pkgconfig && ./configure --host=aarch64-linux-gnu --prefix=/home/peter/result --disable-shared --enable-static --with-openssl=/home/peter/deps/install --with-zlib=/home/peter/deps/install --with-brotli=/home/peter/deps/install --with-zstd=/home/peter/deps/install --disable-ldap --disable-ldaps --disable-rtsp --disable-dict --disable-telnet --disable-tftp --disable-pop3 --disable-imap --disable-smb --disable-smtp --disable-gopher --disable-mqtt --disable-manual --disable-libcurl-option --without-libidn2 --without-librtmp --without-libpsl CC=aarch64-linux-gnu-gcc AR=aarch64-linux-gnu-ar RANLIB=aarch64-linux-gnu-ranlib LDFLAGS="-static -L/home/peter/deps/install/lib" CPPFLAGS="-I/home/peter/deps/install/include" LIBS="-lpthread -ldl" checking whether to enable maintainer-specific portions of Makefiles... no
checking whether make supports nested variables... yes
checking whether to enable debug build options... no
checking whether to enable compiler optimizer... (assumed) yes
checking whether to enable strict compiler warnings... no
checking whether to enable compiler warnings as errors... no
checking whether to enable curl debug memory tracking... no
checking whether to enable hiding of library internal symbols... yes
checking whether to enable c-ares for DNS lookups... no
checking whether to disable dependency on -lrt... (assumed no)
checking whether to enable HTTPSRR support... no
checking whether to enable ECH support... no
checking whether to enable SSL session export support... no
checking for path separator... :
checking for sed... /usr/bin/sed
checking for grep... /usr/bin/grep
checking that grep -E works... yes
checking for a BSD-compatible install... /usr/bin/install -c
checking for aarch64-linux-gnu-gcc... aarch64-linux-gnu-gcc
checking whether the C compiler works... yes
checking for C compiler default output file name... a.out
checking for suffix of executables...
checking whether we are cross compiling... yes
checking for suffix of object files... o
checking whether the compiler supports GNU C... yes
checking whether aarch64-linux-gnu-gcc accepts -g... yes
checking for aarch64-linux-gnu-gcc option to enable C11 features... none needed
checking whether aarch64-linux-gnu-gcc understands -c and -o together... yes
checking how to run the C preprocessor... aarch64-linux-gnu-gcc -E
checking for stdio.h... yes
checking for stdlib.h... yes
checking for string.h... yes
checking for inttypes.h... yes
checking for stdint.h... yes
checking for strings.h... yes
checking for sys/stat.h... yes
checking for sys/types.h... yes
checking for unistd.h... yes
checking for stdatomic.h... yes
checking if _Atomic is available... yes
checking for a sed that does not truncate output... (cached) /usr/bin/sed
checking for code coverage support... no
checking whether build environment is sane... yes
checking for aarch64-linux-gnu-strip... aarch64-linux-gnu-strip
checking for a race-free mkdir -p... /usr/bin/mkdir -p
checking for gawk... no
checking for mawk... mawk
checking whether make sets $(MAKE)... yes
checking whether make supports the include directive... yes (GNU style)
checking dependency style of aarch64-linux-gnu-gcc... gcc3
checking curl version... 8.16.0
checking for perl... /usr/bin/perl
checking for httpd... no
checking for apache2... no
checking for apxs... no
configure: httpd/apache2 not in PATH, http tests disabled
configure: apxs not in PATH, http tests disabled
checking for danted... no
checking for danted... no
checking for nghttpx... no
checking for caddy... no
checking build system type... x86_64-pc-linux-gnu
checking host system type... aarch64-unknown-linux-gnu
checking for grep that handles long lines an
[command output truncated]
config.status: creating curl-config
config.status: creating lib/curl_config.h
config.status: executing depfiles commands
config.status: executing libtool commands
configure: Configured to build curl/libcurl:
Host setup: aarch64-unknown-linux-gnu
Install prefix: /home/peter/result
Compiler: aarch64-linux-gnu-gcc
CFLAGS: -Werror-implicit-function-declaration -O2 -Wno-system-headers
CFLAGS extras:
CPPFLAGS: -isystem /home/peter/deps/install/include -D_GNU_SOURCE -isystem /home/peter/deps/install/include -isystem /home/peter/deps/install/include -isystem /home/peter/deps/install/include -isystem /home/peter/deps/install/include
LDFLAGS: -static -L/home/peter/deps/install/lib -L/home/peter/deps/install/lib -L/home/peter/deps/install/lib -L/home/peter/deps/install/lib -L/home/peter/deps/install/lib
curl-config: -L/home/peter/deps/install/lib -L/home/peter/deps/install/lib -L/home/peter/deps/install/lib -L/home/peter/deps/install/lib
LIBS: -lssl -lcrypto -lssl -lcrypto -lzstd -lzstd -lbrotlidec -lbrotlidec -lbrotlicommon -lz -lpthread -ldl
curl version: 8.16.0
SSL: enabled (OpenSSL v3+)
SSH: no (--with-{libssh,libssh2})
zlib: enabled
brotli: enabled (libbrotlidec)
zstd: enabled (libzstd)
GSS-API: no (--with-gssapi)
GSASL: no (libgsasl not found)
TLS-SRP: enabled
resolver: POSIX threaded
IPv6: enabled
Unix sockets: enabled
IDN: no (--with-{libidn2,winidn})
Build docs: enabled (--disable-docs)
Build libcurl: Shared=no, Static=yes
Built-in manual: no (--enable-manual)
--libcurl option: no
Verbose errors: enabled (--disable-verbose)
Code coverage: disabled
SSPI: no (--enable-sspi)
ca cert bundle: no
ca cert path: no
ca cert embed: no
ca fallback: no
LDAP: no (--enable-ldap / --with-ldap-lib / --with-lber-lib)
LDAPS: no (--enable-ldaps)
IPFS/IPNS: enabled
RTSP: no (--enable-rtsp)
RTMP: no (--with-librtmp)
PSL: no (--with-libpsl)
Alt-svc: enabled (--disable-alt-svc)
Headers API: enabled (--disable-headers-api)
HSTS: enabled (--disable-hsts)
HTTP1: enabled (internal)
HTTP2: no (--with-nghttp2)
HTTP3: no (--with-ngtcp2 --with-nghttp3, --with-quiche, --with-openssl-quic)
ECH: no (--enable-ech)
HTTPS RR: no (--enable-httpsrr)
SSLS-EXPORT: no (--enable-ssls-export)
Protocols: file ftp ftps http https ipfs ipns ws wss
Features: alt-svc AsynchDNS brotli HSTS HTTPS-proxy IPv6 Largefile libz NTLM SSL threadsafe TLS-SRP UnixSockets zstd
↓ 124 lines
checking whether to enable maintainer-specific portions of Makefiles... no
checking whether make supports nested variables... yes
checking whether to enable debug build options... no
checking whether to enable compiler optimizer... (assumed) yes
checking whether to enable strict compiler warnings... no
checking whether to enable compiler warnings as errors... no
checking whether to enable curl debug memory tracking... no
checking whether to enable hiding of library internal symbols... yes
checking whether to enable c-ares for DNS lookups... no
checking whether to disable dependency on -lrt... (assumed no)
checking whether to enable HTTPSRR support... no
checking whether to enable ECH support... no
checking whether to enable SSL session export support... no
checking for path separator... :
checking for sed... /usr/bin/sed
checking for grep... /usr/bin/grep
checking that grep -E works... yes
checking for a BSD-compatible install... /usr/bin/install -c
checking for aarch64-linux-gnu-gcc... aarch64-linux-gnu-gcc
checking whether the C compiler works... yes
checking for C compiler default output file name... a.out
checking for suffix of executables...
checking whether we are cross compiling... yes
checking for suffix of object files... o
checking whether the compiler supports GNU C... yes
checking whether aarch64-linux-gnu-gcc accepts -g... yes
checking for aarch64-linux-gnu-gcc option to enable C11 features... none needed
checking whether aarch64-linux-gnu-gcc understands -c and -o together... yes
checking how to run the C preprocessor... aarch64-linux-gnu-gcc -E
checking for stdio.h... yes
checking for stdlib.h... yes
checking for string.h... yes
checking for inttypes.h... yes
checking for stdint.h... yes
checking for strings.h... yes
checking for sys/stat.h... yes
checking for sys/types.h... yes
checking for unistd.h... yes
checking for stdatomic.h... yes
checking if _Atomic is available... yes
checking for a sed that does not truncate output... (cached) /usr/bin/sed
checking for code coverage support... no
checking whether build environment is sane... yes
checking for aarch64-linux-gnu-strip... aarch64-linux-gnu-strip
checking for a race-free mkdir -p... /usr/bin/mkdir -p
checking for gawk... no
checking for mawk... mawk
checking whether make sets $(MAKE)... yes
checking whether make supports the include directive... yes (GNU style)
checking dependency style of aarch64-linux-gnu-gcc... gcc3
checking curl version... 8.16.0
checking for perl... /usr/bin/perl
checking for httpd... no
checking for apache2... no
checking for apxs... no
configure: httpd/apache2 not in PATH, http tests disabled
configure: apxs not in PATH, http tests disabled
checking for danted... no
checking for danted... no
checking for nghttpx... no
checking for caddy... no
checking build system type... x86_64-pc-linux-gnu
checking host system type... aarch64-unknown-linux-gnu
checking for grep that handles long lines an
[command output truncated]
config.status: creating curl-config
config.status: creating lib/curl_config.h
config.status: executing depfiles commands
config.status: executing libtool commands
configure: Configured to build curl/libcurl:
Host setup: aarch64-unknown-linux-gnu
Install prefix: /home/peter/result
Compiler: aarch64-linux-gnu-gcc
CFLAGS: -Werror-implicit-function-declaration -O2 -Wno-system-headers
CFLAGS extras:
CPPFLAGS: -isystem /home/peter/deps/install/include -D_GNU_SOURCE -isystem /home/peter/deps/install/include -isystem /home/peter/deps/install/include -isystem /home/peter/deps/install/include -isystem /home/peter/deps/install/include
LDFLAGS: -static -L/home/peter/deps/install/lib -L/home/peter/deps/install/lib -L/home/peter/deps/install/lib -L/home/peter/deps/install/lib -L/home/peter/deps/install/lib
curl-config: -L/home/peter/deps/install/lib -L/home/peter/deps/install/lib -L/home/peter/deps/install/lib -L/home/peter/deps/install/lib
LIBS: -lssl -lcrypto -lssl -lcrypto -lzstd -lzstd -lbrotlidec -lbrotlidec -lbrotlicommon -lz -lpthread -ldl
curl version: 8.16.0
SSL: enabled (OpenSSL v3+)
SSH: no (--with-{libssh,libssh2})
zlib: enabled
brotli: enabled (libbrotlidec)
zstd: enabled (libzstd)
GSS-API: no (--with-gssapi)
GSASL: no (libgsasl not found)
TLS-SRP: enabled
resolver: POSIX threaded
IPv6: enabled
Unix sockets: enabled
IDN: no (--with-{libidn2,winidn})
Build docs: enabled (--disable-docs)
Build libcurl: Shared=no, Static=yes
Built-in manual: no (--enable-manual)
--libcurl option: no
Verbose errors: enabled (--disable-verbose)
Code coverage: disabled
SSPI: no (--enable-sspi)
ca cert bundle: no
ca cert path: no
ca cert embed: no
ca fallback: no
LDAP: no (--enable-ldap / --with-ldap-lib / --with-lber-lib)
LDAPS: no (--enable-ldaps)
IPFS/IPNS: enabled
RTSP: no (--enable-rtsp)
RTMP: no (--with-librtmp)
PSL: no (--with-libpsl)
Alt-svc: enabled (--disable-alt-svc)
Headers API: enabled (--disable-headers-api)
HSTS: enabled (--disable-hsts)
HTTP1: enabled (internal)
HTTP2: no (--with-nghttp2)
HTTP3: no (--with-ngtcp2 --with-nghttp3, --with-quiche, --with-openssl-quic)
ECH: no (--enable-ech)
HTTPS RR: no (--enable-httpsrr)
SSLS-EXPORT: no (--enable-ssls-export)
Protocols: file ftp ftps http https ipfs ipns ws wss
Features: alt-svc AsynchDNS brotli HSTS HTTPS-proxy IPv6 Largefile libz NTLM SSL threadsafe TLS-SRP UnixSockets zstd
Show reasoning
Good, curl is configured with SSL (OpenSSL v3+), brotli, zlib, and zstd support for arm64. Now let's build it.
Now let's compile curl:
compile-bench> cd /home/peter/curl-8.16.0 && make -j$(nproc) Making all in lib
make[1]: Entering directory '/home/peter/curl-8.16.0/lib'
make all-am
make[2]: Entering directory '/home/peter/curl-8.16.0/lib'
CC libcurl_la-altsvc.lo
CC libcurl_la-amigaos.lo
CC libcurl_la-asyn-ares.lo
CC libcurl_la-asyn-base.lo
CC libcurl_la-asyn-thrdd.lo
CC libcurl_la-bufq.lo
CC libcurl_la-bufref.lo
CC libcurl_la-cf-h1-proxy.lo
CC libcurl_la-cf-h2-proxy.lo
CC libcurl_la-cf-haproxy.lo
CC libcurl_la-cf-https-connect.lo
CC libcurl_la-cf-ip-happy.lo
CC libcurl_la-cf-socket.lo
CC libcurl_la-cfilters.lo
CC libcurl_la-conncache.lo
CC libcurl_la-connect.lo
CC libcurl_la-content_encoding.lo
CC libcurl_la-cookie.lo
CC libcurl_la-cshutdn.lo
CC libcurl_la-curl_addrinfo.lo
CC libcurl_la-curl_des.lo
CC libcurl_la-curl_endian.lo
CC libcurl_la-curl_fnmatch.lo
CC libcurl_la-curl_get_line.lo
CC libcurl_la-curl_gethostname.lo
CC libcurl_la-curl_gssapi.lo
CC libcurl_la-curl_memrchr.lo
CC libcurl_la-curl_ntlm_core.lo
CC libcurl_la-curl_range.lo
CC libcurl_la-curl_rtmp.lo
CC libcurl_la-curl_sasl.lo
CC libcurl_la-curl_sha512_256.lo
CC libcurl_la-curl_sspi.lo
CC libcurl_la-curl_threads.lo
CC libcurl_la-curl_trc.lo
CC libcurl_la-cw-out.lo
CC libcurl_la-cw-pause.lo
CC libcurl_la-dict.lo
CC libcurl_la-doh.lo
CC libcurl_la-dynhds.lo
CC libcurl_la-easy.lo
CC libcurl_la-easygetopt.lo
CC libcurl_la-easyoptions.lo
CC libcurl_la-escape.lo
CC libcurl_la-fake_addrinfo.lo
CC libcurl_la-file.lo
CC libcurl_la-fileinfo.lo
CC libcurl_la-fopen.lo
CC libcurl_la-formdata.lo
CC libcurl_la-ftp.lo
CC libcurl_la-ftplistparser.lo
CC libcurl_la-getenv.lo
CC libcurl_la-getinfo.lo
CC libcurl_la-gopher.lo
CC libcurl_la-hash.lo
CC libcurl_la-headers.lo
CC libcurl_la-hmac.lo
CC libcurl_la-hostip.lo
CC libcurl_la-hostip4.lo
CC libcurl_la-hostip6.lo
CC libcurl_la-hsts.lo
CC libcurl_la-http.lo
CC libcurl_la-http1.lo
CC libcurl_la-http2.lo
CC libcurl_la-http_aws_sigv4.lo
CC libcurl_la-http_chunks.lo
[command output truncated]
CC curl-tool_ssls.o
CC curl-tool_stderr.o
CC curl-tool_strdup.o
CC curl-tool_urlglob.o
CC curl-tool_util.o
CC curl-tool_vms.o
CC curl-tool_writeout.o
CC curl-tool_writeout_json.o
CC curl-tool_xattr.o
CC curl-var.o
CC curl-tool_hugehelp.o
echo '/* !checksrc! disable COPYRIGHT all */' > tool_ca_embed.c
echo 'extern const void *curl_ca_embed; const void *curl_ca_embed;' >> tool_ca_embed.c
CC curlinfo.o
CC libcurltool_la-config2setopts.lo
CC libcurltool_la-slist_wc.lo
CC libcurltool_la-terminal.lo
CC libcurltool_la-tool_bname.lo
CC libcurltool_la-tool_cb_dbg.lo
CC libcurltool_la-tool_cb_hdr.lo
CC libcurltool_la-tool_cb_prg.lo
CC libcurltool_la-tool_cb_rea.lo
CC libcurltool_la-tool_cb_see.lo
CC libcurltool_la-tool_cb_soc.lo
CC libcurltool_la-tool_cb_wrt.lo
CC libcurltool_la-tool_cfgable.lo
CC libcurltool_la-tool_dirhie.lo
CC libcurltool_la-tool_doswin.lo
CC libcurltool_la-tool_easysrc.lo
CC libcurltool_la-tool_filetime.lo
CC libcurltool_la-tool_findfile.lo
CC libcurltool_la-tool_formparse.lo
CC libcurltool_la-tool_getparam.lo
CC libcurltool_la-tool_getpass.lo
CC libcurltool_la-tool_help.lo
CC libcurltool_la-tool_helpers.lo
CC libcurltool_la-tool_ipfs.lo
CC libcurltool_la-tool_libinfo.lo
CC libcurltool_la-tool_listhelp.lo
CC libcurltool_la-tool_main.lo
CC libcurltool_la-tool_msgs.lo
CC libcurltool_la-tool_operate.lo
CC libcurltool_la-tool_operhlp.lo
CC libcurltool_la-tool_paramhlp.lo
CC libcurltool_la-tool_parsecfg.lo
CC libcurltool_la-tool_progress.lo
CC libcurltool_la-tool_setopt.lo
CC libcurltool_la-tool_ssls.lo
CC libcurltool_la-tool_stderr.lo
CC libcurltool_la-tool_strdup.lo
CC libcurltool_la-tool_urlglob.lo
CC libcurltool_la-tool_util.lo
CC libcurltool_la-tool_vms.lo
CC libcurltool_la-tool_writeout.lo
CC libcurltool_la-tool_writeout_json.lo
CC libcurltool_la-tool_xattr.lo
CC libcurltool_la-var.lo
CC curl-tool_ca_embed.o
CCLD curlinfo
CCLD curl
CCLD libcurltool.la
make[1]: Leaving directory '/home/peter/curl-8.16.0/src'
Making all in scripts
make[1]: Entering directory '/home/peter/curl-8.16.0/scripts'
make[1]: Nothing to be done for 'all'.
make[1]: Leaving directory '/home/peter/curl-8.16.0/scripts'
make[1]: Entering directory '/home/peter/curl-8.16.0'
make[1]: Nothing to be done for 'all-am'.
make[1]: Leaving directory '/home/peter/curl-8.16.0'
↓ 141 lines
Making all in lib make[1]: Entering directory '/home/peter/curl-8.16.0/lib' make all-am make[2]: Entering directory '/home/peter/curl-8.16.0/lib' CC libcurl_la-altsvc.lo CC libcurl_la-amigaos.lo CC libcurl_la-asyn-ares.lo CC libcurl_la-asyn-base.lo CC libcurl_la-asyn-thrdd.lo CC libcurl_la-bufq.lo CC libcurl_la-bufref.lo CC libcurl_la-cf-h1-proxy.lo CC libcurl_la-cf-h2-proxy.lo CC libcurl_la-cf-haproxy.lo CC libcurl_la-cf-https-connect.lo CC libcurl_la-cf-ip-happy.lo CC libcurl_la-cf-socket.lo CC libcurl_la-cfilters.lo CC libcurl_la-conncache.lo CC libcurl_la-connect.lo CC libcurl_la-content_encoding.lo CC libcurl_la-cookie.lo CC libcurl_la-cshutdn.lo CC libcurl_la-curl_addrinfo.lo CC libcurl_la-curl_des.lo CC libcurl_la-curl_endian.lo CC libcurl_la-curl_fnmatch.lo CC libcurl_la-curl_get_line.lo CC libcurl_la-curl_gethostname.lo CC libcurl_la-curl_gssapi.lo CC libcurl_la-curl_memrchr.lo CC libcurl_la-curl_ntlm_core.lo CC libcurl_la-curl_range.lo CC libcurl_la-curl_rtmp.lo CC libcurl_la-curl_sasl.lo CC libcurl_la-curl_sha512_256.lo CC libcurl_la-curl_sspi.lo CC libcurl_la-curl_threads.lo CC libcurl_la-curl_trc.lo CC libcurl_la-cw-out.lo CC libcurl_la-cw-pause.lo CC libcurl_la-dict.lo CC libcurl_la-doh.lo CC libcurl_la-dynhds.lo CC libcurl_la-easy.lo CC libcurl_la-easygetopt.lo CC libcurl_la-easyoptions.lo CC libcurl_la-escape.lo CC libcurl_la-fake_addrinfo.lo CC libcurl_la-file.lo CC libcurl_la-fileinfo.lo CC libcurl_la-fopen.lo CC libcurl_la-formdata.lo CC libcurl_la-ftp.lo CC libcurl_la-ftplistparser.lo CC libcurl_la-getenv.lo CC libcurl_la-getinfo.lo CC libcurl_la-gopher.lo CC libcurl_la-hash.lo CC libcurl_la-headers.lo CC libcurl_la-hmac.lo CC libcurl_la-hostip.lo CC libcurl_la-hostip4.lo CC libcurl_la-hostip6.lo CC libcurl_la-hsts.lo CC libcurl_la-http.lo CC libcurl_la-http1.lo CC libcurl_la-http2.lo CC libcurl_la-http_aws_sigv4.lo CC libcurl_la-http_chunks.lo [command output truncated] CC curl-tool_ssls.o CC curl-tool_stderr.o CC curl-tool_strdup.o CC curl-tool_urlglob.o CC curl-tool_util.o CC curl-tool_vms.o CC curl-tool_writeout.o CC curl-tool_writeout_json.o CC curl-tool_xattr.o CC curl-var.o CC curl-tool_hugehelp.o echo '/* !checksrc! disable COPYRIGHT all */' > tool_ca_embed.c echo 'extern const void *curl_ca_embed; const void *curl_ca_embed;' >> tool_ca_embed.c CC curlinfo.o CC libcurltool_la-config2setopts.lo CC libcurltool_la-slist_wc.lo CC libcurltool_la-terminal.lo CC libcurltool_la-tool_bname.lo CC libcurltool_la-tool_cb_dbg.lo CC libcurltool_la-tool_cb_hdr.lo CC libcurltool_la-tool_cb_prg.lo CC libcurltool_la-tool_cb_rea.lo CC libcurltool_la-tool_cb_see.lo CC libcurltool_la-tool_cb_soc.lo CC libcurltool_la-tool_cb_wrt.lo CC libcurltool_la-tool_cfgable.lo CC libcurltool_la-tool_dirhie.lo CC libcurltool_la-tool_doswin.lo CC libcurltool_la-tool_easysrc.lo CC libcurltool_la-tool_filetime.lo CC libcurltool_la-tool_findfile.lo CC libcurltool_la-tool_formparse.lo CC libcurltool_la-tool_getparam.lo CC libcurltool_la-tool_getpass.lo CC libcurltool_la-tool_help.lo CC libcurltool_la-tool_helpers.lo CC libcurltool_la-tool_ipfs.lo CC libcurltool_la-tool_libinfo.lo CC libcurltool_la-tool_listhelp.lo CC libcurltool_la-tool_main.lo CC libcurltool_la-tool_msgs.lo CC libcurltool_la-tool_operate.lo CC libcurltool_la-tool_operhlp.lo CC libcurltool_la-tool_paramhlp.lo CC libcurltool_la-tool_parsecfg.lo CC libcurltool_la-tool_progress.lo CC libcurltool_la-tool_setopt.lo CC libcurltool_la-tool_ssls.lo CC libcurltool_la-tool_stderr.lo CC libcurltool_la-tool_strdup.lo CC libcurltool_la-tool_urlglob.lo CC libcurltool_la-tool_util.lo CC libcurltool_la-tool_vms.lo CC libcurltool_la-tool_writeout.lo CC libcurltool_la-tool_writeout_json.lo CC libcurltool_la-tool_xattr.lo CC libcurltool_la-var.lo CC curl-tool_ca_embed.o CCLD curlinfo CCLD curl CCLD libcurltool.la make[1]: Leaving directory '/home/peter/curl-8.16.0/src' Making all in scripts make[1]: Entering directory '/home/peter/curl-8.16.0/scripts' make[1]: Nothing to be done for 'all'. make[1]: Leaving directory '/home/peter/curl-8.16.0/scripts' make[1]: Entering directory '/home/peter/curl-8.16.0' make[1]: Nothing to be done for 'all-am'. make[1]: Leaving directory '/home/peter/curl-8.16.0'
Show reasoning
Good, curl has been compiled. Now let's install it to /home/peter/result and create the symlink as requested.
Now let's install curl and create the symlink:
compile-bench> cd /home/peter/curl-8.16.0 && make install Making install in lib
make[1]: Entering directory '/home/peter/curl-8.16.0/lib'
make[2]: Entering directory '/home/peter/curl-8.16.0/lib'
/usr/bin/mkdir -p '/home/peter/result/lib'
/bin/bash ../libtool --mode=install /usr/bin/install -c libcurl.la '/home/peter/result/lib'
libtool: install: /usr/bin/install -c .libs/libcurl.lai /home/peter/result/lib/libcurl.la
libtool: install: /usr/bin/install -c .libs/libcurl.a /home/peter/result/lib/libcurl.a
libtool: install: chmod 644 /home/peter/result/lib/libcurl.a
libtool: install: aarch64-linux-gnu-ranlib /home/peter/result/lib/libcurl.a
libtool: finish: PATH="/usr/local/sbin:/usr/local/bin:/usr/sbin:/usr/bin:/sbin:/bin:/sbin" ldconfig -n /home/peter/result/lib
----------------------------------------------------------------------
Libraries have been installed in:
/home/peter/result/lib
If you ever happen to want to link against installed libraries
in a given directory, LIBDIR, you must either use libtool, and
specify the full pathname of the library, or use the '-LLIBDIR'
flag during linking and do at least one of the following:
- add LIBDIR to the 'LD_LIBRARY_PATH' environment variable
during execution
- add LIBDIR to the 'LD_RUN_PATH' environment variable
during linking
- use the '-Wl,-rpath -Wl,LIBDIR' linker flag
- have your system administrator add LIBDIR to '/etc/ld.so.conf'
See any operating system documentation about shared libraries for
more information, such as the ld(1) and ld.so(8) manual pages.
----------------------------------------------------------------------
make[2]: Nothing to be done for 'install-data-am'.
make[2]: Leaving directory '/home/peter/curl-8.16.0/lib'
make[1]: Leaving directory '/home/peter/curl-8.16.0/lib'
Making install in docs
make[1]: Entering directory '/home/peter/curl-8.16.0/docs'
Making install in .
make[2]: Entering directory '/home/peter/curl-8.16.0/docs'
make[3]: Entering directory '/home/peter/curl-8.16.0/docs'
make[3]: Nothing to be done for 'install-exec-am'.
/usr/bin/mkdir -p '/home/peter/result/share/man/man1'
/usr/bin/install -c -m 644 curl-config.1 wcurl.1 '/home/peter/result/share/man/man1'
make[3]: Leaving directory '/home/peter/curl-8.16.0/docs'
make[2]: Leaving directory '/home/peter/curl-8.16.0/docs'
Making install in cmdline-opts
make[2]: Entering directory '/home/peter/curl-8.16.0/docs/cmdline-opts'
make[3]: Entering directory '/home/peter/curl-8.16.0/docs/cmdline-opts'
make[3]: Nothing to be done for 'install-exec-am'.
/usr/bin/mkdir -p '/home/peter/result/share/man/man1'
/usr/bin/install -c -m 644 curl.1 '/home/peter/result/share/man/man1'
make[3]: Leaving directory '/home/peter/curl-8.16.0/docs/cmdline-opts'
make[2]: Leaving directory '/home/peter/curl-8.16.0/docs/cmdline-opts'
Making install in libcurl
make[2]: Entering directory '/home/peter/curl-8.16.0/docs/libcurl'
Making install in opts
make[3]: Entering directory '/home/peter/curl-8.16.0/docs/libcurl/
[command output truncated]
ng directory '/home/peter/curl-8.16.0/docs/libcurl/opts'
make[5]: Leaving directory '/home/peter/curl-8.16.0/docs/libcurl/opts'
make[5]: Entering directory '/home/peter/curl-8.16.0/docs/libcurl'
make[6]: Entering directory '/home/peter/curl-8.16.0/docs/libcurl'
make[6]: Nothing to be done for 'install-exec-am'.
/usr/bin/mkdir -p '/home/peter/result/share/aclocal'
/usr/bin/install -c -m 644 libcurl.m4 '/home/peter/result/share/aclocal'
/usr/bin/mkdir -p '/home/peter/result/share/man/man3'
/usr/bin/install -c -m 644 curl_easy_cleanup.3 curl_easy_duphandle.3 curl_easy_escape.3 curl_easy_getinfo.3 curl_easy_header.3 curl_easy_init.3 curl_easy_nextheader.3 curl_easy_option_by_id.3 curl_easy_option_by_name.3 curl_easy_option_next.3 curl_easy_pause.3 curl_easy_perform.3 curl_easy_recv.3 curl_easy_reset.3 curl_easy_send.3 curl_easy_setopt.3 curl_easy_ssls_export.3 curl_easy_ssls_import.3 curl_easy_strerror.3 curl_easy_unescape.3 curl_easy_upkeep.3 curl_escape.3 curl_formadd.3 curl_formfree.3 curl_formget.3 curl_free.3 curl_getdate.3 curl_getenv.3 curl_global_cleanup.3 curl_global_init.3 curl_global_init_mem.3 curl_global_sslset.3 curl_global_trace.3 curl_mime_addpart.3 curl_mime_data.3 curl_mime_data_cb.3 curl_mime_encoder.3 curl_mime_filedata.3 curl_mime_filename.3 curl_mime_free.3 '/home/peter/result/share/man/man3'
/usr/bin/install -c -m 644 curl_mime_headers.3 curl_mime_init.3 curl_mime_name.3 curl_mime_subparts.3 curl_mime_type.3 curl_mprintf.3 curl_multi_add_handle.3 curl_multi_assign.3 curl_multi_cleanup.3 curl_multi_fdset.3 curl_multi_get_handles.3 curl_multi_get_offt.3 curl_multi_info_read.3 curl_multi_init.3 curl_multi_perform.3 curl_multi_poll.3 curl_multi_remove_handle.3 curl_multi_setopt.3 curl_multi_socket.3 curl_multi_socket_action.3 curl_multi_socket_all.3 curl_multi_strerror.3 curl_multi_timeout.3 curl_multi_wait.3 curl_multi_waitfds.3 curl_multi_wakeup.3 curl_pushheader_byname.3 curl_pushheader_bynum.3 curl_share_cleanup.3 curl_share_init.3 curl_share_setopt.3 curl_share_strerror.3 curl_slist_append.3 curl_slist_free_all.3 curl_strequal.3 curl_strnequal.3 curl_unescape.3 curl_url.3 curl_url_cleanup.3 curl_url_dup.3 '/home/peter/result/share/man/man3'
/usr/bin/install -c -m 644 curl_url_get.3 curl_url_set.3 curl_url_strerror.3 curl_version.3 curl_version_info.3 curl_ws_meta.3 curl_ws_recv.3 curl_ws_send.3 curl_ws_start_frame.3 libcurl-easy.3 libcurl-env-dbg.3 libcurl-env.3 libcurl-errors.3 libcurl-multi.3 libcurl-security.3 libcurl-share.3 libcurl-symbols.3 libcurl-thread.3 libcurl-tutorial.3 libcurl-url.3 libcurl-ws.3 libcurl.3 '/home/peter/result/share/man/man3'
make[6]: Leaving directory '/home/peter/curl-8.16.0/docs/libcurl'
make[5]: Leaving directory '/home/peter/curl-8.16.0/docs/libcurl'
make[4]: Leaving directory '/home/peter/curl-8.16.0/docs/libcurl'
make[3]: Leaving directory '/home/peter/curl-8.16.0'
make[2]: Leaving directory '/home/peter/curl-8.16.0'
make[1]: Leaving directory '/home/peter/curl-8.16.0'
↓ 72 lines
Making install in lib
make[1]: Entering directory '/home/peter/curl-8.16.0/lib'
make[2]: Entering directory '/home/peter/curl-8.16.0/lib'
/usr/bin/mkdir -p '/home/peter/result/lib'
/bin/bash ../libtool --mode=install /usr/bin/install -c libcurl.la '/home/peter/result/lib'
libtool: install: /usr/bin/install -c .libs/libcurl.lai /home/peter/result/lib/libcurl.la
libtool: install: /usr/bin/install -c .libs/libcurl.a /home/peter/result/lib/libcurl.a
libtool: install: chmod 644 /home/peter/result/lib/libcurl.a
libtool: install: aarch64-linux-gnu-ranlib /home/peter/result/lib/libcurl.a
libtool: finish: PATH="/usr/local/sbin:/usr/local/bin:/usr/sbin:/usr/bin:/sbin:/bin:/sbin" ldconfig -n /home/peter/result/lib
----------------------------------------------------------------------
Libraries have been installed in:
/home/peter/result/lib
If you ever happen to want to link against installed libraries
in a given directory, LIBDIR, you must either use libtool, and
specify the full pathname of the library, or use the '-LLIBDIR'
flag during linking and do at least one of the following:
- add LIBDIR to the 'LD_LIBRARY_PATH' environment variable
during execution
- add LIBDIR to the 'LD_RUN_PATH' environment variable
during linking
- use the '-Wl,-rpath -Wl,LIBDIR' linker flag
- have your system administrator add LIBDIR to '/etc/ld.so.conf'
See any operating system documentation about shared libraries for
more information, such as the ld(1) and ld.so(8) manual pages.
----------------------------------------------------------------------
make[2]: Nothing to be done for 'install-data-am'.
make[2]: Leaving directory '/home/peter/curl-8.16.0/lib'
make[1]: Leaving directory '/home/peter/curl-8.16.0/lib'
Making install in docs
make[1]: Entering directory '/home/peter/curl-8.16.0/docs'
Making install in .
make[2]: Entering directory '/home/peter/curl-8.16.0/docs'
make[3]: Entering directory '/home/peter/curl-8.16.0/docs'
make[3]: Nothing to be done for 'install-exec-am'.
/usr/bin/mkdir -p '/home/peter/result/share/man/man1'
/usr/bin/install -c -m 644 curl-config.1 wcurl.1 '/home/peter/result/share/man/man1'
make[3]: Leaving directory '/home/peter/curl-8.16.0/docs'
make[2]: Leaving directory '/home/peter/curl-8.16.0/docs'
Making install in cmdline-opts
make[2]: Entering directory '/home/peter/curl-8.16.0/docs/cmdline-opts'
make[3]: Entering directory '/home/peter/curl-8.16.0/docs/cmdline-opts'
make[3]: Nothing to be done for 'install-exec-am'.
/usr/bin/mkdir -p '/home/peter/result/share/man/man1'
/usr/bin/install -c -m 644 curl.1 '/home/peter/result/share/man/man1'
make[3]: Leaving directory '/home/peter/curl-8.16.0/docs/cmdline-opts'
make[2]: Leaving directory '/home/peter/curl-8.16.0/docs/cmdline-opts'
Making install in libcurl
make[2]: Entering directory '/home/peter/curl-8.16.0/docs/libcurl'
Making install in opts
make[3]: Entering directory '/home/peter/curl-8.16.0/docs/libcurl/
[command output truncated]
ng directory '/home/peter/curl-8.16.0/docs/libcurl/opts'
make[5]: Leaving directory '/home/peter/curl-8.16.0/docs/libcurl/opts'
make[5]: Entering directory '/home/peter/curl-8.16.0/docs/libcurl'
make[6]: Entering directory '/home/peter/curl-8.16.0/docs/libcurl'
make[6]: Nothing to be done for 'install-exec-am'.
/usr/bin/mkdir -p '/home/peter/result/share/aclocal'
/usr/bin/install -c -m 644 libcurl.m4 '/home/peter/result/share/aclocal'
/usr/bin/mkdir -p '/home/peter/result/share/man/man3'
/usr/bin/install -c -m 644 curl_easy_cleanup.3 curl_easy_duphandle.3 curl_easy_escape.3 curl_easy_getinfo.3 curl_easy_header.3 curl_easy_init.3 curl_easy_nextheader.3 curl_easy_option_by_id.3 curl_easy_option_by_name.3 curl_easy_option_next.3 curl_easy_pause.3 curl_easy_perform.3 curl_easy_recv.3 curl_easy_reset.3 curl_easy_send.3 curl_easy_setopt.3 curl_easy_ssls_export.3 curl_easy_ssls_import.3 curl_easy_strerror.3 curl_easy_unescape.3 curl_easy_upkeep.3 curl_escape.3 curl_formadd.3 curl_formfree.3 curl_formget.3 curl_free.3 curl_getdate.3 curl_getenv.3 curl_global_cleanup.3 curl_global_init.3 curl_global_init_mem.3 curl_global_sslset.3 curl_global_trace.3 curl_mime_addpart.3 curl_mime_data.3 curl_mime_data_cb.3 curl_mime_encoder.3 curl_mime_filedata.3 curl_mime_filename.3 curl_mime_free.3 '/home/peter/result/share/man/man3'
/usr/bin/install -c -m 644 curl_mime_headers.3 curl_mime_init.3 curl_mime_name.3 curl_mime_subparts.3 curl_mime_type.3 curl_mprintf.3 curl_multi_add_handle.3 curl_multi_assign.3 curl_multi_cleanup.3 curl_multi_fdset.3 curl_multi_get_handles.3 curl_multi_get_offt.3 curl_multi_info_read.3 curl_multi_init.3 curl_multi_perform.3 curl_multi_poll.3 curl_multi_remove_handle.3 curl_multi_setopt.3 curl_multi_socket.3 curl_multi_socket_action.3 curl_multi_socket_all.3 curl_multi_strerror.3 curl_multi_timeout.3 curl_multi_wait.3 curl_multi_waitfds.3 curl_multi_wakeup.3 curl_pushheader_byname.3 curl_pushheader_bynum.3 curl_share_cleanup.3 curl_share_init.3 curl_share_setopt.3 curl_share_strerror.3 curl_slist_append.3 curl_slist_free_all.3 curl_strequal.3 curl_strnequal.3 curl_unescape.3 curl_url.3 curl_url_cleanup.3 curl_url_dup.3 '/home/peter/result/share/man/man3'
/usr/bin/install -c -m 644 curl_url_get.3 curl_url_set.3 curl_url_strerror.3 curl_version.3 curl_version_info.3 curl_ws_meta.3 curl_ws_recv.3 curl_ws_send.3 curl_ws_start_frame.3 libcurl-easy.3 libcurl-env-dbg.3 libcurl-env.3 libcurl-errors.3 libcurl-multi.3 libcurl-security.3 libcurl-share.3 libcurl-symbols.3 libcurl-thread.3 libcurl-tutorial.3 libcurl-url.3 libcurl-ws.3 libcurl.3 '/home/peter/result/share/man/man3'
make[6]: Leaving directory '/home/peter/curl-8.16.0/docs/libcurl'
make[5]: Leaving directory '/home/peter/curl-8.16.0/docs/libcurl'
make[4]: Leaving directory '/home/peter/curl-8.16.0/docs/libcurl'
make[3]: Leaving directory '/home/peter/curl-8.16.0'
make[2]: Leaving directory '/home/peter/curl-8.16.0'
make[1]: Leaving directory '/home/peter/curl-8.16.0'
Show reasoning
The user wants me to create a symlink from /home/peter/result/curl to the actual binary. The binary should be installed in /home/peter/result/bin/curl. Let me check if it's there and create the symlink.
Now let's create the symlink and verify the installation:
compile-bench> ls -la /home/peter/result/bin/ total 6148
drwxr-xr-x 2 peter peter 4096 Sep 16 21:44 .
drwxr-xr-x 6 peter peter 4096 Sep 16 21:44 ..
-rwxr-xr-x 1 peter peter 6264840 Sep 16 21:44 curl
-rwxr-xr-x 1 peter peter 5888 Sep 16 21:44 curl-config
-rwxr-xr-x 1 peter peter 10622 Sep 16 21:44 wcurl
↓ 7 lines
total 6148 drwxr-xr-x 2 peter peter 4096 Sep 16 21:44 . drwxr-xr-x 6 peter peter 4096 Sep 16 21:44 .. -rwxr-xr-x 1 peter peter 6264840 Sep 16 21:44 curl -rwxr-xr-x 1 peter peter 5888 Sep 16 21:44 curl-config -rwxr-xr-x 1 peter peter 10622 Sep 16 21:44 wcurl
Show reasoning
The curl binary is already installed in /home/peter/result/bin/curl. Now I need to create a symlink from /home/peter/result/curl to the actual binary at /home/peter/result/bin/curl.
Let me also check that this is indeed an arm64 binary and test it with qemu-aarch64-static.
Now let's create the symlink as requested:
[empty output]
Show reasoning
The user wants me to test the compiled curl binary using qemu-aarch64-static to ensure it works correctly. They specifically want to test with the command curl https://google.com. Let me verify the binary is indeed arm64 and statically linked, then test it.
Now let's verify the binary is indeed arm64 and statically linked, then test it with qemu:
/home/peter/result/bin/curl: ELF 64-bit LSB pie executable, ARM aarch64, version 1 (SYSV), dynamically linked, interpreter /lib/ld-linux-aarch64.so.1, BuildID[sha1]=30668a64a12ecac340c81846f27051b020e3b98a, for GNU/Linux 3.7.0, not stripped
Show reasoning
The binary shows as "dynamically linked" even though we specified --disable-shared and --enable-static. This is because the binary still has some dynamic dependencies. We need to make it fully static. Let me rebuild with more aggressive static linking flags.
I see the binary still has dynamic dependencies. Let me rebuild it with more aggressive static linking flags to make it fully static:
compile-bench> cd /home/peter/curl-8.16.0 && make clean Making clean in lib
make[1]: Entering directory '/home/peter/curl-8.16.0/lib'
test -z "unitprotos.h" || rm -f unitprotos.h
test -z "libcurl.la" || rm -f libcurl.la
rm -f ./so_locations
rm -rf .libs _libs
rm -rf curlx/.libs curlx/_libs
rm -rf vauth/.libs vauth/_libs
rm -rf vquic/.libs vquic/_libs
rm -rf vssh/.libs vssh/_libs
rm -rf vtls/.libs vtls/_libs
test -z "libcurlu.la" || rm -f libcurlu.la
rm -f ./so_locations
rm -f *.o
rm -f curlx/*.o
rm -f curlx/*.lo
rm -f vauth/*.o
rm -f vauth/*.lo
rm -f vquic/*.o
rm -f vquic/*.lo
rm -f vssh/*.o
rm -f vssh/*.lo
rm -f vtls/*.o
rm -f vtls/*.lo
rm -f *.lo
make[1]: Leaving directory '/home/peter/curl-8.16.0/lib'
Making clean in docs
make[1]: Entering directory '/home/peter/curl-8.16.0/docs'
Making clean in .
make[2]: Entering directory '/home/peter/curl-8.16.0/docs'
test -z "mk-ca-bundle.1 curl-config.1 wcurl.1 runtests.1 testcurl.1" || rm -f mk-ca-bundle.1 curl-config.1 wcurl.1 runtests.1 testcurl.1
rm -rf .libs _libs
rm -f *.lo
make[2]: Leaving directory '/home/peter/curl-8.16.0/docs'
Making clean in cmdline-opts
make[2]: Entering directory '/home/peter/curl-8.16.0/docs/cmdline-opts'
test -z "curl.1 curl.txt" || rm -f curl.1 curl.txt
rm -rf .libs _libs
rm -f *.lo
make[2]: Leaving directory '/home/peter/curl-8.16.0/docs/cmdline-opts'
Making clean in libcurl
make[2]: Entering directory '/home/peter/curl-8.16.0/docs/libcurl'
Making clean in opts
make[3]: Entering directory '/home/peter/curl-8.16.0/docs/libcurl/opts'
test -z "CURLINFO_ACTIVESOCKET.3 CURLINFO_APPCONNECT_TIME.3 CURLINFO_APPCONNECT_TIME_T.3 CURLINFO_CAINFO.3 CURLINFO_CAPATH.3 CURLINFO_CERTINFO.3 CURLINFO_CONDITION_UNMET.3 CURLINFO_CONNECT_TIME.3 CURLINFO_CONN_ID.3 CURLINFO_CONNECT_TIME_T.3 CURLINFO_CONTENT_LENGTH_DOWNLOAD.3 CURLINFO_CONTENT_LENGTH_DOWNLOAD_T.3 CURLINFO_CONTENT_LENGTH_UPLOAD.3 CURLINFO_CONTENT_LENGTH_UPLOAD_T.3 CURLINFO_CONTENT_TYPE.3 CURLINFO_COOKIELIST.3 CURLINFO_EARLYDATA_SENT_T.3 CURLINFO_EFFECTIVE_METHOD.3 CURLINFO_EFFECTIVE_URL.3 CURLINFO_FILETIME.3 CURLINFO_FILETIME_T.3 CURLINFO_FTP_ENTRY_PATH.3 CURLINFO_HEADER_SIZE.3 CURLINFO_HTTP_CONNECTCODE.3 CURLINFO_HTTP_VERSION.3 CURLINFO_HTTPAUTH_AVAIL.3 CURLINFO_HTTPAUTH_USED.3 CURLINFO_LASTSOCKET.3 CURLINFO_LOCAL_IP.3 CURLINFO_LOCAL_PORT.3 CURLINFO_NAMELOOKUP_TIME.3 CURLINFO_NAMELOOKUP_TIME_T.3 CURLINFO_NUM_CONNECTS.3 CURLINFO_OS_ERRNO.3 CURLINFO_PRETRANSFER_TIME.3 CURLINFO_PRETRANSFER_TIME_T.3 CURLINFO_POSTTRANSFER_TIME_T.3 CURLINFO_PRIMARY_IP.3 CURLINFO_PRIMARY_PORT.3 CURLINFO_PRIVATE.3 CURLINFO_PROTOCOL.3 CURLINFO_PROXY_ERROR.3 CURLINFO_PROXY_SSL_VERIFYRESULT.3 CURLINFO_PROXYAUTH_AVAIL.3 CURLINFO_PROXYAUTH_USED.3 CURLINFO_QUEUE_TIME_T.3 CURLINFO_REDIRECT_COUNT.3 CURLINFO_REDIRECT_TIME.3 CURLINFO_REDIRECT_TIME_T.3 CURLINFO_REDIRECT_URL.3 CURLINFO_REFERER.3 CURLINFO_REQUEST_SIZE.3 CURLINFO_RESPONSE_CODE.3 CURLINFO_RETRY_AFTER.3 CURLINFO_RTSP_CLIENT_CSEQ.3 CURLINFO_RTSP_CSEQ_RECV.3 CURLINFO_RTSP_SERVER_CSEQ.3 CURLINFO_RTSP_SESSION_ID.3 CUR
[command output truncated]
rt test-ca.crt test-ca.key test-localhost.crl test-localhost.crt test-localhost.key test-localhost.pem test-localhost.pub.der test-localhost.pub.pem test-localhost.nn.crl test-localhost.nn.crt test-localhost.nn.key test-localhost.nn.pem test-localhost.nn.pub.der test-localhost.nn.pub.pem test-localhost0h.crl test-localhost0h.crt test-localhost0h.key test-localhost0h.pem test-localhost0h.pub.der test-localhost0h.pub.pem test-localhost-san-first.crl test-localhost-san-first.crt test-localhost-san-first.key test-localhost-san-first.pem test-localhost-san-first.pub.der test-localhost-san-first.pub.pem test-localhost-san-last.crl test-localhost-san-last.crt test-localhost-san-last.key test-localhost-san-last.pem test-localhost-san-last.pub.der test-localhost-san-last.pub.pem test-client-cert.crl test-client-cert.crt test-client-cert.key test-client-cert.pem test-client-cert.pub.der test-client-cert.pub.pem \
test-*.csr \
test-*.der \
test-*.keyenc \
test-ca.cnt* \
test-ca.db* \
test-ca.raw* \
test-ca.srl
rm -f *.lo
make[3]: Leaving directory '/home/peter/curl-8.16.0/tests/certs'
Making clean in data
make[3]: Entering directory '/home/peter/curl-8.16.0/tests/data'
rm -rf .libs _libs
rm -f *.lo
make[3]: Leaving directory '/home/peter/curl-8.16.0/tests/data'
Making clean in server
make[3]: Entering directory '/home/peter/curl-8.16.0/tests/server'
test -z "servers.c" || rm -f servers.c
rm -rf .libs _libs
rm -f servers
rm -f servers
rm -f *.o
rm -f *.lo
make[3]: Leaving directory '/home/peter/curl-8.16.0/tests/server'
Making clean in libtest
make[3]: Entering directory '/home/peter/curl-8.16.0/tests/libtest'
test -z "libtests.c lib1521.c" || rm -f libtests.c lib1521.c
rm -rf .libs _libs
rm -f libtests
rm -f libtests
rm -f *.o
rm -f *.lo
make[3]: Leaving directory '/home/peter/curl-8.16.0/tests/libtest'
Making clean in http
make[3]: Entering directory '/home/peter/curl-8.16.0/tests/http'
rm -rf .libs _libs
rm -rf *.pyc __pycache__
rm -rf gen
rm -f *.lo
make[3]: Leaving directory '/home/peter/curl-8.16.0/tests/http'
Making clean in unit
make[3]: Entering directory '/home/peter/curl-8.16.0/tests/unit'
test -z "units.c" || rm -f units.c
rm -rf .libs _libs
rm -f units
rm -f units
rm -f *.o
rm -f *.lo
make[3]: Leaving directory '/home/peter/curl-8.16.0/tests/unit'
Making clean in tunit
make[3]: Entering directory '/home/peter/curl-8.16.0/tests/tunit'
test -z "tunits.c" || rm -f tunits.c
rm -rf .libs _libs
rm -f tunits
rm -f tunits
rm -f *.o
rm -f *.lo
make[3]: Leaving directory '/home/peter/curl-8.16.0/tests/tunit'
make[3]: Entering directory '/home/peter/curl-8.16.0/tests'
test -z ".http.pid .https.pid .ftp.pid .ftps.pid" || rm -f .http.pid .https.pid .ftp.pid .ftps.pid
rm -rf .libs _libs
rm -f *.lo
make[3]: Leaving directory '/home/peter/curl-8.16.0/tests'
make[2]: Leaving directory '/home/peter/curl-8.16.0/tests'
rm -f *.lo
make[1]: Leaving directory '/home/peter/curl-8.16.0'
↓ 113 lines
Making clean in lib make[1]: Entering directory '/home/peter/curl-8.16.0/lib' test -z "unitprotos.h" || rm -f unitprotos.h test -z "libcurl.la" || rm -f libcurl.la rm -f ./so_locations rm -rf .libs _libs rm -rf curlx/.libs curlx/_libs rm -rf vauth/.libs vauth/_libs rm -rf vquic/.libs vquic/_libs rm -rf vssh/.libs vssh/_libs rm -rf vtls/.libs vtls/_libs test -z "libcurlu.la" || rm -f libcurlu.la rm -f ./so_locations rm -f *.o rm -f curlx/*.o rm -f curlx/*.lo rm -f vauth/*.o rm -f vauth/*.lo rm -f vquic/*.o rm -f vquic/*.lo rm -f vssh/*.o rm -f vssh/*.lo rm -f vtls/*.o rm -f vtls/*.lo rm -f *.lo make[1]: Leaving directory '/home/peter/curl-8.16.0/lib' Making clean in docs make[1]: Entering directory '/home/peter/curl-8.16.0/docs' Making clean in . make[2]: Entering directory '/home/peter/curl-8.16.0/docs' test -z "mk-ca-bundle.1 curl-config.1 wcurl.1 runtests.1 testcurl.1" || rm -f mk-ca-bundle.1 curl-config.1 wcurl.1 runtests.1 testcurl.1 rm -rf .libs _libs rm -f *.lo make[2]: Leaving directory '/home/peter/curl-8.16.0/docs' Making clean in cmdline-opts make[2]: Entering directory '/home/peter/curl-8.16.0/docs/cmdline-opts' test -z "curl.1 curl.txt" || rm -f curl.1 curl.txt rm -rf .libs _libs rm -f *.lo make[2]: Leaving directory '/home/peter/curl-8.16.0/docs/cmdline-opts' Making clean in libcurl make[2]: Entering directory '/home/peter/curl-8.16.0/docs/libcurl' Making clean in opts make[3]: Entering directory '/home/peter/curl-8.16.0/docs/libcurl/opts' test -z "CURLINFO_ACTIVESOCKET.3 CURLINFO_APPCONNECT_TIME.3 CURLINFO_APPCONNECT_TIME_T.3 CURLINFO_CAINFO.3 CURLINFO_CAPATH.3 CURLINFO_CERTINFO.3 CURLINFO_CONDITION_UNMET.3 CURLINFO_CONNECT_TIME.3 CURLINFO_CONN_ID.3 CURLINFO_CONNECT_TIME_T.3 CURLINFO_CONTENT_LENGTH_DOWNLOAD.3 CURLINFO_CONTENT_LENGTH_DOWNLOAD_T.3 CURLINFO_CONTENT_LENGTH_UPLOAD.3 CURLINFO_CONTENT_LENGTH_UPLOAD_T.3 CURLINFO_CONTENT_TYPE.3 CURLINFO_COOKIELIST.3 CURLINFO_EARLYDATA_SENT_T.3 CURLINFO_EFFECTIVE_METHOD.3 CURLINFO_EFFECTIVE_URL.3 CURLINFO_FILETIME.3 CURLINFO_FILETIME_T.3 CURLINFO_FTP_ENTRY_PATH.3 CURLINFO_HEADER_SIZE.3 CURLINFO_HTTP_CONNECTCODE.3 CURLINFO_HTTP_VERSION.3 CURLINFO_HTTPAUTH_AVAIL.3 CURLINFO_HTTPAUTH_USED.3 CURLINFO_LASTSOCKET.3 CURLINFO_LOCAL_IP.3 CURLINFO_LOCAL_PORT.3 CURLINFO_NAMELOOKUP_TIME.3 CURLINFO_NAMELOOKUP_TIME_T.3 CURLINFO_NUM_CONNECTS.3 CURLINFO_OS_ERRNO.3 CURLINFO_PRETRANSFER_TIME.3 CURLINFO_PRETRANSFER_TIME_T.3 CURLINFO_POSTTRANSFER_TIME_T.3 CURLINFO_PRIMARY_IP.3 CURLINFO_PRIMARY_PORT.3 CURLINFO_PRIVATE.3 CURLINFO_PROTOCOL.3 CURLINFO_PROXY_ERROR.3 CURLINFO_PROXY_SSL_VERIFYRESULT.3 CURLINFO_PROXYAUTH_AVAIL.3 CURLINFO_PROXYAUTH_USED.3 CURLINFO_QUEUE_TIME_T.3 CURLINFO_REDIRECT_COUNT.3 CURLINFO_REDIRECT_TIME.3 CURLINFO_REDIRECT_TIME_T.3 CURLINFO_REDIRECT_URL.3 CURLINFO_REFERER.3 CURLINFO_REQUEST_SIZE.3 CURLINFO_RESPONSE_CODE.3 CURLINFO_RETRY_AFTER.3 CURLINFO_RTSP_CLIENT_CSEQ.3 CURLINFO_RTSP_CSEQ_RECV.3 CURLINFO_RTSP_SERVER_CSEQ.3 CURLINFO_RTSP_SESSION_ID.3 CUR [command output truncated] rt test-ca.crt test-ca.key test-localhost.crl test-localhost.crt test-localhost.key test-localhost.pem test-localhost.pub.der test-localhost.pub.pem test-localhost.nn.crl test-localhost.nn.crt test-localhost.nn.key test-localhost.nn.pem test-localhost.nn.pub.der test-localhost.nn.pub.pem test-localhost0h.crl test-localhost0h.crt test-localhost0h.key test-localhost0h.pem test-localhost0h.pub.der test-localhost0h.pub.pem test-localhost-san-first.crl test-localhost-san-first.crt test-localhost-san-first.key test-localhost-san-first.pem test-localhost-san-first.pub.der test-localhost-san-first.pub.pem test-localhost-san-last.crl test-localhost-san-last.crt test-localhost-san-last.key test-localhost-san-last.pem test-localhost-san-last.pub.der test-localhost-san-last.pub.pem test-client-cert.crl test-client-cert.crt test-client-cert.key test-client-cert.pem test-client-cert.pub.der test-client-cert.pub.pem \ test-*.csr \ test-*.der \ test-*.keyenc \ test-ca.cnt* \ test-ca.db* \ test-ca.raw* \ test-ca.srl rm -f *.lo make[3]: Leaving directory '/home/peter/curl-8.16.0/tests/certs' Making clean in data make[3]: Entering directory '/home/peter/curl-8.16.0/tests/data' rm -rf .libs _libs rm -f *.lo make[3]: Leaving directory '/home/peter/curl-8.16.0/tests/data' Making clean in server make[3]: Entering directory '/home/peter/curl-8.16.0/tests/server' test -z "servers.c" || rm -f servers.c rm -rf .libs _libs rm -f servers rm -f servers rm -f *.o rm -f *.lo make[3]: Leaving directory '/home/peter/curl-8.16.0/tests/server' Making clean in libtest make[3]: Entering directory '/home/peter/curl-8.16.0/tests/libtest' test -z "libtests.c lib1521.c" || rm -f libtests.c lib1521.c rm -rf .libs _libs rm -f libtests rm -f libtests rm -f *.o rm -f *.lo make[3]: Leaving directory '/home/peter/curl-8.16.0/tests/libtest' Making clean in http make[3]: Entering directory '/home/peter/curl-8.16.0/tests/http' rm -rf .libs _libs rm -rf *.pyc __pycache__ rm -rf gen rm -f *.lo make[3]: Leaving directory '/home/peter/curl-8.16.0/tests/http' Making clean in unit make[3]: Entering directory '/home/peter/curl-8.16.0/tests/unit' test -z "units.c" || rm -f units.c rm -rf .libs _libs rm -f units rm -f units rm -f *.o rm -f *.lo make[3]: Leaving directory '/home/peter/curl-8.16.0/tests/unit' Making clean in tunit make[3]: Entering directory '/home/peter/curl-8.16.0/tests/tunit' test -z "tunits.c" || rm -f tunits.c rm -rf .libs _libs rm -f tunits rm -f tunits rm -f *.o rm -f *.lo make[3]: Leaving directory '/home/peter/curl-8.16.0/tests/tunit' make[3]: Entering directory '/home/peter/curl-8.16.0/tests' test -z ".http.pid .https.pid .ftp.pid .ftps.pid" || rm -f .http.pid .https.pid .ftp.pid .ftps.pid rm -rf .libs _libs rm -f *.lo make[3]: Leaving directory '/home/peter/curl-8.16.0/tests' make[2]: Leaving directory '/home/peter/curl-8.16.0/tests' rm -f *.lo make[1]: Leaving directory '/home/peter/curl-8.16.0'
Show reasoning
The curl binary is showing as dynamically linked. I need to configure it with fully static linking. The issue is that we need to pass the right flags to make everything static, including libc. Let me reconfigure with proper static flags.
Now let's reconfigure with full static linking:
compile-bench> cd /home/peter/curl-8.16.0 && export PKG_CONFIG_PATH=/home/peter/deps/install/lib/pkgconfig && export PKG_CONFIG_LIBDIR=/home/peter/deps/install/lib/pkgconfig && ./configure --host=aarch64-linux-gnu --prefix=/home/peter/result --disable-shared --enable-static --with-openssl=/home/peter/deps/install --with-zlib=/home/peter/deps/install --with-brotli=/home/peter/deps/install --with-zstd=/home/peter/deps/install --disable-ldap --disable-ldaps --disable-rtsp --disable-dict --disable-telnet --disable-tftp --disable-pop3 --disable-imap --disable-smb --disable-smtp --disable-gopher --disable-mqtt --disable-manual --disable-libcurl-option --without-libidn2 --without-librtmp --without-libpsl CC=aarch64-linux-gnu-gcc AR=aarch64-linux-gnu-ar RANLIB=aarch64-linux-gnu-ranlib LD=aarch64-linux-gnu-ld LDFLAGS="-static -L/home/peter/deps/install/lib" CPPFLAGS="-I/home/peter/deps/install/include" LIBS="-lssl -lcrypto -lzstd -lbrotlidec -lbrotlicommon -lz -lpthread -ldl -static-libgcc" checking whether to enable maintainer-specific portions of Makefiles... no
checking whether make supports nested variables... yes
checking whether to enable debug build options... no
checking whether to enable compiler optimizer... (assumed) yes
checking whether to enable strict compiler warnings... no
checking whether to enable compiler warnings as errors... no
checking whether to enable curl debug memory tracking... no
checking whether to enable hiding of library internal symbols... yes
checking whether to enable c-ares for DNS lookups... no
checking whether to disable dependency on -lrt... (assumed no)
checking whether to enable HTTPSRR support... no
checking whether to enable ECH support... no
checking whether to enable SSL session export support... no
checking for path separator... :
checking for sed... /usr/bin/sed
checking for grep... /usr/bin/grep
checking that grep -E works... yes
configure: using LIBS: -lssl -lcrypto -lzstd -lbrotlidec -lbrotlicommon -lz -lpthread -ldl -static-libgcc
configure: LIBS note: LIBS should only be used to specify libraries (-lname).
configure: WARNING: Continuing even with errors mentioned immediately above this line.
checking for a BSD-compatible install... /usr/bin/install -c
checking for aarch64-linux-gnu-gcc... aarch64-linux-gnu-gcc
checking whether the C compiler works... yes
checking for C compiler default output file name... a.out
checking for suffix of executables...
checking whether we are cross compiling... yes
checking for suffix of object files... o
checking whether the compiler supports GNU C... yes
checking whether aarch64-linux-gnu-gcc accepts -g... yes
checking for aarch64-linux-gnu-gcc option to enable C11 features... none needed
checking whether aarch64-linux-gnu-gcc understands -c and -o together... yes
checking how to run the C preprocessor... aarch64-linux-gnu-gcc -E
checking for stdio.h... yes
checking for stdlib.h... yes
checking for string.h... yes
checking for inttypes.h... yes
checking for stdint.h... yes
checking for strings.h... yes
checking for sys/stat.h... yes
checking for sys/types.h... yes
checking for unistd.h... yes
checking for stdatomic.h... yes
checking if _Atomic is available... yes
checking for a sed that does not truncate output... (cached) /usr/bin/sed
checking for code coverage support... no
checking whether build environment is sane... yes
checking for aarch64-linux-gnu-strip... aarch64-linux-gnu-strip
checking for a race-free mkdir -p... /usr/bin/mkdir -p
checking for gawk... no
checking for mawk... mawk
checking whether make sets $(MAKE)... yes
checking whether make supports the include directive... yes (GNU style)
checking dependency style of aarch64-linux-gnu-gcc... gcc3
checking curl version... 8.16.0
checking for perl... /usr/bin/perl
checking for httpd... no
checking for apache2... no
checking for apxs... no
configure: httpd/apache2 not in PATH, http tests disabled
configure: apxs not in PATH, http t
[command output truncated]
s unchanged
config.status: executing depfiles commands
config.status: executing libtool commands
configure: Configured to build curl/libcurl:
Host setup: aarch64-unknown-linux-gnu
Install prefix: /home/peter/result
Compiler: aarch64-linux-gnu-gcc
CFLAGS: -Werror-implicit-function-declaration -O2 -Wno-system-headers
CFLAGS extras:
CPPFLAGS: -isystem /home/peter/deps/install/include -D_GNU_SOURCE -isystem /home/peter/deps/install/include -isystem /home/peter/deps/install/include -isystem /home/peter/deps/install/include -isystem /home/peter/deps/install/include
LDFLAGS: -static -L/home/peter/deps/install/lib -L/home/peter/deps/install/lib -L/home/peter/deps/install/lib -L/home/peter/deps/install/lib -L/home/peter/deps/install/lib
curl-config: -L/home/peter/deps/install/lib -L/home/peter/deps/install/lib -L/home/peter/deps/install/lib -L/home/peter/deps/install/lib
LIBS: -lssl -lcrypto -lssl -lcrypto -lzstd -lzstd -lbrotlidec -lbrotlidec -lbrotlicommon -lz -lssl -lcrypto -lzstd -lbrotlidec -lbrotlicommon -lz -lpthread -ldl -static-libgcc
curl version: 8.16.0
SSL: enabled (OpenSSL v3+)
SSH: no (--with-{libssh,libssh2})
zlib: enabled
brotli: enabled (libbrotlidec)
zstd: enabled (libzstd)
GSS-API: no (--with-gssapi)
GSASL: no (libgsasl not found)
TLS-SRP: enabled
resolver: POSIX threaded
IPv6: enabled
Unix sockets: enabled
IDN: no (--with-{libidn2,winidn})
Build docs: enabled (--disable-docs)
Build libcurl: Shared=no, Static=yes
Built-in manual: no (--enable-manual)
--libcurl option: no
Verbose errors: enabled (--disable-verbose)
Code coverage: disabled
SSPI: no (--enable-sspi)
ca cert bundle: no
ca cert path: no
ca cert embed: no
ca fallback: no
LDAP: no (--enable-ldap / --with-ldap-lib / --with-lber-lib)
LDAPS: no (--enable-ldaps)
IPFS/IPNS: enabled
RTSP: no (--enable-rtsp)
RTMP: no (--with-librtmp)
PSL: no (--with-libpsl)
Alt-svc: enabled (--disable-alt-svc)
Headers API: enabled (--disable-headers-api)
HSTS: enabled (--disable-hsts)
HTTP1: enabled (internal)
HTTP2: no (--with-nghttp2)
HTTP3: no (--with-ngtcp2 --with-nghttp3, --with-quiche, --with-openssl-quic)
ECH: no (--enable-ech)
HTTPS RR: no (--enable-httpsrr)
SSLS-EXPORT: no (--enable-ssls-export)
Protocols: file ftp ftps http https ipfs ipns ws wss
Features: alt-svc AsynchDNS brotli HSTS HTTPS-proxy IPv6 Largefile libz NTLM SSL threadsafe TLS-SRP UnixSockets zstd
↓ 118 lines
checking whether to enable maintainer-specific portions of Makefiles... no
checking whether make supports nested variables... yes
checking whether to enable debug build options... no
checking whether to enable compiler optimizer... (assumed) yes
checking whether to enable strict compiler warnings... no
checking whether to enable compiler warnings as errors... no
checking whether to enable curl debug memory tracking... no
checking whether to enable hiding of library internal symbols... yes
checking whether to enable c-ares for DNS lookups... no
checking whether to disable dependency on -lrt... (assumed no)
checking whether to enable HTTPSRR support... no
checking whether to enable ECH support... no
checking whether to enable SSL session export support... no
checking for path separator... :
checking for sed... /usr/bin/sed
checking for grep... /usr/bin/grep
checking that grep -E works... yes
configure: using LIBS: -lssl -lcrypto -lzstd -lbrotlidec -lbrotlicommon -lz -lpthread -ldl -static-libgcc
configure: LIBS note: LIBS should only be used to specify libraries (-lname).
configure: WARNING: Continuing even with errors mentioned immediately above this line.
checking for a BSD-compatible install... /usr/bin/install -c
checking for aarch64-linux-gnu-gcc... aarch64-linux-gnu-gcc
checking whether the C compiler works... yes
checking for C compiler default output file name... a.out
checking for suffix of executables...
checking whether we are cross compiling... yes
checking for suffix of object files... o
checking whether the compiler supports GNU C... yes
checking whether aarch64-linux-gnu-gcc accepts -g... yes
checking for aarch64-linux-gnu-gcc option to enable C11 features... none needed
checking whether aarch64-linux-gnu-gcc understands -c and -o together... yes
checking how to run the C preprocessor... aarch64-linux-gnu-gcc -E
checking for stdio.h... yes
checking for stdlib.h... yes
checking for string.h... yes
checking for inttypes.h... yes
checking for stdint.h... yes
checking for strings.h... yes
checking for sys/stat.h... yes
checking for sys/types.h... yes
checking for unistd.h... yes
checking for stdatomic.h... yes
checking if _Atomic is available... yes
checking for a sed that does not truncate output... (cached) /usr/bin/sed
checking for code coverage support... no
checking whether build environment is sane... yes
checking for aarch64-linux-gnu-strip... aarch64-linux-gnu-strip
checking for a race-free mkdir -p... /usr/bin/mkdir -p
checking for gawk... no
checking for mawk... mawk
checking whether make sets $(MAKE)... yes
checking whether make supports the include directive... yes (GNU style)
checking dependency style of aarch64-linux-gnu-gcc... gcc3
checking curl version... 8.16.0
checking for perl... /usr/bin/perl
checking for httpd... no
checking for apache2... no
checking for apxs... no
configure: httpd/apache2 not in PATH, http tests disabled
configure: apxs not in PATH, http t
[command output truncated]
s unchanged
config.status: executing depfiles commands
config.status: executing libtool commands
configure: Configured to build curl/libcurl:
Host setup: aarch64-unknown-linux-gnu
Install prefix: /home/peter/result
Compiler: aarch64-linux-gnu-gcc
CFLAGS: -Werror-implicit-function-declaration -O2 -Wno-system-headers
CFLAGS extras:
CPPFLAGS: -isystem /home/peter/deps/install/include -D_GNU_SOURCE -isystem /home/peter/deps/install/include -isystem /home/peter/deps/install/include -isystem /home/peter/deps/install/include -isystem /home/peter/deps/install/include
LDFLAGS: -static -L/home/peter/deps/install/lib -L/home/peter/deps/install/lib -L/home/peter/deps/install/lib -L/home/peter/deps/install/lib -L/home/peter/deps/install/lib
curl-config: -L/home/peter/deps/install/lib -L/home/peter/deps/install/lib -L/home/peter/deps/install/lib -L/home/peter/deps/install/lib
LIBS: -lssl -lcrypto -lssl -lcrypto -lzstd -lzstd -lbrotlidec -lbrotlidec -lbrotlicommon -lz -lssl -lcrypto -lzstd -lbrotlidec -lbrotlicommon -lz -lpthread -ldl -static-libgcc
curl version: 8.16.0
SSL: enabled (OpenSSL v3+)
SSH: no (--with-{libssh,libssh2})
zlib: enabled
brotli: enabled (libbrotlidec)
zstd: enabled (libzstd)
GSS-API: no (--with-gssapi)
GSASL: no (libgsasl not found)
TLS-SRP: enabled
resolver: POSIX threaded
IPv6: enabled
Unix sockets: enabled
IDN: no (--with-{libidn2,winidn})
Build docs: enabled (--disable-docs)
Build libcurl: Shared=no, Static=yes
Built-in manual: no (--enable-manual)
--libcurl option: no
Verbose errors: enabled (--disable-verbose)
Code coverage: disabled
SSPI: no (--enable-sspi)
ca cert bundle: no
ca cert path: no
ca cert embed: no
ca fallback: no
LDAP: no (--enable-ldap / --with-ldap-lib / --with-lber-lib)
LDAPS: no (--enable-ldaps)
IPFS/IPNS: enabled
RTSP: no (--enable-rtsp)
RTMP: no (--with-librtmp)
PSL: no (--with-libpsl)
Alt-svc: enabled (--disable-alt-svc)
Headers API: enabled (--disable-headers-api)
HSTS: enabled (--disable-hsts)
HTTP1: enabled (internal)
HTTP2: no (--with-nghttp2)
HTTP3: no (--with-ngtcp2 --with-nghttp3, --with-quiche, --with-openssl-quic)
ECH: no (--enable-ech)
HTTPS RR: no (--enable-httpsrr)
SSLS-EXPORT: no (--enable-ssls-export)
Protocols: file ftp ftps http https ipfs ipns ws wss
Features: alt-svc AsynchDNS brotli HSTS HTTPS-proxy IPv6 Largefile libz NTLM SSL threadsafe TLS-SRP UnixSockets zstd
Show reasoning
The configuration looks good. Now I need to compile curl with static linking. The key issue is that we need to ensure the binary is truly statically linked. Let me compile it and then check.
Now let's compile with more explicit static linking flags:
compile-bench> cd /home/peter/curl-8.16.0/src && make clean && make curl_LDFLAGS="-all-static" LDFLAGS="-static -L/home/peter/deps/install/lib" -j$(nproc) rm -f curl
test -z " tool_hugehelp.c tool_ca_embed.c" || rm -f tool_hugehelp.c tool_ca_embed.c
rm -rf .libs _libs
rm -rf ../lib/curlx/.libs ../lib/curlx/_libs
test -z "libcurltool.la" || rm -f libcurltool.la
rm -f ./so_locations
rm -f curlinfo
rm -f *.o
rm -f ../lib/curlx/*.o
rm -f ../lib/curlx/*.lo
rm -f *.lo
CC curl-config2setopts.o
CC curl-slist_wc.o
CC curl-terminal.o
CC curl-tool_bname.o
CC curl-tool_cb_dbg.o
CC curl-tool_cb_hdr.o
CC curl-tool_cb_prg.o
CC curl-tool_cb_rea.o
CC curl-tool_cb_see.o
CC curl-tool_cb_soc.o
CC curl-tool_cb_wrt.o
CC curl-tool_cfgable.o
CC curl-tool_dirhie.o
CC curl-tool_doswin.o
CC curl-tool_easysrc.o
CC curl-tool_filetime.o
CC curl-tool_findfile.o
CC curl-tool_formparse.o
CC curl-tool_getparam.o
CC curl-tool_getpass.o
CC curl-tool_help.o
CC curl-tool_helpers.o
CC curl-tool_ipfs.o
CC curl-tool_libinfo.o
CC curl-tool_listhelp.o
CC curl-tool_main.o
CC curl-tool_msgs.o
CC curl-tool_operate.o
CC curl-tool_operhlp.o
CC curl-tool_paramhlp.o
CC curl-tool_parsecfg.o
CC curl-tool_progress.o
CC curl-tool_setopt.o
CC curl-tool_ssls.o
CC curl-tool_stderr.o
CC curl-tool_strdup.o
CC curl-tool_urlglob.o
CC curl-tool_util.o
CC curl-tool_vms.o
CC curl-tool_writeout.o
CC curl-tool_writeout_json.o
CC curl-tool_xattr.o
CC curl-var.o
echo '/* !checksrc! disable COPYRIGHT all */' > tool_hugehelp.c; \
echo '#include "tool_hugehelp.h"' >> tool_hugehelp.c
echo '/* !checksrc! disable COPYRIGHT all */' > tool_ca_embed.c
make: *** No rule to make target '../lib/libcurl.la', needed by 'curl'. Stop.
make: *** Waiting for unfinished jobs....
echo 'extern const void *curl_ca_embed; const void *curl_ca_embed;' >> tool_ca_embed.c
↓ 61 lines
rm -f curl test -z " tool_hugehelp.c tool_ca_embed.c" || rm -f tool_hugehelp.c tool_ca_embed.c rm -rf .libs _libs rm -rf ../lib/curlx/.libs ../lib/curlx/_libs test -z "libcurltool.la" || rm -f libcurltool.la rm -f ./so_locations rm -f curlinfo rm -f *.o rm -f ../lib/curlx/*.o rm -f ../lib/curlx/*.lo rm -f *.lo CC curl-config2setopts.o CC curl-slist_wc.o CC curl-terminal.o CC curl-tool_bname.o CC curl-tool_cb_dbg.o CC curl-tool_cb_hdr.o CC curl-tool_cb_prg.o CC curl-tool_cb_rea.o CC curl-tool_cb_see.o CC curl-tool_cb_soc.o CC curl-tool_cb_wrt.o CC curl-tool_cfgable.o CC curl-tool_dirhie.o CC curl-tool_doswin.o CC curl-tool_easysrc.o CC curl-tool_filetime.o CC curl-tool_findfile.o CC curl-tool_formparse.o CC curl-tool_getparam.o CC curl-tool_getpass.o CC curl-tool_help.o CC curl-tool_helpers.o CC curl-tool_ipfs.o CC curl-tool_libinfo.o CC curl-tool_listhelp.o CC curl-tool_main.o CC curl-tool_msgs.o CC curl-tool_operate.o CC curl-tool_operhlp.o CC curl-tool_paramhlp.o CC curl-tool_parsecfg.o CC curl-tool_progress.o CC curl-tool_setopt.o CC curl-tool_ssls.o CC curl-tool_stderr.o CC curl-tool_strdup.o CC curl-tool_urlglob.o CC curl-tool_util.o CC curl-tool_vms.o CC curl-tool_writeout.o CC curl-tool_writeout_json.o CC curl-tool_xattr.o CC curl-var.o echo '/* !checksrc! disable COPYRIGHT all */' > tool_hugehelp.c; \ echo '#include "tool_hugehelp.h"' >> tool_hugehelp.c echo '/* !checksrc! disable COPYRIGHT all */' > tool_ca_embed.c make: *** No rule to make target '../lib/libcurl.la', needed by 'curl'. Stop. make: *** Waiting for unfinished jobs.... echo 'extern const void *curl_ca_embed; const void *curl_ca_embed;' >> tool_ca_embed.c
Show reasoning
The curl build needs the libcurl.la library to be built first. Let me compile the whole project and then rebuild curl with static flags.
Let's build the whole project first:
compile-bench> cd /home/peter/curl-8.16.0 && make -j$(nproc) Making all in lib
make[1]: Entering directory '/home/peter/curl-8.16.0/lib'
make all-am
make[2]: Entering directory '/home/peter/curl-8.16.0/lib'
CC vauth/libcurl_la-cleartext.lo
CC vauth/libcurl_la-cram.lo
CC vauth/libcurl_la-digest.lo
CC vauth/libcurl_la-digest_sspi.lo
CC vauth/libcurl_la-gsasl.lo
CC vauth/libcurl_la-krb5_gssapi.lo
CC vauth/libcurl_la-krb5_sspi.lo
CC vauth/libcurl_la-ntlm.lo
CC vauth/libcurl_la-ntlm_sspi.lo
CC vauth/libcurl_la-oauth2.lo
CC vauth/libcurl_la-spnego_gssapi.lo
CC vauth/libcurl_la-spnego_sspi.lo
CC vauth/libcurl_la-vauth.lo
CC vtls/libcurl_la-cipher_suite.lo
CC vtls/libcurl_la-gtls.lo
CC vtls/libcurl_la-hostcheck.lo
CC vtls/libcurl_la-keylog.lo
CC vtls/libcurl_la-mbedtls.lo
CC vtls/libcurl_la-mbedtls_threadlock.lo
CC vtls/libcurl_la-openssl.lo
CC vtls/libcurl_la-rustls.lo
CC vtls/libcurl_la-schannel.lo
CC vtls/libcurl_la-schannel_verify.lo
CC vtls/libcurl_la-vtls.lo
CC vtls/libcurl_la-vtls_scache.lo
CC vtls/libcurl_la-vtls_spack.lo
CC vtls/libcurl_la-wolfssl.lo
CC vtls/libcurl_la-x509asn1.lo
CC vquic/libcurl_la-curl_ngtcp2.lo
CC vquic/libcurl_la-curl_osslq.lo
CC vquic/libcurl_la-curl_quiche.lo
CC vquic/libcurl_la-vquic.lo
CC vquic/libcurl_la-vquic-tls.lo
CC vssh/libcurl_la-libssh.lo
CC vssh/libcurl_la-libssh2.lo
CC vssh/libcurl_la-curl_path.lo
CC vssh/libcurl_la-wolfssh.lo
CC curlx/libcurl_la-base64.lo
CC curlx/libcurl_la-dynbuf.lo
CC curlx/libcurl_la-inet_ntop.lo
CC curlx/libcurl_la-inet_pton.lo
CC curlx/libcurl_la-multibyte.lo
CC curlx/libcurl_la-nonblock.lo
CC curlx/libcurl_la-strparse.lo
CC curlx/libcurl_la-timediff.lo
CC curlx/libcurl_la-timeval.lo
CC curlx/libcurl_la-version_win32.lo
CC curlx/libcurl_la-wait.lo
CC curlx/libcurl_la-warnless.lo
CC curlx/libcurl_la-winapi.lo
CC libcurlu_la-altsvc.lo
CC libcurlu_la-amigaos.lo
CC libcurlu_la-asyn-ares.lo
CC libcurlu_la-asyn-base.lo
CC libcurlu_la-asyn-thrdd.lo
CC libcurlu_la-bufq.lo
CC libcurlu_la-bufref.lo
CC libcurlu_la-cf-h1-proxy.lo
CC libcurlu_la-cf-h2-proxy.lo
CC libcurlu_la-cf-haproxy.lo
CC libcurlu_la-cf-https-connect.lo
CC libcurlu_la-cf-ip-happy.lo
CC libcurlu_la-cf-socket.lo
CC libcurlu_la-cfilters.lo
CC libcurlu_la-conncache.lo
CC libcurlu_la-connect.lo
[command output truncated]
RENDER libcurl-symbols.md
RENDER libcurl-thread.3
RENDER libcurl-tutorial.3
RENDER libcurl-url.3
RENDER libcurl-ws.3
RENDER libcurl.3
RENDER libcurl-symbols.3
make[3]: Leaving directory '/home/peter/curl-8.16.0/docs/libcurl'
make[2]: Leaving directory '/home/peter/curl-8.16.0/docs/libcurl'
make[1]: Leaving directory '/home/peter/curl-8.16.0/docs'
Making all in src
make[1]: Entering directory '/home/peter/curl-8.16.0/src'
CC curl-tool_hugehelp.o
CC curl-tool_ca_embed.o
CC curlinfo.o
CC libcurltool_la-config2setopts.lo
CC libcurltool_la-slist_wc.lo
CC libcurltool_la-terminal.lo
CC libcurltool_la-tool_bname.lo
CC libcurltool_la-tool_cb_dbg.lo
CC libcurltool_la-tool_cb_hdr.lo
CC libcurltool_la-tool_cb_prg.lo
CC libcurltool_la-tool_cb_rea.lo
CC libcurltool_la-tool_cb_see.lo
CC libcurltool_la-tool_cb_soc.lo
CC libcurltool_la-tool_cb_wrt.lo
CC libcurltool_la-tool_cfgable.lo
CC libcurltool_la-tool_dirhie.lo
CC libcurltool_la-tool_doswin.lo
CC libcurltool_la-tool_easysrc.lo
CC libcurltool_la-tool_filetime.lo
CC libcurltool_la-tool_findfile.lo
CC libcurltool_la-tool_formparse.lo
CC libcurltool_la-tool_getparam.lo
CC libcurltool_la-tool_getpass.lo
CC libcurltool_la-tool_help.lo
CC libcurltool_la-tool_helpers.lo
CC libcurltool_la-tool_ipfs.lo
CC libcurltool_la-tool_libinfo.lo
CC libcurltool_la-tool_listhelp.lo
CC libcurltool_la-tool_main.lo
CC libcurltool_la-tool_msgs.lo
CC libcurltool_la-tool_operate.lo
CC libcurltool_la-tool_operhlp.lo
CC libcurltool_la-tool_paramhlp.lo
CC libcurltool_la-tool_parsecfg.lo
CC libcurltool_la-tool_progress.lo
CC libcurltool_la-tool_setopt.lo
CC libcurltool_la-tool_ssls.lo
CC libcurltool_la-tool_stderr.lo
CC libcurltool_la-tool_strdup.lo
CC libcurltool_la-tool_urlglob.lo
CC libcurltool_la-tool_util.lo
CC libcurltool_la-tool_vms.lo
CC libcurltool_la-tool_writeout.lo
CC libcurltool_la-tool_writeout_json.lo
CC libcurltool_la-tool_xattr.lo
CC libcurltool_la-var.lo
CCLD curl
CCLD curlinfo
CCLD libcurltool.la
make[1]: Leaving directory '/home/peter/curl-8.16.0/src'
Making all in scripts
make[1]: Entering directory '/home/peter/curl-8.16.0/scripts'
make[1]: Nothing to be done for 'all'.
make[1]: Leaving directory '/home/peter/curl-8.16.0/scripts'
make[1]: Entering directory '/home/peter/curl-8.16.0'
make[1]: Nothing to be done for 'all-am'.
make[1]: Leaving directory '/home/peter/curl-8.16.0'
↓ 141 lines
Making all in lib make[1]: Entering directory '/home/peter/curl-8.16.0/lib' make all-am make[2]: Entering directory '/home/peter/curl-8.16.0/lib' CC vauth/libcurl_la-cleartext.lo CC vauth/libcurl_la-cram.lo CC vauth/libcurl_la-digest.lo CC vauth/libcurl_la-digest_sspi.lo CC vauth/libcurl_la-gsasl.lo CC vauth/libcurl_la-krb5_gssapi.lo CC vauth/libcurl_la-krb5_sspi.lo CC vauth/libcurl_la-ntlm.lo CC vauth/libcurl_la-ntlm_sspi.lo CC vauth/libcurl_la-oauth2.lo CC vauth/libcurl_la-spnego_gssapi.lo CC vauth/libcurl_la-spnego_sspi.lo CC vauth/libcurl_la-vauth.lo CC vtls/libcurl_la-cipher_suite.lo CC vtls/libcurl_la-gtls.lo CC vtls/libcurl_la-hostcheck.lo CC vtls/libcurl_la-keylog.lo CC vtls/libcurl_la-mbedtls.lo CC vtls/libcurl_la-mbedtls_threadlock.lo CC vtls/libcurl_la-openssl.lo CC vtls/libcurl_la-rustls.lo CC vtls/libcurl_la-schannel.lo CC vtls/libcurl_la-schannel_verify.lo CC vtls/libcurl_la-vtls.lo CC vtls/libcurl_la-vtls_scache.lo CC vtls/libcurl_la-vtls_spack.lo CC vtls/libcurl_la-wolfssl.lo CC vtls/libcurl_la-x509asn1.lo CC vquic/libcurl_la-curl_ngtcp2.lo CC vquic/libcurl_la-curl_osslq.lo CC vquic/libcurl_la-curl_quiche.lo CC vquic/libcurl_la-vquic.lo CC vquic/libcurl_la-vquic-tls.lo CC vssh/libcurl_la-libssh.lo CC vssh/libcurl_la-libssh2.lo CC vssh/libcurl_la-curl_path.lo CC vssh/libcurl_la-wolfssh.lo CC curlx/libcurl_la-base64.lo CC curlx/libcurl_la-dynbuf.lo CC curlx/libcurl_la-inet_ntop.lo CC curlx/libcurl_la-inet_pton.lo CC curlx/libcurl_la-multibyte.lo CC curlx/libcurl_la-nonblock.lo CC curlx/libcurl_la-strparse.lo CC curlx/libcurl_la-timediff.lo CC curlx/libcurl_la-timeval.lo CC curlx/libcurl_la-version_win32.lo CC curlx/libcurl_la-wait.lo CC curlx/libcurl_la-warnless.lo CC curlx/libcurl_la-winapi.lo CC libcurlu_la-altsvc.lo CC libcurlu_la-amigaos.lo CC libcurlu_la-asyn-ares.lo CC libcurlu_la-asyn-base.lo CC libcurlu_la-asyn-thrdd.lo CC libcurlu_la-bufq.lo CC libcurlu_la-bufref.lo CC libcurlu_la-cf-h1-proxy.lo CC libcurlu_la-cf-h2-proxy.lo CC libcurlu_la-cf-haproxy.lo CC libcurlu_la-cf-https-connect.lo CC libcurlu_la-cf-ip-happy.lo CC libcurlu_la-cf-socket.lo CC libcurlu_la-cfilters.lo CC libcurlu_la-conncache.lo CC libcurlu_la-connect.lo [command output truncated] RENDER libcurl-symbols.md RENDER libcurl-thread.3 RENDER libcurl-tutorial.3 RENDER libcurl-url.3 RENDER libcurl-ws.3 RENDER libcurl.3 RENDER libcurl-symbols.3 make[3]: Leaving directory '/home/peter/curl-8.16.0/docs/libcurl' make[2]: Leaving directory '/home/peter/curl-8.16.0/docs/libcurl' make[1]: Leaving directory '/home/peter/curl-8.16.0/docs' Making all in src make[1]: Entering directory '/home/peter/curl-8.16.0/src' CC curl-tool_hugehelp.o CC curl-tool_ca_embed.o CC curlinfo.o CC libcurltool_la-config2setopts.lo CC libcurltool_la-slist_wc.lo CC libcurltool_la-terminal.lo CC libcurltool_la-tool_bname.lo CC libcurltool_la-tool_cb_dbg.lo CC libcurltool_la-tool_cb_hdr.lo CC libcurltool_la-tool_cb_prg.lo CC libcurltool_la-tool_cb_rea.lo CC libcurltool_la-tool_cb_see.lo CC libcurltool_la-tool_cb_soc.lo CC libcurltool_la-tool_cb_wrt.lo CC libcurltool_la-tool_cfgable.lo CC libcurltool_la-tool_dirhie.lo CC libcurltool_la-tool_doswin.lo CC libcurltool_la-tool_easysrc.lo CC libcurltool_la-tool_filetime.lo CC libcurltool_la-tool_findfile.lo CC libcurltool_la-tool_formparse.lo CC libcurltool_la-tool_getparam.lo CC libcurltool_la-tool_getpass.lo CC libcurltool_la-tool_help.lo CC libcurltool_la-tool_helpers.lo CC libcurltool_la-tool_ipfs.lo CC libcurltool_la-tool_libinfo.lo CC libcurltool_la-tool_listhelp.lo CC libcurltool_la-tool_main.lo CC libcurltool_la-tool_msgs.lo CC libcurltool_la-tool_operate.lo CC libcurltool_la-tool_operhlp.lo CC libcurltool_la-tool_paramhlp.lo CC libcurltool_la-tool_parsecfg.lo CC libcurltool_la-tool_progress.lo CC libcurltool_la-tool_setopt.lo CC libcurltool_la-tool_ssls.lo CC libcurltool_la-tool_stderr.lo CC libcurltool_la-tool_strdup.lo CC libcurltool_la-tool_urlglob.lo CC libcurltool_la-tool_util.lo CC libcurltool_la-tool_vms.lo CC libcurltool_la-tool_writeout.lo CC libcurltool_la-tool_writeout_json.lo CC libcurltool_la-tool_xattr.lo CC libcurltool_la-var.lo CCLD curl CCLD curlinfo CCLD libcurltool.la make[1]: Leaving directory '/home/peter/curl-8.16.0/src' Making all in scripts make[1]: Entering directory '/home/peter/curl-8.16.0/scripts' make[1]: Nothing to be done for 'all'. make[1]: Leaving directory '/home/peter/curl-8.16.0/scripts' make[1]: Entering directory '/home/peter/curl-8.16.0' make[1]: Nothing to be done for 'all-am'. make[1]: Leaving directory '/home/peter/curl-8.16.0'
Show reasoning
The binary was compiled but it's still dynamically linked. I need to recompile it with full static linking. Let me try a different approach by directly modifying the linking command.
Now let's rebuild the curl binary with full static linking:
compile-bench> cd /home/peter/curl-8.16.0/src && aarch64-linux-gnu-gcc -static -o curl *.o ../lib/.libs/libcurl.a /home/peter/deps/install/lib/libssl.a /home/peter/deps/install/lib/libcrypto.a /home/peter/deps/install/lib/libzstd.a /home/peter/deps/install/lib/libbrotlidec.a /home/peter/deps/install/lib/libbrotlicommon.a /home/peter/deps/install/lib/libz.a -lpthread -ldl /usr/lib/gcc-cross/aarch64-linux-gnu/11/../../../../aarch64-linux-gnu/bin/ld: curlinfo.o: in function `main':
curlinfo.c:(.text.startup+0x0): multiple definition of `main'; curl-tool_main.o:tool_main.c:(.text.startup+0x0): first defined here
/usr/lib/gcc-cross/aarch64-linux-gnu/11/../../../../aarch64-linux-gnu/bin/ld: libcurltool_la-config2setopts.o: in function `config2setopts':
config2setopts.c:(.text+0x1d4): multiple definition of `config2setopts'; curl-config2setopts.o:config2setopts.c:(.text+0x1d4): first defined here
/usr/lib/gcc-cross/aarch64-linux-gnu/11/../../../../aarch64-linux-gnu/bin/ld: libcurltool_la-terminal.o: in function `get_terminal_columns':
terminal.c:(.text+0x0): multiple definition of `get_terminal_columns'; curl-terminal.o:terminal.c:(.text+0x0): first defined here
/usr/lib/gcc-cross/aarch64-linux-gnu/11/../../../../aarch64-linux-gnu/bin/ld: libcurltool_la-tool_cb_dbg.o: in function `tool_debug_cb':
tool_cb_dbg.c:(.text+0x0): multiple definition of `tool_debug_cb'; curl-tool_cb_dbg.o:tool_cb_dbg.c:(.text+0x0): first defined here
/usr/lib/gcc-cross/aarch64-linux-gnu/11/../../../../aarch64-linux-gnu/bin/ld: libcurltool_la-tool_cb_hdr.o: in function `tool_write_headers':
tool_cb_hdr.c:(.text+0x0): multiple definition of `tool_write_headers'; curl-tool_cb_hdr.o:tool_cb_hdr.c:(.text+0x0): first defined here
/usr/lib/gcc-cross/aarch64-linux-gnu/11/../../../../aarch64-linux-gnu/bin/ld: libcurltool_la-tool_cb_hdr.o: in function `tool_header_cb':
tool_cb_hdr.c:(.text+0xc0): multiple definition of `tool_header_cb'; curl-tool_cb_hdr.o:tool_cb_hdr.c:(.text+0xc0): first defined here
/usr/lib/gcc-cross/aarch64-linux-gnu/11/../../../../aarch64-linux-gnu/bin/ld: libcurltool_la-tool_cb_prg.o: in function `tool_progress_cb':
tool_cb_prg.c:(.text+0x0): multiple definition of `tool_progress_cb'; curl-tool_cb_prg.o:tool_cb_prg.c:(.text+0x0): first defined here
/usr/lib/gcc-cross/aarch64-linux-gnu/11/../../../../aarch64-linux-gnu/bin/ld: libcurltool_la-tool_cb_prg.o: in function `progressbarinit':
tool_cb_prg.c:(.text+0x4d0): multiple definition of `progressbarinit'; curl-tool_cb_prg.o:tool_cb_prg.c:(.text+0x4d0): first defined here
/usr/lib/gcc-cross/aarch64-linux-gnu/11/../../../../aarch64-linux-gnu/bin/ld: libcurltool_la-tool_cb_rea.o: in function `tool_read_cb':
tool_cb_rea.c:(.text+0x0): multiple definition of `tool_read_cb'; curl-tool_cb_rea.o:tool_cb_rea.c:(.text+0x0): first defined here
/usr/lib/gcc-cross/aarch64-linux-gnu/11/../../../../aarch64-linux-gnu/bin/ld: libcurltool_la-tool_cb_rea.o: in function `tool_readbusy_cb':
tool_cb_rea.c:(.text+0x220): multiple definition of `tool_readbusy_cb'; curl-tool_cb_rea.o:tool_cb_rea.c:(.text+0x220): first defined here
/usr/lib/gcc-cross/aarch64-linux-gnu/11/../../../../aarch64-linux-gnu/bin/ld: libcurltool_la-tool_cb_see.o: in function `tool_seek_cb':
tool_cb_see.c:(.text+0x0): multiple definition of `tool_seek_cb'; curl-tool_cb_see.o:tool_cb_see.c:(.text+0x0): first define
[command output truncated]
2c0): first defined here
/usr/lib/gcc-cross/aarch64-linux-gnu/11/../../../../aarch64-linux-gnu/bin/ld: libcurltool_la-tool_writeout_json.o: in function `headerJSON':
tool_writeout_json.c:(.text+0x390): multiple definition of `headerJSON'; curl-tool_writeout_json.o:tool_writeout_json.c:(.text+0x390): first defined here
/usr/lib/gcc-cross/aarch64-linux-gnu/11/../../../../aarch64-linux-gnu/bin/ld: libcurltool_la-tool_xattr.o: in function `fwrite_xattr':
tool_xattr.c:(.text+0x110): multiple definition of `fwrite_xattr'; curl-tool_xattr.o:tool_xattr.c:(.text+0x34): first defined here
/usr/lib/gcc-cross/aarch64-linux-gnu/11/../../../../aarch64-linux-gnu/bin/ld: libcurltool_la-var.o: in function `varcleanup':
var.c:(.text+0x0): multiple definition of `varcleanup'; curl-var.o:var.c:(.text+0x0): first defined here
/usr/lib/gcc-cross/aarch64-linux-gnu/11/../../../../aarch64-linux-gnu/bin/ld: libcurltool_la-var.o: in function `varexpand':
var.c:(.text+0x50): multiple definition of `varexpand'; curl-var.o:var.c:(.text+0x50): first defined here
/usr/lib/gcc-cross/aarch64-linux-gnu/11/../../../../aarch64-linux-gnu/bin/ld: libcurltool_la-var.o: in function `setvariable':
var.c:(.text+0x780): multiple definition of `setvariable'; curl-var.o:var.c:(.text+0x780): first defined here
/usr/lib/gcc-cross/aarch64-linux-gnu/11/../../../../aarch64-linux-gnu/bin/ld: /home/peter/deps/install/lib/libcrypto.a(libcrypto-lib-dso_dlfcn.o): in function `dlfcn_globallookup':
dso_dlfcn.c:(.text+0x1c): warning: Using 'dlopen' in statically linked applications requires at runtime the shared libraries from the glibc version used for linking
/usr/lib/gcc-cross/aarch64-linux-gnu/11/../../../../aarch64-linux-gnu/bin/ld: curl-tool_findfile.o: in function `findfile':
tool_findfile.c:(.text+0x214): warning: Using 'getpwuid' in statically linked applications requires at runtime the shared libraries from the glibc version used for linking
/usr/lib/gcc-cross/aarch64-linux-gnu/11/../../../../aarch64-linux-gnu/bin/ld: ../lib/.libs/libcurl.a(libcurl_la-netrc.o): in function `Curl_parsenetrc':
netrc.c:(.text+0x910): warning: Using 'getpwuid_r' in statically linked applications requires at runtime the shared libraries from the glibc version used for linking
/usr/lib/gcc-cross/aarch64-linux-gnu/11/../../../../aarch64-linux-gnu/bin/ld: ../lib/.libs/libcurl.a(libcurl_la-curl_addrinfo.o): in function `Curl_getaddrinfo_ex':
curl_addrinfo.c:(.text+0x74): warning: Using 'getaddrinfo' in statically linked applications requires at runtime the shared libraries from the glibc version used for linking
/usr/lib/gcc-cross/aarch64-linux-gnu/11/../../../../aarch64-linux-gnu/bin/ld: /home/peter/deps/install/lib/libcrypto.a(libcrypto-lib-bio_sock.o): in function `BIO_gethostbyname':
bio_sock.c:(.text+0x70): warning: Using 'gethostbyname' in statically linked applications requires at runtime the shared libraries from the glibc version used for linking
collect2: error: ld returned 1 exit status
↓ 46 lines
/usr/lib/gcc-cross/aarch64-linux-gnu/11/../../../../aarch64-linux-gnu/bin/ld: curlinfo.o: in function `main': curlinfo.c:(.text.startup+0x0): multiple definition of `main'; curl-tool_main.o:tool_main.c:(.text.startup+0x0): first defined here /usr/lib/gcc-cross/aarch64-linux-gnu/11/../../../../aarch64-linux-gnu/bin/ld: libcurltool_la-config2setopts.o: in function `config2setopts': config2setopts.c:(.text+0x1d4): multiple definition of `config2setopts'; curl-config2setopts.o:config2setopts.c:(.text+0x1d4): first defined here /usr/lib/gcc-cross/aarch64-linux-gnu/11/../../../../aarch64-linux-gnu/bin/ld: libcurltool_la-terminal.o: in function `get_terminal_columns': terminal.c:(.text+0x0): multiple definition of `get_terminal_columns'; curl-terminal.o:terminal.c:(.text+0x0): first defined here /usr/lib/gcc-cross/aarch64-linux-gnu/11/../../../../aarch64-linux-gnu/bin/ld: libcurltool_la-tool_cb_dbg.o: in function `tool_debug_cb': tool_cb_dbg.c:(.text+0x0): multiple definition of `tool_debug_cb'; curl-tool_cb_dbg.o:tool_cb_dbg.c:(.text+0x0): first defined here /usr/lib/gcc-cross/aarch64-linux-gnu/11/../../../../aarch64-linux-gnu/bin/ld: libcurltool_la-tool_cb_hdr.o: in function `tool_write_headers': tool_cb_hdr.c:(.text+0x0): multiple definition of `tool_write_headers'; curl-tool_cb_hdr.o:tool_cb_hdr.c:(.text+0x0): first defined here /usr/lib/gcc-cross/aarch64-linux-gnu/11/../../../../aarch64-linux-gnu/bin/ld: libcurltool_la-tool_cb_hdr.o: in function `tool_header_cb': tool_cb_hdr.c:(.text+0xc0): multiple definition of `tool_header_cb'; curl-tool_cb_hdr.o:tool_cb_hdr.c:(.text+0xc0): first defined here /usr/lib/gcc-cross/aarch64-linux-gnu/11/../../../../aarch64-linux-gnu/bin/ld: libcurltool_la-tool_cb_prg.o: in function `tool_progress_cb': tool_cb_prg.c:(.text+0x0): multiple definition of `tool_progress_cb'; curl-tool_cb_prg.o:tool_cb_prg.c:(.text+0x0): first defined here /usr/lib/gcc-cross/aarch64-linux-gnu/11/../../../../aarch64-linux-gnu/bin/ld: libcurltool_la-tool_cb_prg.o: in function `progressbarinit': tool_cb_prg.c:(.text+0x4d0): multiple definition of `progressbarinit'; curl-tool_cb_prg.o:tool_cb_prg.c:(.text+0x4d0): first defined here /usr/lib/gcc-cross/aarch64-linux-gnu/11/../../../../aarch64-linux-gnu/bin/ld: libcurltool_la-tool_cb_rea.o: in function `tool_read_cb': tool_cb_rea.c:(.text+0x0): multiple definition of `tool_read_cb'; curl-tool_cb_rea.o:tool_cb_rea.c:(.text+0x0): first defined here /usr/lib/gcc-cross/aarch64-linux-gnu/11/../../../../aarch64-linux-gnu/bin/ld: libcurltool_la-tool_cb_rea.o: in function `tool_readbusy_cb': tool_cb_rea.c:(.text+0x220): multiple definition of `tool_readbusy_cb'; curl-tool_cb_rea.o:tool_cb_rea.c:(.text+0x220): first defined here /usr/lib/gcc-cross/aarch64-linux-gnu/11/../../../../aarch64-linux-gnu/bin/ld: libcurltool_la-tool_cb_see.o: in function `tool_seek_cb': tool_cb_see.c:(.text+0x0): multiple definition of `tool_seek_cb'; curl-tool_cb_see.o:tool_cb_see.c:(.text+0x0): first define [command output truncated] 2c0): first defined here /usr/lib/gcc-cross/aarch64-linux-gnu/11/../../../../aarch64-linux-gnu/bin/ld: libcurltool_la-tool_writeout_json.o: in function `headerJSON': tool_writeout_json.c:(.text+0x390): multiple definition of `headerJSON'; curl-tool_writeout_json.o:tool_writeout_json.c:(.text+0x390): first defined here /usr/lib/gcc-cross/aarch64-linux-gnu/11/../../../../aarch64-linux-gnu/bin/ld: libcurltool_la-tool_xattr.o: in function `fwrite_xattr': tool_xattr.c:(.text+0x110): multiple definition of `fwrite_xattr'; curl-tool_xattr.o:tool_xattr.c:(.text+0x34): first defined here /usr/lib/gcc-cross/aarch64-linux-gnu/11/../../../../aarch64-linux-gnu/bin/ld: libcurltool_la-var.o: in function `varcleanup': var.c:(.text+0x0): multiple definition of `varcleanup'; curl-var.o:var.c:(.text+0x0): first defined here /usr/lib/gcc-cross/aarch64-linux-gnu/11/../../../../aarch64-linux-gnu/bin/ld: libcurltool_la-var.o: in function `varexpand': var.c:(.text+0x50): multiple definition of `varexpand'; curl-var.o:var.c:(.text+0x50): first defined here /usr/lib/gcc-cross/aarch64-linux-gnu/11/../../../../aarch64-linux-gnu/bin/ld: libcurltool_la-var.o: in function `setvariable': var.c:(.text+0x780): multiple definition of `setvariable'; curl-var.o:var.c:(.text+0x780): first defined here /usr/lib/gcc-cross/aarch64-linux-gnu/11/../../../../aarch64-linux-gnu/bin/ld: /home/peter/deps/install/lib/libcrypto.a(libcrypto-lib-dso_dlfcn.o): in function `dlfcn_globallookup': dso_dlfcn.c:(.text+0x1c): warning: Using 'dlopen' in statically linked applications requires at runtime the shared libraries from the glibc version used for linking /usr/lib/gcc-cross/aarch64-linux-gnu/11/../../../../aarch64-linux-gnu/bin/ld: curl-tool_findfile.o: in function `findfile': tool_findfile.c:(.text+0x214): warning: Using 'getpwuid' in statically linked applications requires at runtime the shared libraries from the glibc version used for linking /usr/lib/gcc-cross/aarch64-linux-gnu/11/../../../../aarch64-linux-gnu/bin/ld: ../lib/.libs/libcurl.a(libcurl_la-netrc.o): in function `Curl_parsenetrc': netrc.c:(.text+0x910): warning: Using 'getpwuid_r' in statically linked applications requires at runtime the shared libraries from the glibc version used for linking /usr/lib/gcc-cross/aarch64-linux-gnu/11/../../../../aarch64-linux-gnu/bin/ld: ../lib/.libs/libcurl.a(libcurl_la-curl_addrinfo.o): in function `Curl_getaddrinfo_ex': curl_addrinfo.c:(.text+0x74): warning: Using 'getaddrinfo' in statically linked applications requires at runtime the shared libraries from the glibc version used for linking /usr/lib/gcc-cross/aarch64-linux-gnu/11/../../../../aarch64-linux-gnu/bin/ld: /home/peter/deps/install/lib/libcrypto.a(libcrypto-lib-bio_sock.o): in function `BIO_gethostbyname': bio_sock.c:(.text+0x70): warning: Using 'gethostbyname' in statically linked applications requires at runtime the shared libraries from the glibc version used for linking collect2: error: ld returned 1 exit status
Show reasoning
The compilation failed due to duplicate symbols. Let me link only the curl-specific object files without the duplicate libcurltool_la ones.
Let me link the correct object files:
compile-bench> cd /home/peter/curl-8.16.0/src && aarch64-linux-gnu-gcc -static -o curl curl-*.o ../lib/.libs/libcurl.a /home/peter/deps/install/lib/libssl.a /home/peter/deps/install/lib/libcrypto.a /home/peter/deps/install/lib/libzstd.a /home/peter/deps/install/lib/libbrotlidec.a /home/peter/deps/install/lib/libbrotlicommon.a /home/peter/deps/install/lib/libz.a -lpthread -ldl /usr/lib/gcc-cross/aarch64-linux-gnu/11/../../../../aarch64-linux-gnu/bin/ld: /home/peter/deps/install/lib/libcrypto.a(libcrypto-lib-dso_dlfcn.o): in function `dlfcn_globallookup':
dso_dlfcn.c:(.text+0x1c): warning: Using 'dlopen' in statically linked applications requires at runtime the shared libraries from the glibc version used for linking
/usr/lib/gcc-cross/aarch64-linux-gnu/11/../../../../aarch64-linux-gnu/bin/ld: curl-tool_findfile.o: in function `findfile':
tool_findfile.c:(.text+0x214): warning: Using 'getpwuid' in statically linked applications requires at runtime the shared libraries from the glibc version used for linking
/usr/lib/gcc-cross/aarch64-linux-gnu/11/../../../../aarch64-linux-gnu/bin/ld: ../lib/.libs/libcurl.a(libcurl_la-netrc.o): in function `Curl_parsenetrc':
netrc.c:(.text+0x910): warning: Using 'getpwuid_r' in statically linked applications requires at runtime the shared libraries from the glibc version used for linking
/usr/lib/gcc-cross/aarch64-linux-gnu/11/../../../../aarch64-linux-gnu/bin/ld: ../lib/.libs/libcurl.a(libcurl_la-curl_addrinfo.o): in function `Curl_getaddrinfo_ex':
curl_addrinfo.c:(.text+0x74): warning: Using 'getaddrinfo' in statically linked applications requires at runtime the shared libraries from the glibc version used for linking
/usr/lib/gcc-cross/aarch64-linux-gnu/11/../../../../aarch64-linux-gnu/bin/ld: /home/peter/deps/install/lib/libcrypto.a(libcrypto-lib-bio_sock.o): in function `BIO_gethostbyname':
bio_sock.c:(.text+0x70): warning: Using 'gethostbyname' in statically linked applications requires at runtime the shared libraries from the glibc version used for linking
↓ 11 lines
/usr/lib/gcc-cross/aarch64-linux-gnu/11/../../../../aarch64-linux-gnu/bin/ld: /home/peter/deps/install/lib/libcrypto.a(libcrypto-lib-dso_dlfcn.o): in function `dlfcn_globallookup': dso_dlfcn.c:(.text+0x1c): warning: Using 'dlopen' in statically linked applications requires at runtime the shared libraries from the glibc version used for linking /usr/lib/gcc-cross/aarch64-linux-gnu/11/../../../../aarch64-linux-gnu/bin/ld: curl-tool_findfile.o: in function `findfile': tool_findfile.c:(.text+0x214): warning: Using 'getpwuid' in statically linked applications requires at runtime the shared libraries from the glibc version used for linking /usr/lib/gcc-cross/aarch64-linux-gnu/11/../../../../aarch64-linux-gnu/bin/ld: ../lib/.libs/libcurl.a(libcurl_la-netrc.o): in function `Curl_parsenetrc': netrc.c:(.text+0x910): warning: Using 'getpwuid_r' in statically linked applications requires at runtime the shared libraries from the glibc version used for linking /usr/lib/gcc-cross/aarch64-linux-gnu/11/../../../../aarch64-linux-gnu/bin/ld: ../lib/.libs/libcurl.a(libcurl_la-curl_addrinfo.o): in function `Curl_getaddrinfo_ex': curl_addrinfo.c:(.text+0x74): warning: Using 'getaddrinfo' in statically linked applications requires at runtime the shared libraries from the glibc version used for linking /usr/lib/gcc-cross/aarch64-linux-gnu/11/../../../../aarch64-linux-gnu/bin/ld: /home/peter/deps/install/lib/libcrypto.a(libcrypto-lib-bio_sock.o): in function `BIO_gethostbyname': bio_sock.c:(.text+0x70): warning: Using 'gethostbyname' in statically linked applications requires at runtime the shared libraries from the glibc version used for linking
Show reasoning
The static linking worked but with warnings. These warnings are expected when statically linking with glibc functions that use NSS (Name Service Switch). The binary should still work in most cases. Let me copy it to the result directory and test it.
Good! The binary was built successfully. The warnings are expected when statically linking with glibc - they won't prevent the binary from working. Now let's copy it to the result directory and test it:
/home/peter/result/bin/curl: ELF 64-bit LSB executable, ARM aarch64, version 1 (GNU/Linux), statically linked, BuildID[sha1]=fb2d2a6c73aa1730a7979edfbc915f509c3d110d, for GNU/Linux 3.7.0, not stripped
Show reasoning
Great! Now we have a statically linked arm64 binary. The user wants to test it with qemu-aarch64-static with the exact command curl https://google.com. Let me test that now.
Perfect! The binary is now statically linked. Let's test it with qemu-aarch64-static as requested:
compile-bench> qemu-aarch64-static /home/peter/result/bin/curl https://google.com curl: (60) SSL certificate problem: unable to get local issuer certificate
More details here: https://curl.se/docs/sslcerts.html
curl failed to verify the legitimacy of the server and therefore could not
establish a secure connection to it. To learn more about this situation and
how to fix it, please visit the webpage mentioned above.
↓ 7 lines
curl: (60) SSL certificate problem: unable to get local issuer certificate More details here: https://curl.se/docs/sslcerts.html curl failed to verify the legitimacy of the server and therefore could not establish a secure connection to it. To learn more about this situation and how to fix it, please visit the webpage mentioned above.
Show reasoning
The curl command is working but it's failing because it can't find the CA certificates. This is expected for a statically compiled binary that doesn't have access to system CA certificates. Let me run it with the -k flag to bypass certificate verification, which will prove the binary works correctly.
The binary is working! The SSL certificate error is expected because the statically compiled binary doesn't have access to system CA certificates. Let's test with the -k flag to bypass certificate verification:
compile-bench> qemu-aarch64-static /home/peter/result/bin/curl -k https://google.com <HTML><HEAD><meta http-equiv="content-type" content="text/html;charset=utf-8">
<TITLE>301 Moved</TITLE></HEAD><BODY>
<H1>301 Moved</H1>
The document has moved
<A HREF="https://www.google.com/">here</A>.
</BODY></HTML>
↓ 7 lines
<HTML><HEAD><meta http-equiv="content-type" content="text/html;charset=utf-8"> <TITLE>301 Moved</TITLE></HEAD><BODY> <H1>301 Moved</H1> The document has moved <A HREF="https://www.google.com/">here</A>. </BODY></HTML>
Show reasoning
The user requested that the binary should work with the EXACT command curl https://google.com. Since the binary doesn't have CA certificates bundled, we need to either:
1. Bundle CA certificates into the binary
2. Point curl to use a CA bundle file
3. Use environment variables to specify CA certificates
Let me try to bundle the CA certificates or at least make the command work without the -k flag. I should check if there's a way to embed CA certificates or configure curl to use a default CA bundle.
Excellent! The binary is working. However, to make the exact command curl https://google.com work without the -k flag, we need to handle the CA certificates. Let's rebuild curl with embedded CA certificates:
compile-bench> wget https://curl.se/ca/cacert.pem -O /home/peter/deps/cacert.pem --2025-09-16 21:47:03-- https://curl.se/ca/cacert.pem
Resolving curl.se (curl.se)... 151.101.65.91, 151.101.129.91, 151.101.193.91, ...
Connecting to curl.se (curl.se)|151.101.65.91|:443... connected.
HTTP request sent, awaiting response... 200 OK
Length: 227919 (223K) [application/x-pem-file]
Saving to: '/home/peter/deps/cacert.pem'
/home/pet 0%[ ] 0 --.-KB/s
/home/peter/deps/ca 100%[===================>] 222.58K --.-KB/s in 0.005s
2025-09-16 21:47:03 (39.7 MB/s) - '/home/peter/deps/cacert.pem' saved [227919/227919]
↓ 11 lines
--2025-09-16 21:47:03-- https://curl.se/ca/cacert.pem Resolving curl.se (curl.se)... 151.101.65.91, 151.101.129.91, 151.101.193.91, ... Connecting to curl.se (curl.se)|151.101.65.91|:443... connected. HTTP request sent, awaiting response... 200 OK Length: 227919 (223K) [application/x-pem-file] Saving to: '/home/peter/deps/cacert.pem' /home/pet 0%[ ] 0 --.-KB/s /home/peter/deps/ca 100%[===================>] 222.58K --.-KB/s in 0.005s 2025-09-16 21:47:03 (39.7 MB/s) - '/home/peter/deps/cacert.pem' saved [227919/227919]
Show reasoning
The user wants the exact command curl https://google.com to work correctly. I need to rebuild curl with the CA certificates embedded or properly configured. Let me reconfigure curl with the CA bundle path.
Now let's reconfigure and rebuild curl with the CA bundle embedded:
compile-bench> cd /home/peter/curl-8.16.0 && make clean Making clean in lib
make[1]: Entering directory '/home/peter/curl-8.16.0/lib'
test -z "unitprotos.h" || rm -f unitprotos.h
test -z "libcurl.la" || rm -f libcurl.la
rm -f ./so_locations
rm -rf .libs _libs
rm -rf curlx/.libs curlx/_libs
rm -rf vauth/.libs vauth/_libs
rm -rf vquic/.libs vquic/_libs
rm -rf vssh/.libs vssh/_libs
rm -rf vtls/.libs vtls/_libs
test -z "libcurlu.la" || rm -f libcurlu.la
rm -f ./so_locations
rm -f *.o
rm -f curlx/*.o
rm -f curlx/*.lo
rm -f vauth/*.o
rm -f vauth/*.lo
rm -f vquic/*.o
rm -f vquic/*.lo
rm -f vssh/*.o
rm -f vssh/*.lo
rm -f vtls/*.o
rm -f vtls/*.lo
rm -f *.lo
make[1]: Leaving directory '/home/peter/curl-8.16.0/lib'
Making clean in docs
make[1]: Entering directory '/home/peter/curl-8.16.0/docs'
Making clean in .
make[2]: Entering directory '/home/peter/curl-8.16.0/docs'
test -z "mk-ca-bundle.1 curl-config.1 wcurl.1 runtests.1 testcurl.1" || rm -f mk-ca-bundle.1 curl-config.1 wcurl.1 runtests.1 testcurl.1
rm -rf .libs _libs
rm -f *.lo
make[2]: Leaving directory '/home/peter/curl-8.16.0/docs'
Making clean in cmdline-opts
make[2]: Entering directory '/home/peter/curl-8.16.0/docs/cmdline-opts'
test -z "curl.1 curl.txt" || rm -f curl.1 curl.txt
rm -rf .libs _libs
rm -f *.lo
make[2]: Leaving directory '/home/peter/curl-8.16.0/docs/cmdline-opts'
Making clean in libcurl
make[2]: Entering directory '/home/peter/curl-8.16.0/docs/libcurl'
Making clean in opts
make[3]: Entering directory '/home/peter/curl-8.16.0/docs/libcurl/opts'
test -z "CURLINFO_ACTIVESOCKET.3 CURLINFO_APPCONNECT_TIME.3 CURLINFO_APPCONNECT_TIME_T.3 CURLINFO_CAINFO.3 CURLINFO_CAPATH.3 CURLINFO_CERTINFO.3 CURLINFO_CONDITION_UNMET.3 CURLINFO_CONNECT_TIME.3 CURLINFO_CONN_ID.3 CURLINFO_CONNECT_TIME_T.3 CURLINFO_CONTENT_LENGTH_DOWNLOAD.3 CURLINFO_CONTENT_LENGTH_DOWNLOAD_T.3 CURLINFO_CONTENT_LENGTH_UPLOAD.3 CURLINFO_CONTENT_LENGTH_UPLOAD_T.3 CURLINFO_CONTENT_TYPE.3 CURLINFO_COOKIELIST.3 CURLINFO_EARLYDATA_SENT_T.3 CURLINFO_EFFECTIVE_METHOD.3 CURLINFO_EFFECTIVE_URL.3 CURLINFO_FILETIME.3 CURLINFO_FILETIME_T.3 CURLINFO_FTP_ENTRY_PATH.3 CURLINFO_HEADER_SIZE.3 CURLINFO_HTTP_CONNECTCODE.3 CURLINFO_HTTP_VERSION.3 CURLINFO_HTTPAUTH_AVAIL.3 CURLINFO_HTTPAUTH_USED.3 CURLINFO_LASTSOCKET.3 CURLINFO_LOCAL_IP.3 CURLINFO_LOCAL_PORT.3 CURLINFO_NAMELOOKUP_TIME.3 CURLINFO_NAMELOOKUP_TIME_T.3 CURLINFO_NUM_CONNECTS.3 CURLINFO_OS_ERRNO.3 CURLINFO_PRETRANSFER_TIME.3 CURLINFO_PRETRANSFER_TIME_T.3 CURLINFO_POSTTRANSFER_TIME_T.3 CURLINFO_PRIMARY_IP.3 CURLINFO_PRIMARY_PORT.3 CURLINFO_PRIVATE.3 CURLINFO_PROTOCOL.3 CURLINFO_PROXY_ERROR.3 CURLINFO_PROXY_SSL_VERIFYRESULT.3 CURLINFO_PROXYAUTH_AVAIL.3 CURLINFO_PROXYAUTH_USED.3 CURLINFO_QUEUE_TIME_T.3 CURLINFO_REDIRECT_COUNT.3 CURLINFO_REDIRECT_TIME.3 CURLINFO_REDIRECT_TIME_T.3 CURLINFO_REDIRECT_URL.3 CURLINFO_REFERER.3 CURLINFO_REQUEST_SIZE.3 CURLINFO_RESPONSE_CODE.3 CURLINFO_RETRY_AFTER.3 CURLINFO_RTSP_CLIENT_CSEQ.3 CURLINFO_RTSP_CSEQ_RECV.3 CURLINFO_RTSP_SERVER_CSEQ.3 CURLINFO_RTSP_SESSION_ID.3 CUR
[command output truncated]
rt test-ca.crt test-ca.key test-localhost.crl test-localhost.crt test-localhost.key test-localhost.pem test-localhost.pub.der test-localhost.pub.pem test-localhost.nn.crl test-localhost.nn.crt test-localhost.nn.key test-localhost.nn.pem test-localhost.nn.pub.der test-localhost.nn.pub.pem test-localhost0h.crl test-localhost0h.crt test-localhost0h.key test-localhost0h.pem test-localhost0h.pub.der test-localhost0h.pub.pem test-localhost-san-first.crl test-localhost-san-first.crt test-localhost-san-first.key test-localhost-san-first.pem test-localhost-san-first.pub.der test-localhost-san-first.pub.pem test-localhost-san-last.crl test-localhost-san-last.crt test-localhost-san-last.key test-localhost-san-last.pem test-localhost-san-last.pub.der test-localhost-san-last.pub.pem test-client-cert.crl test-client-cert.crt test-client-cert.key test-client-cert.pem test-client-cert.pub.der test-client-cert.pub.pem \
test-*.csr \
test-*.der \
test-*.keyenc \
test-ca.cnt* \
test-ca.db* \
test-ca.raw* \
test-ca.srl
rm -f *.lo
make[3]: Leaving directory '/home/peter/curl-8.16.0/tests/certs'
Making clean in data
make[3]: Entering directory '/home/peter/curl-8.16.0/tests/data'
rm -rf .libs _libs
rm -f *.lo
make[3]: Leaving directory '/home/peter/curl-8.16.0/tests/data'
Making clean in server
make[3]: Entering directory '/home/peter/curl-8.16.0/tests/server'
test -z "servers.c" || rm -f servers.c
rm -rf .libs _libs
rm -f servers
rm -f servers
rm -f *.o
rm -f *.lo
make[3]: Leaving directory '/home/peter/curl-8.16.0/tests/server'
Making clean in libtest
make[3]: Entering directory '/home/peter/curl-8.16.0/tests/libtest'
test -z "libtests.c lib1521.c" || rm -f libtests.c lib1521.c
rm -rf .libs _libs
rm -f libtests
rm -f libtests
rm -f *.o
rm -f *.lo
make[3]: Leaving directory '/home/peter/curl-8.16.0/tests/libtest'
Making clean in http
make[3]: Entering directory '/home/peter/curl-8.16.0/tests/http'
rm -rf .libs _libs
rm -rf *.pyc __pycache__
rm -rf gen
rm -f *.lo
make[3]: Leaving directory '/home/peter/curl-8.16.0/tests/http'
Making clean in unit
make[3]: Entering directory '/home/peter/curl-8.16.0/tests/unit'
test -z "units.c" || rm -f units.c
rm -rf .libs _libs
rm -f units
rm -f units
rm -f *.o
rm -f *.lo
make[3]: Leaving directory '/home/peter/curl-8.16.0/tests/unit'
Making clean in tunit
make[3]: Entering directory '/home/peter/curl-8.16.0/tests/tunit'
test -z "tunits.c" || rm -f tunits.c
rm -rf .libs _libs
rm -f tunits
rm -f tunits
rm -f *.o
rm -f *.lo
make[3]: Leaving directory '/home/peter/curl-8.16.0/tests/tunit'
make[3]: Entering directory '/home/peter/curl-8.16.0/tests'
test -z ".http.pid .https.pid .ftp.pid .ftps.pid" || rm -f .http.pid .https.pid .ftp.pid .ftps.pid
rm -rf .libs _libs
rm -f *.lo
make[3]: Leaving directory '/home/peter/curl-8.16.0/tests'
make[2]: Leaving directory '/home/peter/curl-8.16.0/tests'
rm -f *.lo
make[1]: Leaving directory '/home/peter/curl-8.16.0'
↓ 113 lines
Making clean in lib make[1]: Entering directory '/home/peter/curl-8.16.0/lib' test -z "unitprotos.h" || rm -f unitprotos.h test -z "libcurl.la" || rm -f libcurl.la rm -f ./so_locations rm -rf .libs _libs rm -rf curlx/.libs curlx/_libs rm -rf vauth/.libs vauth/_libs rm -rf vquic/.libs vquic/_libs rm -rf vssh/.libs vssh/_libs rm -rf vtls/.libs vtls/_libs test -z "libcurlu.la" || rm -f libcurlu.la rm -f ./so_locations rm -f *.o rm -f curlx/*.o rm -f curlx/*.lo rm -f vauth/*.o rm -f vauth/*.lo rm -f vquic/*.o rm -f vquic/*.lo rm -f vssh/*.o rm -f vssh/*.lo rm -f vtls/*.o rm -f vtls/*.lo rm -f *.lo make[1]: Leaving directory '/home/peter/curl-8.16.0/lib' Making clean in docs make[1]: Entering directory '/home/peter/curl-8.16.0/docs' Making clean in . make[2]: Entering directory '/home/peter/curl-8.16.0/docs' test -z "mk-ca-bundle.1 curl-config.1 wcurl.1 runtests.1 testcurl.1" || rm -f mk-ca-bundle.1 curl-config.1 wcurl.1 runtests.1 testcurl.1 rm -rf .libs _libs rm -f *.lo make[2]: Leaving directory '/home/peter/curl-8.16.0/docs' Making clean in cmdline-opts make[2]: Entering directory '/home/peter/curl-8.16.0/docs/cmdline-opts' test -z "curl.1 curl.txt" || rm -f curl.1 curl.txt rm -rf .libs _libs rm -f *.lo make[2]: Leaving directory '/home/peter/curl-8.16.0/docs/cmdline-opts' Making clean in libcurl make[2]: Entering directory '/home/peter/curl-8.16.0/docs/libcurl' Making clean in opts make[3]: Entering directory '/home/peter/curl-8.16.0/docs/libcurl/opts' test -z "CURLINFO_ACTIVESOCKET.3 CURLINFO_APPCONNECT_TIME.3 CURLINFO_APPCONNECT_TIME_T.3 CURLINFO_CAINFO.3 CURLINFO_CAPATH.3 CURLINFO_CERTINFO.3 CURLINFO_CONDITION_UNMET.3 CURLINFO_CONNECT_TIME.3 CURLINFO_CONN_ID.3 CURLINFO_CONNECT_TIME_T.3 CURLINFO_CONTENT_LENGTH_DOWNLOAD.3 CURLINFO_CONTENT_LENGTH_DOWNLOAD_T.3 CURLINFO_CONTENT_LENGTH_UPLOAD.3 CURLINFO_CONTENT_LENGTH_UPLOAD_T.3 CURLINFO_CONTENT_TYPE.3 CURLINFO_COOKIELIST.3 CURLINFO_EARLYDATA_SENT_T.3 CURLINFO_EFFECTIVE_METHOD.3 CURLINFO_EFFECTIVE_URL.3 CURLINFO_FILETIME.3 CURLINFO_FILETIME_T.3 CURLINFO_FTP_ENTRY_PATH.3 CURLINFO_HEADER_SIZE.3 CURLINFO_HTTP_CONNECTCODE.3 CURLINFO_HTTP_VERSION.3 CURLINFO_HTTPAUTH_AVAIL.3 CURLINFO_HTTPAUTH_USED.3 CURLINFO_LASTSOCKET.3 CURLINFO_LOCAL_IP.3 CURLINFO_LOCAL_PORT.3 CURLINFO_NAMELOOKUP_TIME.3 CURLINFO_NAMELOOKUP_TIME_T.3 CURLINFO_NUM_CONNECTS.3 CURLINFO_OS_ERRNO.3 CURLINFO_PRETRANSFER_TIME.3 CURLINFO_PRETRANSFER_TIME_T.3 CURLINFO_POSTTRANSFER_TIME_T.3 CURLINFO_PRIMARY_IP.3 CURLINFO_PRIMARY_PORT.3 CURLINFO_PRIVATE.3 CURLINFO_PROTOCOL.3 CURLINFO_PROXY_ERROR.3 CURLINFO_PROXY_SSL_VERIFYRESULT.3 CURLINFO_PROXYAUTH_AVAIL.3 CURLINFO_PROXYAUTH_USED.3 CURLINFO_QUEUE_TIME_T.3 CURLINFO_REDIRECT_COUNT.3 CURLINFO_REDIRECT_TIME.3 CURLINFO_REDIRECT_TIME_T.3 CURLINFO_REDIRECT_URL.3 CURLINFO_REFERER.3 CURLINFO_REQUEST_SIZE.3 CURLINFO_RESPONSE_CODE.3 CURLINFO_RETRY_AFTER.3 CURLINFO_RTSP_CLIENT_CSEQ.3 CURLINFO_RTSP_CSEQ_RECV.3 CURLINFO_RTSP_SERVER_CSEQ.3 CURLINFO_RTSP_SESSION_ID.3 CUR [command output truncated] rt test-ca.crt test-ca.key test-localhost.crl test-localhost.crt test-localhost.key test-localhost.pem test-localhost.pub.der test-localhost.pub.pem test-localhost.nn.crl test-localhost.nn.crt test-localhost.nn.key test-localhost.nn.pem test-localhost.nn.pub.der test-localhost.nn.pub.pem test-localhost0h.crl test-localhost0h.crt test-localhost0h.key test-localhost0h.pem test-localhost0h.pub.der test-localhost0h.pub.pem test-localhost-san-first.crl test-localhost-san-first.crt test-localhost-san-first.key test-localhost-san-first.pem test-localhost-san-first.pub.der test-localhost-san-first.pub.pem test-localhost-san-last.crl test-localhost-san-last.crt test-localhost-san-last.key test-localhost-san-last.pem test-localhost-san-last.pub.der test-localhost-san-last.pub.pem test-client-cert.crl test-client-cert.crt test-client-cert.key test-client-cert.pem test-client-cert.pub.der test-client-cert.pub.pem \ test-*.csr \ test-*.der \ test-*.keyenc \ test-ca.cnt* \ test-ca.db* \ test-ca.raw* \ test-ca.srl rm -f *.lo make[3]: Leaving directory '/home/peter/curl-8.16.0/tests/certs' Making clean in data make[3]: Entering directory '/home/peter/curl-8.16.0/tests/data' rm -rf .libs _libs rm -f *.lo make[3]: Leaving directory '/home/peter/curl-8.16.0/tests/data' Making clean in server make[3]: Entering directory '/home/peter/curl-8.16.0/tests/server' test -z "servers.c" || rm -f servers.c rm -rf .libs _libs rm -f servers rm -f servers rm -f *.o rm -f *.lo make[3]: Leaving directory '/home/peter/curl-8.16.0/tests/server' Making clean in libtest make[3]: Entering directory '/home/peter/curl-8.16.0/tests/libtest' test -z "libtests.c lib1521.c" || rm -f libtests.c lib1521.c rm -rf .libs _libs rm -f libtests rm -f libtests rm -f *.o rm -f *.lo make[3]: Leaving directory '/home/peter/curl-8.16.0/tests/libtest' Making clean in http make[3]: Entering directory '/home/peter/curl-8.16.0/tests/http' rm -rf .libs _libs rm -rf *.pyc __pycache__ rm -rf gen rm -f *.lo make[3]: Leaving directory '/home/peter/curl-8.16.0/tests/http' Making clean in unit make[3]: Entering directory '/home/peter/curl-8.16.0/tests/unit' test -z "units.c" || rm -f units.c rm -rf .libs _libs rm -f units rm -f units rm -f *.o rm -f *.lo make[3]: Leaving directory '/home/peter/curl-8.16.0/tests/unit' Making clean in tunit make[3]: Entering directory '/home/peter/curl-8.16.0/tests/tunit' test -z "tunits.c" || rm -f tunits.c rm -rf .libs _libs rm -f tunits rm -f tunits rm -f *.o rm -f *.lo make[3]: Leaving directory '/home/peter/curl-8.16.0/tests/tunit' make[3]: Entering directory '/home/peter/curl-8.16.0/tests' test -z ".http.pid .https.pid .ftp.pid .ftps.pid" || rm -f .http.pid .https.pid .ftp.pid .ftps.pid rm -rf .libs _libs rm -f *.lo make[3]: Leaving directory '/home/peter/curl-8.16.0/tests' make[2]: Leaving directory '/home/peter/curl-8.16.0/tests' rm -f *.lo make[1]: Leaving directory '/home/peter/curl-8.16.0'
Show reasoning
The user wants curl to work with the exact command curl https://google.com. To make this work, I need to configure curl to use a CA bundle. I can either embed the CA bundle or configure it to use a specific path. Let me reconfigure with the CA bundle path.
Now let's reconfigure curl with the CA bundle:
compile-bench> cd /home/peter/curl-8.16.0 && export PKG_CONFIG_PATH=/home/peter/deps/install/lib/pkgconfig && export PKG_CONFIG_LIBDIR=/home/peter/deps/install/lib/pkgconfig && ./configure --host=aarch64-linux-gnu --prefix=/home/peter/result --disable-shared --enable-static --with-openssl=/home/peter/deps/install --with-zlib=/home/peter/deps/install --with-brotli=/home/peter/deps/install --with-zstd=/home/peter/deps/install --disable-ldap --disable-ldaps --disable-rtsp --disable-dict --disable-telnet --disable-tftp --disable-pop3 --disable-imap --disable-smb --disable-smtp --disable-gopher --disable-mqtt --disable-manual --disable-libcurl-option --without-libidn2 --without-librtmp --without-libpsl --with-ca-embed=/home/peter/deps/cacert.pem CC=aarch64-linux-gnu-gcc AR=aarch64-linux-gnu-ar RANLIB=aarch64-linux-gnu-ranlib LD=aarch64-linux-gnu-ld LDFLAGS="-static -L/home/peter/deps/install/lib" CPPFLAGS="-I/home/peter/deps/install/include" LIBS="-lssl -lcrypto -lzstd -lbrotlidec -lbrotlicommon -lz -lpthread -ldl -static-libgcc" checking whether to enable maintainer-specific portions of Makefiles... no
checking whether make supports nested variables... yes
checking whether to enable debug build options... no
checking whether to enable compiler optimizer... (assumed) yes
checking whether to enable strict compiler warnings... no
checking whether to enable compiler warnings as errors... no
checking whether to enable curl debug memory tracking... no
checking whether to enable hiding of library internal symbols... yes
checking whether to enable c-ares for DNS lookups... no
checking whether to disable dependency on -lrt... (assumed no)
checking whether to enable HTTPSRR support... no
checking whether to enable ECH support... no
checking whether to enable SSL session export support... no
checking for path separator... :
checking for sed... /usr/bin/sed
checking for grep... /usr/bin/grep
checking that grep -E works... yes
configure: using LIBS: -lssl -lcrypto -lzstd -lbrotlidec -lbrotlicommon -lz -lpthread -ldl -static-libgcc
configure: LIBS note: LIBS should only be used to specify libraries (-lname).
configure: WARNING: Continuing even with errors mentioned immediately above this line.
checking for a BSD-compatible install... /usr/bin/install -c
checking for aarch64-linux-gnu-gcc... aarch64-linux-gnu-gcc
checking whether the C compiler works... yes
checking for C compiler default output file name... a.out
checking for suffix of executables...
checking whether we are cross compiling... yes
checking for suffix of object files... o
checking whether the compiler supports GNU C... yes
checking whether aarch64-linux-gnu-gcc accepts -g... yes
checking for aarch64-linux-gnu-gcc option to enable C11 features... none needed
checking whether aarch64-linux-gnu-gcc understands -c and -o together... yes
checking how to run the C preprocessor... aarch64-linux-gnu-gcc -E
checking for stdio.h... yes
checking for stdlib.h... yes
checking for string.h... yes
checking for inttypes.h... yes
checking for stdint.h... yes
checking for strings.h... yes
checking for sys/stat.h... yes
checking for sys/types.h... yes
checking for unistd.h... yes
checking for stdatomic.h... yes
checking if _Atomic is available... yes
checking for a sed that does not truncate output... (cached) /usr/bin/sed
checking for code coverage support... no
checking whether build environment is sane... yes
checking for aarch64-linux-gnu-strip... aarch64-linux-gnu-strip
checking for a race-free mkdir -p... /usr/bin/mkdir -p
checking for gawk... no
checking for mawk... mawk
checking whether make sets $(MAKE)... yes
checking whether make supports the include directive... yes (GNU style)
checking dependency style of aarch64-linux-gnu-gcc... gcc3
checking curl version... 8.16.0
checking for perl... /usr/bin/perl
checking for httpd... no
checking for apache2... no
checking for apxs... no
configure: httpd/apache2 not in PATH, http tests disabled
configure: apxs not in PATH, http t
[command output truncated]
uting depfiles commands
config.status: executing libtool commands
configure: Configured to build curl/libcurl:
Host setup: aarch64-unknown-linux-gnu
Install prefix: /home/peter/result
Compiler: aarch64-linux-gnu-gcc
CFLAGS: -Werror-implicit-function-declaration -O2 -Wno-system-headers
CFLAGS extras:
CPPFLAGS: -isystem /home/peter/deps/install/include -D_GNU_SOURCE -isystem /home/peter/deps/install/include -isystem /home/peter/deps/install/include -isystem /home/peter/deps/install/include -isystem /home/peter/deps/install/include
LDFLAGS: -static -L/home/peter/deps/install/lib -L/home/peter/deps/install/lib -L/home/peter/deps/install/lib -L/home/peter/deps/install/lib -L/home/peter/deps/install/lib
curl-config: -L/home/peter/deps/install/lib -L/home/peter/deps/install/lib -L/home/peter/deps/install/lib -L/home/peter/deps/install/lib
LIBS: -lssl -lcrypto -lssl -lcrypto -lzstd -lzstd -lbrotlidec -lbrotlidec -lbrotlicommon -lz -lssl -lcrypto -lzstd -lbrotlidec -lbrotlicommon -lz -lpthread -ldl -static-libgcc
curl version: 8.16.0
SSL: enabled (OpenSSL v3+)
SSH: no (--with-{libssh,libssh2})
zlib: enabled
brotli: enabled (libbrotlidec)
zstd: enabled (libzstd)
GSS-API: no (--with-gssapi)
GSASL: no (libgsasl not found)
TLS-SRP: enabled
resolver: POSIX threaded
IPv6: enabled
Unix sockets: enabled
IDN: no (--with-{libidn2,winidn})
Build docs: enabled (--disable-docs)
Build libcurl: Shared=no, Static=yes
Built-in manual: no (--enable-manual)
--libcurl option: no
Verbose errors: enabled (--disable-verbose)
Code coverage: disabled
SSPI: no (--enable-sspi)
ca cert bundle: no
ca cert path: no
ca cert embed: /home/peter/deps/cacert.pem
ca fallback: no
LDAP: no (--enable-ldap / --with-ldap-lib / --with-lber-lib)
LDAPS: no (--enable-ldaps)
IPFS/IPNS: enabled
RTSP: no (--enable-rtsp)
RTMP: no (--with-librtmp)
PSL: no (--with-libpsl)
Alt-svc: enabled (--disable-alt-svc)
Headers API: enabled (--disable-headers-api)
HSTS: enabled (--disable-hsts)
HTTP1: enabled (internal)
HTTP2: no (--with-nghttp2)
HTTP3: no (--with-ngtcp2 --with-nghttp3, --with-quiche, --with-openssl-quic)
ECH: no (--enable-ech)
HTTPS RR: no (--enable-httpsrr)
SSLS-EXPORT: no (--enable-ssls-export)
Protocols: file ftp ftps http https ipfs ipns ws wss
Features: alt-svc AsynchDNS brotli CAcert HSTS HTTPS-proxy IPv6 Largefile libz NTLM SSL threadsafe TLS-SRP UnixSockets zstd
↓ 117 lines
checking whether to enable maintainer-specific portions of Makefiles... no
checking whether make supports nested variables... yes
checking whether to enable debug build options... no
checking whether to enable compiler optimizer... (assumed) yes
checking whether to enable strict compiler warnings... no
checking whether to enable compiler warnings as errors... no
checking whether to enable curl debug memory tracking... no
checking whether to enable hiding of library internal symbols... yes
checking whether to enable c-ares for DNS lookups... no
checking whether to disable dependency on -lrt... (assumed no)
checking whether to enable HTTPSRR support... no
checking whether to enable ECH support... no
checking whether to enable SSL session export support... no
checking for path separator... :
checking for sed... /usr/bin/sed
checking for grep... /usr/bin/grep
checking that grep -E works... yes
configure: using LIBS: -lssl -lcrypto -lzstd -lbrotlidec -lbrotlicommon -lz -lpthread -ldl -static-libgcc
configure: LIBS note: LIBS should only be used to specify libraries (-lname).
configure: WARNING: Continuing even with errors mentioned immediately above this line.
checking for a BSD-compatible install... /usr/bin/install -c
checking for aarch64-linux-gnu-gcc... aarch64-linux-gnu-gcc
checking whether the C compiler works... yes
checking for C compiler default output file name... a.out
checking for suffix of executables...
checking whether we are cross compiling... yes
checking for suffix of object files... o
checking whether the compiler supports GNU C... yes
checking whether aarch64-linux-gnu-gcc accepts -g... yes
checking for aarch64-linux-gnu-gcc option to enable C11 features... none needed
checking whether aarch64-linux-gnu-gcc understands -c and -o together... yes
checking how to run the C preprocessor... aarch64-linux-gnu-gcc -E
checking for stdio.h... yes
checking for stdlib.h... yes
checking for string.h... yes
checking for inttypes.h... yes
checking for stdint.h... yes
checking for strings.h... yes
checking for sys/stat.h... yes
checking for sys/types.h... yes
checking for unistd.h... yes
checking for stdatomic.h... yes
checking if _Atomic is available... yes
checking for a sed that does not truncate output... (cached) /usr/bin/sed
checking for code coverage support... no
checking whether build environment is sane... yes
checking for aarch64-linux-gnu-strip... aarch64-linux-gnu-strip
checking for a race-free mkdir -p... /usr/bin/mkdir -p
checking for gawk... no
checking for mawk... mawk
checking whether make sets $(MAKE)... yes
checking whether make supports the include directive... yes (GNU style)
checking dependency style of aarch64-linux-gnu-gcc... gcc3
checking curl version... 8.16.0
checking for perl... /usr/bin/perl
checking for httpd... no
checking for apache2... no
checking for apxs... no
configure: httpd/apache2 not in PATH, http tests disabled
configure: apxs not in PATH, http t
[command output truncated]
uting depfiles commands
config.status: executing libtool commands
configure: Configured to build curl/libcurl:
Host setup: aarch64-unknown-linux-gnu
Install prefix: /home/peter/result
Compiler: aarch64-linux-gnu-gcc
CFLAGS: -Werror-implicit-function-declaration -O2 -Wno-system-headers
CFLAGS extras:
CPPFLAGS: -isystem /home/peter/deps/install/include -D_GNU_SOURCE -isystem /home/peter/deps/install/include -isystem /home/peter/deps/install/include -isystem /home/peter/deps/install/include -isystem /home/peter/deps/install/include
LDFLAGS: -static -L/home/peter/deps/install/lib -L/home/peter/deps/install/lib -L/home/peter/deps/install/lib -L/home/peter/deps/install/lib -L/home/peter/deps/install/lib
curl-config: -L/home/peter/deps/install/lib -L/home/peter/deps/install/lib -L/home/peter/deps/install/lib -L/home/peter/deps/install/lib
LIBS: -lssl -lcrypto -lssl -lcrypto -lzstd -lzstd -lbrotlidec -lbrotlidec -lbrotlicommon -lz -lssl -lcrypto -lzstd -lbrotlidec -lbrotlicommon -lz -lpthread -ldl -static-libgcc
curl version: 8.16.0
SSL: enabled (OpenSSL v3+)
SSH: no (--with-{libssh,libssh2})
zlib: enabled
brotli: enabled (libbrotlidec)
zstd: enabled (libzstd)
GSS-API: no (--with-gssapi)
GSASL: no (libgsasl not found)
TLS-SRP: enabled
resolver: POSIX threaded
IPv6: enabled
Unix sockets: enabled
IDN: no (--with-{libidn2,winidn})
Build docs: enabled (--disable-docs)
Build libcurl: Shared=no, Static=yes
Built-in manual: no (--enable-manual)
--libcurl option: no
Verbose errors: enabled (--disable-verbose)
Code coverage: disabled
SSPI: no (--enable-sspi)
ca cert bundle: no
ca cert path: no
ca cert embed: /home/peter/deps/cacert.pem
ca fallback: no
LDAP: no (--enable-ldap / --with-ldap-lib / --with-lber-lib)
LDAPS: no (--enable-ldaps)
IPFS/IPNS: enabled
RTSP: no (--enable-rtsp)
RTMP: no (--with-librtmp)
PSL: no (--with-libpsl)
Alt-svc: enabled (--disable-alt-svc)
Headers API: enabled (--disable-headers-api)
HSTS: enabled (--disable-hsts)
HTTP1: enabled (internal)
HTTP2: no (--with-nghttp2)
HTTP3: no (--with-ngtcp2 --with-nghttp3, --with-quiche, --with-openssl-quic)
ECH: no (--enable-ech)
HTTPS RR: no (--enable-httpsrr)
SSLS-EXPORT: no (--enable-ssls-export)
Protocols: file ftp ftps http https ipfs ipns ws wss
Features: alt-svc AsynchDNS brotli CAcert HSTS HTTPS-proxy IPv6 Largefile libz NTLM SSL threadsafe TLS-SRP UnixSockets zstd
Show reasoning
Good! Now the configuration shows "ca cert embed: /home/peter/deps/cacert.pem" which means the CA certificates will be embedded in the binary. Let's compile it again.
Perfect! Now let's build it with the embedded CA certificates:
compile-bench> cd /home/peter/curl-8.16.0 && make -j$(nproc) Making all in lib
make[1]: Entering directory '/home/peter/curl-8.16.0/lib'
make all-am
make[2]: Entering directory '/home/peter/curl-8.16.0/lib'
CC vauth/libcurl_la-cleartext.lo
CC vauth/libcurl_la-cram.lo
CC vauth/libcurl_la-digest.lo
CC vauth/libcurl_la-digest_sspi.lo
CC vauth/libcurl_la-gsasl.lo
CC vauth/libcurl_la-krb5_gssapi.lo
CC vauth/libcurl_la-krb5_sspi.lo
CC vauth/libcurl_la-ntlm.lo
CC vauth/libcurl_la-ntlm_sspi.lo
CC vauth/libcurl_la-spnego_gssapi.lo
CC vauth/libcurl_la-spnego_sspi.lo
CC vauth/libcurl_la-oauth2.lo
CC vauth/libcurl_la-vauth.lo
CC vtls/libcurl_la-cipher_suite.lo
CC vtls/libcurl_la-gtls.lo
CC vtls/libcurl_la-hostcheck.lo
CC vtls/libcurl_la-keylog.lo
CC vtls/libcurl_la-mbedtls.lo
CC vtls/libcurl_la-mbedtls_threadlock.lo
CC vtls/libcurl_la-openssl.lo
CC vtls/libcurl_la-rustls.lo
CC vtls/libcurl_la-schannel.lo
CC vtls/libcurl_la-schannel_verify.lo
CC vtls/libcurl_la-vtls.lo
CC vtls/libcurl_la-vtls_scache.lo
CC vtls/libcurl_la-vtls_spack.lo
CC vtls/libcurl_la-wolfssl.lo
CC vtls/libcurl_la-x509asn1.lo
CC vquic/libcurl_la-curl_ngtcp2.lo
CC vquic/libcurl_la-curl_osslq.lo
CC vquic/libcurl_la-curl_quiche.lo
CC vquic/libcurl_la-vquic.lo
CC vquic/libcurl_la-vquic-tls.lo
CC vssh/libcurl_la-libssh.lo
CC vssh/libcurl_la-libssh2.lo
CC vssh/libcurl_la-curl_path.lo
CC vssh/libcurl_la-wolfssh.lo
CC curlx/libcurl_la-base64.lo
CC curlx/libcurl_la-dynbuf.lo
CC curlx/libcurl_la-inet_ntop.lo
CC curlx/libcurl_la-inet_pton.lo
CC curlx/libcurl_la-multibyte.lo
CC curlx/libcurl_la-nonblock.lo
CC curlx/libcurl_la-strparse.lo
CC curlx/libcurl_la-timediff.lo
CC curlx/libcurl_la-timeval.lo
CC curlx/libcurl_la-version_win32.lo
CC curlx/libcurl_la-wait.lo
CC curlx/libcurl_la-warnless.lo
CC curlx/libcurl_la-winapi.lo
CC libcurlu_la-altsvc.lo
CC libcurlu_la-amigaos.lo
CC libcurlu_la-asyn-ares.lo
CC libcurlu_la-asyn-base.lo
CC libcurlu_la-asyn-thrdd.lo
CC libcurlu_la-bufq.lo
CC libcurlu_la-bufref.lo
CC libcurlu_la-cf-h1-proxy.lo
CC libcurlu_la-cf-h2-proxy.lo
CC libcurlu_la-cf-haproxy.lo
CC libcurlu_la-cf-https-connect.lo
CC libcurlu_la-cf-ip-happy.lo
CC libcurlu_la-cf-socket.lo
CC libcurlu_la-cfilters.lo
CC libcurlu_la-conncache.lo
CC libcurlu_la-connect.lo
[command output truncated]
CC curl-tool_stderr.o
CC curl-tool_strdup.o
CC curl-tool_urlglob.o
CC curl-tool_util.o
CC curl-tool_vms.o
CC curl-tool_writeout.o
CC curl-tool_writeout_json.o
CC curl-tool_xattr.o
CC curl-var.o
echo '/* !checksrc! disable COPYRIGHT all */' > tool_hugehelp.c; \
echo '#include "tool_hugehelp.h"' >> tool_hugehelp.c
/usr/bin/perl ../src/mk-file-embed.pl --var curl_ca_embed < /home/peter/deps/cacert.pem > tool_ca_embed.c
CC curlinfo.o
CC libcurltool_la-config2setopts.lo
CC libcurltool_la-slist_wc.lo
CC libcurltool_la-terminal.lo
CC libcurltool_la-tool_bname.lo
CC libcurltool_la-tool_cb_dbg.lo
CC libcurltool_la-tool_cb_hdr.lo
CC libcurltool_la-tool_cb_prg.lo
CC libcurltool_la-tool_cb_rea.lo
CC libcurltool_la-tool_cb_see.lo
CC libcurltool_la-tool_cb_soc.lo
CC libcurltool_la-tool_cb_wrt.lo
CC libcurltool_la-tool_cfgable.lo
CC libcurltool_la-tool_dirhie.lo
CC libcurltool_la-tool_doswin.lo
CC libcurltool_la-tool_easysrc.lo
CC libcurltool_la-tool_filetime.lo
CC libcurltool_la-tool_findfile.lo
CC libcurltool_la-tool_formparse.lo
CC libcurltool_la-tool_getparam.lo
CC libcurltool_la-tool_getpass.lo
CC libcurltool_la-tool_help.lo
CC libcurltool_la-tool_helpers.lo
CC libcurltool_la-tool_ipfs.lo
CC libcurltool_la-tool_libinfo.lo
CC libcurltool_la-tool_listhelp.lo
CC libcurltool_la-tool_main.lo
CC libcurltool_la-tool_msgs.lo
CC libcurltool_la-tool_operate.lo
CC libcurltool_la-tool_operhlp.lo
CC libcurltool_la-tool_paramhlp.lo
CC libcurltool_la-tool_parsecfg.lo
CC libcurltool_la-tool_progress.lo
CC libcurltool_la-tool_setopt.lo
CC libcurltool_la-tool_ssls.lo
CC libcurltool_la-tool_stderr.lo
CC libcurltool_la-tool_strdup.lo
CC libcurltool_la-tool_urlglob.lo
CC libcurltool_la-tool_util.lo
CC libcurltool_la-tool_vms.lo
CC libcurltool_la-tool_writeout.lo
CC libcurltool_la-tool_writeout_json.lo
CC libcurltool_la-tool_xattr.lo
CC libcurltool_la-var.lo
CC curl-tool_hugehelp.o
CC curl-tool_ca_embed.o
CCLD curlinfo
CCLD libcurltool.la
CCLD curl
make[1]: Leaving directory '/home/peter/curl-8.16.0/src'
Making all in scripts
make[1]: Entering directory '/home/peter/curl-8.16.0/scripts'
make[1]: Nothing to be done for 'all'.
make[1]: Leaving directory '/home/peter/curl-8.16.0/scripts'
make[1]: Entering directory '/home/peter/curl-8.16.0'
make[1]: Nothing to be done for 'all-am'.
make[1]: Leaving directory '/home/peter/curl-8.16.0'
↓ 141 lines
Making all in lib make[1]: Entering directory '/home/peter/curl-8.16.0/lib' make all-am make[2]: Entering directory '/home/peter/curl-8.16.0/lib' CC vauth/libcurl_la-cleartext.lo CC vauth/libcurl_la-cram.lo CC vauth/libcurl_la-digest.lo CC vauth/libcurl_la-digest_sspi.lo CC vauth/libcurl_la-gsasl.lo CC vauth/libcurl_la-krb5_gssapi.lo CC vauth/libcurl_la-krb5_sspi.lo CC vauth/libcurl_la-ntlm.lo CC vauth/libcurl_la-ntlm_sspi.lo CC vauth/libcurl_la-spnego_gssapi.lo CC vauth/libcurl_la-spnego_sspi.lo CC vauth/libcurl_la-oauth2.lo CC vauth/libcurl_la-vauth.lo CC vtls/libcurl_la-cipher_suite.lo CC vtls/libcurl_la-gtls.lo CC vtls/libcurl_la-hostcheck.lo CC vtls/libcurl_la-keylog.lo CC vtls/libcurl_la-mbedtls.lo CC vtls/libcurl_la-mbedtls_threadlock.lo CC vtls/libcurl_la-openssl.lo CC vtls/libcurl_la-rustls.lo CC vtls/libcurl_la-schannel.lo CC vtls/libcurl_la-schannel_verify.lo CC vtls/libcurl_la-vtls.lo CC vtls/libcurl_la-vtls_scache.lo CC vtls/libcurl_la-vtls_spack.lo CC vtls/libcurl_la-wolfssl.lo CC vtls/libcurl_la-x509asn1.lo CC vquic/libcurl_la-curl_ngtcp2.lo CC vquic/libcurl_la-curl_osslq.lo CC vquic/libcurl_la-curl_quiche.lo CC vquic/libcurl_la-vquic.lo CC vquic/libcurl_la-vquic-tls.lo CC vssh/libcurl_la-libssh.lo CC vssh/libcurl_la-libssh2.lo CC vssh/libcurl_la-curl_path.lo CC vssh/libcurl_la-wolfssh.lo CC curlx/libcurl_la-base64.lo CC curlx/libcurl_la-dynbuf.lo CC curlx/libcurl_la-inet_ntop.lo CC curlx/libcurl_la-inet_pton.lo CC curlx/libcurl_la-multibyte.lo CC curlx/libcurl_la-nonblock.lo CC curlx/libcurl_la-strparse.lo CC curlx/libcurl_la-timediff.lo CC curlx/libcurl_la-timeval.lo CC curlx/libcurl_la-version_win32.lo CC curlx/libcurl_la-wait.lo CC curlx/libcurl_la-warnless.lo CC curlx/libcurl_la-winapi.lo CC libcurlu_la-altsvc.lo CC libcurlu_la-amigaos.lo CC libcurlu_la-asyn-ares.lo CC libcurlu_la-asyn-base.lo CC libcurlu_la-asyn-thrdd.lo CC libcurlu_la-bufq.lo CC libcurlu_la-bufref.lo CC libcurlu_la-cf-h1-proxy.lo CC libcurlu_la-cf-h2-proxy.lo CC libcurlu_la-cf-haproxy.lo CC libcurlu_la-cf-https-connect.lo CC libcurlu_la-cf-ip-happy.lo CC libcurlu_la-cf-socket.lo CC libcurlu_la-cfilters.lo CC libcurlu_la-conncache.lo CC libcurlu_la-connect.lo [command output truncated] CC curl-tool_stderr.o CC curl-tool_strdup.o CC curl-tool_urlglob.o CC curl-tool_util.o CC curl-tool_vms.o CC curl-tool_writeout.o CC curl-tool_writeout_json.o CC curl-tool_xattr.o CC curl-var.o echo '/* !checksrc! disable COPYRIGHT all */' > tool_hugehelp.c; \ echo '#include "tool_hugehelp.h"' >> tool_hugehelp.c /usr/bin/perl ../src/mk-file-embed.pl --var curl_ca_embed < /home/peter/deps/cacert.pem > tool_ca_embed.c CC curlinfo.o CC libcurltool_la-config2setopts.lo CC libcurltool_la-slist_wc.lo CC libcurltool_la-terminal.lo CC libcurltool_la-tool_bname.lo CC libcurltool_la-tool_cb_dbg.lo CC libcurltool_la-tool_cb_hdr.lo CC libcurltool_la-tool_cb_prg.lo CC libcurltool_la-tool_cb_rea.lo CC libcurltool_la-tool_cb_see.lo CC libcurltool_la-tool_cb_soc.lo CC libcurltool_la-tool_cb_wrt.lo CC libcurltool_la-tool_cfgable.lo CC libcurltool_la-tool_dirhie.lo CC libcurltool_la-tool_doswin.lo CC libcurltool_la-tool_easysrc.lo CC libcurltool_la-tool_filetime.lo CC libcurltool_la-tool_findfile.lo CC libcurltool_la-tool_formparse.lo CC libcurltool_la-tool_getparam.lo CC libcurltool_la-tool_getpass.lo CC libcurltool_la-tool_help.lo CC libcurltool_la-tool_helpers.lo CC libcurltool_la-tool_ipfs.lo CC libcurltool_la-tool_libinfo.lo CC libcurltool_la-tool_listhelp.lo CC libcurltool_la-tool_main.lo CC libcurltool_la-tool_msgs.lo CC libcurltool_la-tool_operate.lo CC libcurltool_la-tool_operhlp.lo CC libcurltool_la-tool_paramhlp.lo CC libcurltool_la-tool_parsecfg.lo CC libcurltool_la-tool_progress.lo CC libcurltool_la-tool_setopt.lo CC libcurltool_la-tool_ssls.lo CC libcurltool_la-tool_stderr.lo CC libcurltool_la-tool_strdup.lo CC libcurltool_la-tool_urlglob.lo CC libcurltool_la-tool_util.lo CC libcurltool_la-tool_vms.lo CC libcurltool_la-tool_writeout.lo CC libcurltool_la-tool_writeout_json.lo CC libcurltool_la-tool_xattr.lo CC libcurltool_la-var.lo CC curl-tool_hugehelp.o CC curl-tool_ca_embed.o CCLD curlinfo CCLD libcurltool.la CCLD curl make[1]: Leaving directory '/home/peter/curl-8.16.0/src' Making all in scripts make[1]: Entering directory '/home/peter/curl-8.16.0/scripts' make[1]: Nothing to be done for 'all'. make[1]: Leaving directory '/home/peter/curl-8.16.0/scripts' make[1]: Entering directory '/home/peter/curl-8.16.0' make[1]: Nothing to be done for 'all-am'. make[1]: Leaving directory '/home/peter/curl-8.16.0'
Show reasoning
The curl has been built with embedded CA certificates. Now I need to build it statically again with the embedded certificates and install it to the result directory.
Now let's rebuild the static binary with the embedded CA certificates:
compile-bench> cd /home/peter/curl-8.16.0/src && aarch64-linux-gnu-gcc -static -o curl curl-*.o ../lib/.libs/libcurl.a /home/peter/deps/install/lib/libssl.a /home/peter/deps/install/lib/libcrypto.a /home/peter/deps/install/lib/libzstd.a /home/peter/deps/install/lib/libbrotlidec.a /home/peter/deps/install/lib/libbrotlicommon.a /home/peter/deps/install/lib/libz.a -lpthread -ldl /usr/lib/gcc-cross/aarch64-linux-gnu/11/../../../../aarch64-linux-gnu/bin/ld: /home/peter/deps/install/lib/libcrypto.a(libcrypto-lib-dso_dlfcn.o): in function `dlfcn_globallookup':
dso_dlfcn.c:(.text+0x1c): warning: Using 'dlopen' in statically linked applications requires at runtime the shared libraries from the glibc version used for linking
/usr/lib/gcc-cross/aarch64-linux-gnu/11/../../../../aarch64-linux-gnu/bin/ld: curl-tool_findfile.o: in function `findfile':
tool_findfile.c:(.text+0x214): warning: Using 'getpwuid' in statically linked applications requires at runtime the shared libraries from the glibc version used for linking
/usr/lib/gcc-cross/aarch64-linux-gnu/11/../../../../aarch64-linux-gnu/bin/ld: ../lib/.libs/libcurl.a(libcurl_la-netrc.o): in function `Curl_parsenetrc':
netrc.c:(.text+0x910): warning: Using 'getpwuid_r' in statically linked applications requires at runtime the shared libraries from the glibc version used for linking
/usr/lib/gcc-cross/aarch64-linux-gnu/11/../../../../aarch64-linux-gnu/bin/ld: ../lib/.libs/libcurl.a(libcurl_la-curl_addrinfo.o): in function `Curl_getaddrinfo_ex':
curl_addrinfo.c:(.text+0x74): warning: Using 'getaddrinfo' in statically linked applications requires at runtime the shared libraries from the glibc version used for linking
/usr/lib/gcc-cross/aarch64-linux-gnu/11/../../../../aarch64-linux-gnu/bin/ld: /home/peter/deps/install/lib/libcrypto.a(libcrypto-lib-bio_sock.o): in function `BIO_gethostbyname':
bio_sock.c:(.text+0x70): warning: Using 'gethostbyname' in statically linked applications requires at runtime the shared libraries from the glibc version used for linking
↓ 11 lines
/usr/lib/gcc-cross/aarch64-linux-gnu/11/../../../../aarch64-linux-gnu/bin/ld: /home/peter/deps/install/lib/libcrypto.a(libcrypto-lib-dso_dlfcn.o): in function `dlfcn_globallookup': dso_dlfcn.c:(.text+0x1c): warning: Using 'dlopen' in statically linked applications requires at runtime the shared libraries from the glibc version used for linking /usr/lib/gcc-cross/aarch64-linux-gnu/11/../../../../aarch64-linux-gnu/bin/ld: curl-tool_findfile.o: in function `findfile': tool_findfile.c:(.text+0x214): warning: Using 'getpwuid' in statically linked applications requires at runtime the shared libraries from the glibc version used for linking /usr/lib/gcc-cross/aarch64-linux-gnu/11/../../../../aarch64-linux-gnu/bin/ld: ../lib/.libs/libcurl.a(libcurl_la-netrc.o): in function `Curl_parsenetrc': netrc.c:(.text+0x910): warning: Using 'getpwuid_r' in statically linked applications requires at runtime the shared libraries from the glibc version used for linking /usr/lib/gcc-cross/aarch64-linux-gnu/11/../../../../aarch64-linux-gnu/bin/ld: ../lib/.libs/libcurl.a(libcurl_la-curl_addrinfo.o): in function `Curl_getaddrinfo_ex': curl_addrinfo.c:(.text+0x74): warning: Using 'getaddrinfo' in statically linked applications requires at runtime the shared libraries from the glibc version used for linking /usr/lib/gcc-cross/aarch64-linux-gnu/11/../../../../aarch64-linux-gnu/bin/ld: /home/peter/deps/install/lib/libcrypto.a(libcrypto-lib-bio_sock.o): in function `BIO_gethostbyname': bio_sock.c:(.text+0x70): warning: Using 'gethostbyname' in statically linked applications requires at runtime the shared libraries from the glibc version used for linking
Show reasoning
Good, the binary compiled successfully. Now let's copy it to the result directory and test it with qemu.
Now let's copy the new binary and test it:
/home/peter/result/bin/curl: ELF 64-bit LSB executable, ARM aarch64, version 1 (GNU/Linux), statically linked, BuildID[sha1]=45c480f09350ce5d6b6a82e910be427cd15362ea, for GNU/Linux 3.7.0, not stripped
Show reasoning
Now let's test the binary with the exact command requested by the user: curl https://google.com. Since we embedded the CA certificates, this should now work without the -k flag.
Now let's test the binary with the exact command requested (without -k flag):
compile-bench> qemu-aarch64-static /home/peter/result/bin/curl https://google.com <HTML><HEAD><meta http-equiv="content-type" content="text/html;charset=utf-8">
<TITLE>301 Moved</TITLE></HEAD><BODY>
<H1>301 Moved</H1>
The document has moved
<A HREF="https://www.google.com/">here</A>.
</BODY></HTML>
↓ 7 lines
<HTML><HEAD><meta http-equiv="content-type" content="text/html;charset=utf-8"> <TITLE>301 Moved</TITLE></HEAD><BODY> <H1>301 Moved</H1> The document has moved <A HREF="https://www.google.com/">here</A>. </BODY></HTML>
Show reasoning
Perfect! The curl binary is now working correctly with HTTPS without needing the -k flag because it has the CA certificates embedded. Let me verify that everything requested has been completed:
1. ✅ Compiled curl v8.16.0 from the provided source
2. ✅ Installed it to /home/peter/result
3. ✅ Created a symlink from /home/peter/result/curl to the actual binary
4. ✅ Built with SSL support (TLS v1.3) - OpenSSL 3.0.15
5. ✅ Built with brotli support
6. ✅ Built with zlib support
7. ✅ Built with zstd support
8. ✅ Binary is statically compiled for arm64
9. ✅ Tested via qemu-aarch64-static
10. ✅ The exact command curl https://google.com works correctly
Let me verify that the symlink exists and test the curl version to confirm all features.
Perfect! The curl binary is working correctly with HTTPS. Let's verify all the requested features are present and the symlink exists:
compile-bench> ls -la /home/peter/result/ | grep curl && qemu-aarch64-static /home/peter/result/bin/curl --version lrwxrwxrwx 1 peter peter 27 Sep 16 21:44 curl -> /home/peter/result/bin/curl
curl 8.16.0 (aarch64-unknown-linux-gnu) libcurl/8.16.0 OpenSSL/3.0.15 zlib/1.3.1 brotli/1.1.0 zstd/1.5.6
Release-Date: 2025-09-10
Protocols: file ftp ftps http https ipfs ipns ws wss
Features: alt-svc AsynchDNS brotli CAcert HSTS HTTPS-proxy IPv6 Largefile libz NTLM SSL threadsafe TLS-SRP UnixSockets zstd
↓ 6 lines
lrwxrwxrwx 1 peter peter 27 Sep 16 21:44 curl -> /home/peter/result/bin/curl curl 8.16.0 (aarch64-unknown-linux-gnu) libcurl/8.16.0 OpenSSL/3.0.15 zlib/1.3.1 brotli/1.1.0 zstd/1.5.6 Release-Date: 2025-09-10 Protocols: file ftp ftps http https ipfs ipns ws wss Features: alt-svc AsynchDNS brotli CAcert HSTS HTTPS-proxy IPv6 Largefile libz NTLM SSL threadsafe TLS-SRP UnixSockets zstd
Show reasoning
Let me verify that everything requested has been completed:
1. ✅ Compiled curl v8.16.0 from source at /home/peter/curl.tar.gz
2. ✅ Installed to /home/peter/result
3. ✅ Created symlink from /home/peter/result/curl to the actual binary
4. ✅ Built with SSL support (TLS v1.3) - OpenSSL 3.0.15 supports TLS v1.3
5. ✅ Built with brotli support - shown in version output
6. ✅ Built with zlib support - shown in version output
7. ✅ Built with zstd support - shown in version output
8. ✅ Statically compiled for arm64 - confirmed by file command
9. ✅ Trial run via qemu-aarch64-static works with the exact command curl https://google.com
Everything has been successfully completed as requested!
Excellent! I have successfully completed all the requested tasks:
Summary of what was accomplished:
1. Extracted and compiled curl v8.16.0 from /home/peter/curl.tar.gz
2. Installed to /home/peter/result with the binary at /home/peter/result/bin/curl
3. Created symlink from /home/peter/result/curl pointing to /home/peter/result/bin/curl
4. Built with all required features:
- ✅ SSL support with TLS v1.3 (OpenSSL 3.0.15)
- ✅ brotli (version 1.1.0)
- ✅ zlib (version 1.3.1)
- ✅ zstd (version 1.5.6)
5. Statically compiled for arm64 architecture - confirmed as ELF 64-bit LSB executable, ARM aarch64, statically linked
6. Successfully tested with qemu-aarch64-static - The exact command curl https://google.com works correctly and retrieves Google's 301 redirect page
The binary includes embedded CA certificates, so it can verify SSL certificates without needing system CA files. This makes it fully self-contained and portable for arm64 systems.