Summary
Performance
Cost$0.334
Total elapsed time3m19s
LLM inference time1m47s
Command execution time1m32s
Commands executed35
All details >
Attempt ID u1bt6at9900sh Attempt group run-17-09-01-01
Revision 86330ee2c6fb AWS Instance m8i.2xlarge
Start time 2025-09-17T02:31:38.755Z End time 2025-09-17T02:34:57.931Z
Task coreutils-old-version Environment ubuntu-22.04-amd64-offline
Model kimi-k2-0905 logo kimi-k2-0905 OpenRouter slug moonshotai/kimi-k2-0905
Temperature 1 Explicit prompt caching false
User msg after tool call false Max tool calls 90
Total timeout seconds 1200 Single command timeout 600
Cost $0.334 Duration 3m19s
LLM inference time 1m47s Command execution time 1m32s
Final context tokens 14,772 Total output tokens 2,482
Output reasoning tokens 0 Messages 73
Assistant messages 36 User messages 1
System messages 1 Commands executed 35
Task
Task: coreutils-old-version

GNU coreutils 5.0 (from 2003) is a collection of Linux utilities like ls, cp, mv, etc.
Project link: gnu.org/software/coreutils

Task:
Compile and install all coreutils utilities to a specific location.

Difficulties:
The source is very old (2003) and requires heavy patching.

Environment:
Ubuntu 22.04 on amd64, without internet access.

Execution log
SYSTEM

You are a package-building specialist operating a Ubuntu 22.04 bash shell via one tool: run_terminal_cmd.
The current working directory of every run_terminal_cmd is /home/peter.
Execution rules:
- Always pass non-interactive flags for any command that could prompt (e.g., -y, --yes, DEBIAN_FRONTEND=noninteractive).
- Don't include any newlines in the command.
- The environment is offline, assume you have all the necessary tools already installed.
If you encounter any errors or issues while doing the user's request, you must fix them and continue the task.
At the end verify you did the user request correctly.

USER

You are given a coreutils v5.0 source code at /home/peter/coreutils.tar.gz. Please compile the coreutils package and install it to /home/peter/result. Create symlinks for all coreutils utilities so they are available under /home/peter/result/. For example: /home/peter/result/uptime should point to the compiled uptime binary.

ASSISTANT
compile-bench> tar -xzf /home/peter/coreutils.tar.gz && ls -l
total 5884
drwxr-xr-x 11 peter peter    4096 Apr  2  2003 coreutils-5.0
-rw-r--r--  1 peter peter 6020616 Sep 17 02:31 coreutils.tar.gz
4 lines
ASSISTANT
compile-bench> cd /home/peter/coreutils-5.0 && pwd
/home/peter/coreutils-5.0
ASSISTANT
compile-bench> cd /home/peter/coreutils-5.0 && ./configure --prefix=/home/peter/result
checking build system type... x86_64-unknown-linux-gnu
checking host system type... x86_64-unknown-linux-gnu
checking for a BSD-compatible install... /usr/bin/install -c
checking whether build environment is sane... yes
checking for gawk... no
checking for mawk... mawk
checking whether make sets $(MAKE)... yes
checking for perl5.003 or newer... yes
checking for gcc... gcc
checking for C compiler default output... a.out
checking whether the C compiler works... yes
checking whether we are cross compiling... no
checking for suffix of executables... 
checking for suffix of object files... o
checking whether we are using the GNU C compiler... yes
checking whether gcc accepts -g... yes
checking for gcc option to accept ANSI C... none needed
checking for style of include used by make... GNU
checking dependency style of gcc... gcc3
checking how to run the C preprocessor... gcc -E
checking for egrep... grep -E
checking whether gcc needs -traditional... no
checking for ranlib... ranlib
checking whether ln -s works... yes
checking for AIX... no
checking for ANSI C header files... yes
checking for sys/types.h... yes
checking for sys/stat.h... yes
checking for stdlib.h... yes
checking for string.h... yes
checking for memory.h... yes
checking for strings.h... yes
checking for inttypes.h... yes
checking for stdint.h... yes
checking for unistd.h... yes
checking minix/config.h usability... no
checking minix/config.h presence... no
checking for minix/config.h... no
checking for uname... yes
checking for chroot... yes
checking for gethostid... yes
checking for strerror in -lcposix... no
checking for special C compiler options needed for large files... no
checking for _FILE_OFFSET_BITS value needed for large files... no
checking for _LARGE_FILES value needed for large files... no
checking for gcc option to accept ANSI C... none needed
checking for function prototypes... yes
checking for ANSI C header files... (cached) yes
checking for string.h... (cached) yes
checking whether byte ordering is bigendian... no
checking for an ANSI C-conforming const... yes
checking for working volatile... yes
checking for inline... inline
checking for working long double with more range or precision than double... no
checking errno.h usability... yes
checking errno.h presence... yes
checking for errno.h... yes
checking fcntl.h usability... yes
checking fcntl.h presence... yes
checking for fcntl.h... yes
checking float.h usability... yes
checking float.h presence... yes
checking for float.h... yes
checking hurd.h usability... no
checking hurd.h presence... no
checking for hurd.h... no
checking limits.h usability... yes
checking limits.h presence... yes
checking for limits.h... yes
checking for memory.h... (cached) yes
[command output truncated]
checking shadow.h presence... yes
checking for shadow.h... yes
checking for struct spwd.sp_pwdp... yes
checking for getspnam... yes
checking for library containing crypt... -lcrypt
checking for msgfmt... no
checking for gmsgfmt... :
checking for xgettext... no
checking for msgmerge... no
checking whether NLS is requested... yes
checking for GNU gettext in libc... yes
configure: creating ./config.status
config.status: creating Makefile
config.status: creating doc/Makefile
config.status: creating lib/Makefile
config.status: creating man/Makefile
config.status: creating m4/Makefile
config.status: creating po/Makefile.in
config.status: creating src/Makefile
config.status: creating tests/Makefile
config.status: creating tests/basename/Makefile
config.status: creating tests/chgrp/Makefile
config.status: creating tests/chmod/Makefile
config.status: creating tests/chown/Makefile
config.status: creating tests/cp/Makefile
config.status: creating tests/cut/Makefile
config.status: creating tests/date/Makefile
config.status: creating tests/dd/Makefile
config.status: creating tests/dircolors/Makefile
config.status: creating tests/du/Makefile
config.status: creating tests/expr/Makefile
config.status: creating tests/factor/Makefile
config.status: creating tests/fmt/Makefile
config.status: creating tests/head/Makefile
config.status: creating tests/install/Makefile
config.status: creating tests/join/Makefile
config.status: creating tests/ln/Makefile
config.status: creating tests/ls-2/Makefile
config.status: creating tests/ls/Makefile
config.status: creating tests/md5sum/Makefile
config.status: creating tests/misc/Makefile
config.status: creating tests/mkdir/Makefile
config.status: creating tests/mv/Makefile
config.status: creating tests/od/Makefile
config.status: creating tests/pr/Makefile
config.status: creating tests/rm/Makefile
config.status: creating tests/rmdir/Makefile
config.status: creating tests/seq/Makefile
config.status: creating tests/sha1sum/Makefile
config.status: creating tests/shred/Makefile
config.status: creating tests/sort/Makefile
config.status: creating tests/stty/Makefile
config.status: creating tests/sum/Makefile
config.status: creating tests/tac/Makefile
config.status: creating tests/tail-2/Makefile
config.status: creating tests/tail/Makefile
config.status: creating tests/test/Makefile
config.status: creating tests/touch/Makefile
config.status: creating tests/tr/Makefile
config.status: creating tests/tsort/Makefile
config.status: creating tests/unexpand/Makefile
config.status: creating tests/uniq/Makefile
config.status: creating tests/wc/Makefile
config.status: creating config.h
config.status: linking ./lib/ftw_.h to lib/ftw.h
config.status: executing depfiles commands
config.status: executing default-1 commands
config.status: creating po/POTFILES
config.status: creating po/Makefile
141 lines
ASSISTANT
compile-bench> cd /home/peter/coreutils-5.0 && make
make  all-recursive
make[1]: Entering directory '/home/peter/coreutils-5.0'
Making all in lib
make[2]: Entering directory '/home/peter/coreutils-5.0/lib'
make  all-am
make[3]: Entering directory '/home/peter/coreutils-5.0/lib'
if gcc -DLIBDIR=\"/home/peter/result/lib\" -DHAVE_CONFIG_H -I. -I. -I.. -I.. -I.    -g -O2 -MT acl.o -MD -MP -MF ".deps/acl.Tpo" \
  -c -o acl.o `test -f 'acl.c' || echo './'`acl.c; \
then mv ".deps/acl.Tpo" ".deps/acl.Po"; \
else rm -f ".deps/acl.Tpo"; exit 1; \
fi
if gcc -DLIBDIR=\"/home/peter/result/lib\" -DHAVE_CONFIG_H -I. -I. -I.. -I.. -I.    -g -O2 -MT getdate.o -MD -MP -MF ".deps/getdate.Tpo" \
  -c -o getdate.o `test -f 'getdate.c' || echo './'`getdate.c; \
then mv ".deps/getdate.Tpo" ".deps/getdate.Po"; \
else rm -f ".deps/getdate.Tpo"; exit 1; \
fi
if gcc -DLIBDIR=\"/home/peter/result/lib\" -DHAVE_CONFIG_H -I. -I. -I.. -I.. -I.    -g -O2 -MT posixtm.o -MD -MP -MF ".deps/posixtm.Tpo" \
  -c -o posixtm.o `test -f 'posixtm.c' || echo './'`posixtm.c; \
then mv ".deps/posixtm.Tpo" ".deps/posixtm.Po"; \
else rm -f ".deps/posixtm.Tpo"; exit 1; \
fi
if gcc -DLIBDIR=\"/home/peter/result/lib\" -DHAVE_CONFIG_H -I. -I. -I.. -I.. -I.    -g -O2 -MT posixver.o -MD -MP -MF ".deps/posixver.Tpo" \
  -c -o posixver.o `test -f 'posixver.c' || echo './'`posixver.c; \
then mv ".deps/posixver.Tpo" ".deps/posixver.Po"; \
else rm -f ".deps/posixver.Tpo"; exit 1; \
fi
if gcc -DLIBDIR=\"/home/peter/result/lib\" -DHAVE_CONFIG_H -I. -I. -I.. -I.. -I.    -g -O2 -MT strftime.o -MD -MP -MF ".deps/strftime.Tpo" \
  -c -o strftime.o `test -f 'strftime.c' || echo './'`strftime.c; \
then mv ".deps/strftime.Tpo" ".deps/strftime.Po"; \
else rm -f ".deps/strftime.Tpo"; exit 1; \
fi
if gcc -DLIBDIR=\"/home/peter/result/lib\" -DHAVE_CONFIG_H -I. -I. -I.. -I.. -I.    -g -O2 -MT getopt.o -MD -MP -MF ".deps/getopt.Tpo" \
  -c -o getopt.o `test -f 'getopt.c' || echo './'`getopt.c; \
then mv ".deps/getopt.Tpo" ".deps/getopt.Po"; \
else rm -f ".deps/getopt.Tpo"; exit 1; \
fi
if gcc -DLIBDIR=\"/home/peter/result/lib\" -DHAVE_CONFIG_H -I. -I. -I.. -I.. -I.    -g -O2 -MT getopt1.o -MD -MP -MF ".deps/getopt1.Tpo" \
  -c -o getopt1.o `test -f 'getopt1.c' || echo './'`getopt1.c; \
then mv ".deps/getopt1.Tpo" ".deps/getopt1.Po"; \
else rm -f ".deps/getopt1.Tpo"; exit 1; \
fi
if gcc -DLIBDIR=\"/home/peter/result/lib\" -DHAVE_CONFIG_H -I. -I. -I.. -I.. -I.    -g -O2 -MT hash.o -MD -MP -MF ".deps/hash.Tpo" \
  -c -o hash.o `test -f 'hash.c' || echo './'`hash.c; \
then mv ".deps/hash.Tpo" ".deps/hash.Po"; \
else rm -f ".deps/hash.Tpo"; exit 1; \
fi
if gcc -DLIBDIR=\"/home/peter/result/lib\" -DHAVE_CONFIG_H -I. -I. -I.. -I.. -I.    -g -O2 -MT hash-pjw.o -MD -MP -MF ".deps/hash-pjw.Tpo" \
  -c -o hash-pjw.o `test -f 'hash-pjw.c' || echo './'`hash-pjw.c; \
then mv ".deps/hash-pjw.Tpo" ".deps/hash-pjw.Po"; \
else rm -f ".deps/hash-pjw.Tpo"; exit 1; \
fi
if gcc -DLIBDIR=\"/home/peter/result/lib\" -DHAVE_CONFIG_H -I. -I. -I..
[command output truncated]
                    ^~~~~~~~~~~~~~~~~~~~~~~~~~~~~~~~~~~~~~~~~~~~~~~
pathchk.c:381:20: note: in expansion of macro '_'
  381 |       error (0, 0, _("path `%s' has length %d; exceeds limit of %ld"),
      |                    ^
pathchk.c:381:45: note: format string is defined here
  381 |       error (0, 0, _("path `%s' has length %d; exceeds limit of %ld"),
      |                                            ~^
      |                                             |
      |                                             int
      |                                            %ld
gcc  -g -O2   -o pathchk  pathchk.o ../lib/libfetish.a  ../lib/libfetish.a 
if gcc -DLOCALEDIR=\"/home/peter/result/share/locale\" -DSHAREDIR=\"/home/peter/result/share\" -DHAVE_CONFIG_H -I. -I. -I.. -I.. -I. -I../lib -I../lib    -g -O2 -MT printenv.o -MD -MP -MF ".deps/printenv.Tpo" \
  -c -o printenv.o `test -f 'printenv.c' || echo './'`printenv.c; \
then mv ".deps/printenv.Tpo" ".deps/printenv.Po"; \
else rm -f ".deps/printenv.Tpo"; exit 1; \
fi
gcc  -g -O2   -o printenv  printenv.o ../lib/libfetish.a  ../lib/libfetish.a 
if gcc -DLOCALEDIR=\"/home/peter/result/share/locale\" -DSHAREDIR=\"/home/peter/result/share\" -DHAVE_CONFIG_H -I. -I. -I.. -I.. -I. -I../lib -I../lib    -g -O2 -MT printf.o -MD -MP -MF ".deps/printf.Tpo" \
  -c -o printf.o `test -f 'printf.c' || echo './'`printf.c; \
then mv ".deps/printf.Tpo" ".deps/printf.Po"; \
else rm -f ".deps/printf.Tpo"; exit 1; \
fi
gcc  -g -O2   -o printf  printf.o ../lib/libfetish.a  ../lib/libfetish.a   
if gcc -DLOCALEDIR=\"/home/peter/result/share/locale\" -DSHAREDIR=\"/home/peter/result/share\" -DHAVE_CONFIG_H -I. -I. -I.. -I.. -I. -I../lib -I../lib    -g -O2 -MT pwd.o -MD -MP -MF ".deps/pwd.Tpo" \
  -c -o pwd.o `test -f 'pwd.c' || echo './'`pwd.c; \
then mv ".deps/pwd.Tpo" ".deps/pwd.Po"; \
else rm -f ".deps/pwd.Tpo"; exit 1; \
fi
gcc  -g -O2   -o pwd  pwd.o ../lib/libfetish.a  ../lib/libfetish.a 
if gcc -DLOCALEDIR=\"/home/peter/result/share/locale\" -DSHAREDIR=\"/home/peter/result/share\" -DHAVE_CONFIG_H -I. -I. -I.. -I.. -I. -I../lib -I../lib    -g -O2 -MT seq.o -MD -MP -MF ".deps/seq.Tpo" \
  -c -o seq.o `test -f 'seq.c' || echo './'`seq.c; \
then mv ".deps/seq.Tpo" ".deps/seq.Po"; \
else rm -f ".deps/seq.Tpo"; exit 1; \
fi
gcc  -g -O2   -o seq  seq.o ../lib/libfetish.a  ../lib/libfetish.a  
/usr/bin/ld: seq.o: in function `get_width_format':
/home/peter/coreutils-5.0/src/seq.c:253: undefined reference to `floor'
/usr/bin/ld: /home/peter/coreutils-5.0/src/seq.c:259: undefined reference to `floor'
collect2: error: ld returned 1 exit status
make[3]: *** [Makefile:1033: seq] Error 1
make[3]: Leaving directory '/home/peter/coreutils-5.0/src'
make[2]: *** [Makefile:815: all] Error 2
make[2]: Leaving directory '/home/peter/coreutils-5.0/src'
make[1]: *** [Makefile:244: all-recursive] Error 1
make[1]: Leaving directory '/home/peter/coreutils-5.0'
make: *** [Makefile:199: all] Error 2
100 lines
ASSISTANT

We encountered a linking error for the seq utility, where it’s missing the math library (libm). Most Makefiles from that era don’t always include -lm when needed. We can patch this by adding -lm to the linker flags. Let’s examine the src/Makefile to see the current LDADD or linking line for seq, and explicitly add -lm there.

compile-bench> cd /home/peter/coreutils-5.0 && grep -n -A2 -B2 "seq.*:" src/Makefile
1029-	@rm -f rmdir$(EXEEXT)
1030-	$(LINK) $(rmdir_LDFLAGS) $(rmdir_OBJECTS) $(rmdir_LDADD) $(LIBS)
1031:seq$(EXEEXT): $(seq_OBJECTS) $(seq_DEPENDENCIES) 
1032-	@rm -f seq$(EXEEXT)
1033-	$(LINK) $(seq_LDFLAGS) $(seq_OBJECTS) $(seq_LDADD) $(LIBS)
6 lines
ASSISTANT

Let’s also confirm what seq_LDADD currently contains:

compile-bench> cd /home/peter/coreutils-5.0 && grep -n seq_LDADD src/Makefile
212:seq_LDADD = $(LDADD) 
1033:	$(LINK) $(seq_LDFLAGS) $(seq_OBJECTS) $(seq_LDADD) $(LIBS)
3 lines
ASSISTANT

We can see that seq is being linked with $(seq_LDADD) which is just $(LDADD). Let’s add -lm to the seq_LDADD line in the Makefile. We’ll use sed to insert it after the existing value:

compile-bench> cd /home/peter/coreutils-5.0 && sed -i '/seq_LDADD = $(LDADD)/s/$/ -lm/' src/Makefile
[empty output]
ASSISTANT

Let’s verify the line was changed:

compile-bench> grep -n seq_LDADD src/Makefile
grep: src/Makefile: No such file or directory
ASSISTANT

Let’s check where we are and the correct path to src/Makefile:

compile-bench> pwd && ls -l src/Makefile
/home/peter
ls: cannot access 'src/Makefile': No such file or directory
3 lines
ASSISTANT

Let’s switch back to the coreutils build directory and confirm its location:

compile-bench> cd /home/peter/coreutils-5.0 && pwd && grep -n seq_LDADD src/Makefile
/home/peter/coreutils-5.0
212:seq_LDADD = $(LDADD)  -lm
1033:	$(LINK) $(seq_LDFLAGS) $(seq_OBJECTS) $(seq_LDADD) $(LIBS)
4 lines
ASSISTANT

Good! The modification was applied. Now let’s continue building to fix the linking error:

compile-bench> make
make: *** No targets specified and no makefile found.  Stop.
ASSISTANT

We need to be in the coreutils-5.0 build directory:

compile-bench> cd /home/peter/coreutils-5.0 && make
make  all-recursive
make[1]: Entering directory '/home/peter/coreutils-5.0'
Making all in lib
make[2]: Entering directory '/home/peter/coreutils-5.0/lib'
make  all-am
make[3]: Entering directory '/home/peter/coreutils-5.0/lib'
make[3]: Nothing to be done for 'all-am'.
make[3]: Leaving directory '/home/peter/coreutils-5.0/lib'
make[2]: Leaving directory '/home/peter/coreutils-5.0/lib'
Making all in src
make[2]: Entering directory '/home/peter/coreutils-5.0/src'
make  all-am
make[3]: Entering directory '/home/peter/coreutils-5.0/src'
gcc  -g -O2   -o seq  seq.o ../lib/libfetish.a  ../lib/libfetish.a  -lm 
if gcc -DLOCALEDIR=\"/home/peter/result/share/locale\" -DSHAREDIR=\"/home/peter/result/share\" -DHAVE_CONFIG_H -I. -I. -I.. -I.. -I. -I../lib -I../lib    -g -O2 -MT sleep.o -MD -MP -MF ".deps/sleep.Tpo" \
  -c -o sleep.o `test -f 'sleep.c' || echo './'`sleep.c; \
then mv ".deps/sleep.Tpo" ".deps/sleep.Po"; \
else rm -f ".deps/sleep.Tpo"; exit 1; \
fi
gcc  -g -O2   -o sleep  sleep.o ../lib/libfetish.a  ../lib/libfetish.a -lm    
if gcc -DLOCALEDIR=\"/home/peter/result/share/locale\" -DSHAREDIR=\"/home/peter/result/share\" -DHAVE_CONFIG_H -I. -I. -I.. -I.. -I. -I../lib -I../lib    -g -O2 -MT tee.o -MD -MP -MF ".deps/tee.Tpo" \
  -c -o tee.o `test -f 'tee.c' || echo './'`tee.c; \
then mv ".deps/tee.Tpo" ".deps/tee.Po"; \
else rm -f ".deps/tee.Tpo"; exit 1; \
fi
tee.c:35:12: error: conflicting types for 'tee'; have 'int(int,  const char **)'
   35 | static int tee (int nfiles, const char **files);
      |            ^~~
In file included from /usr/include/x86_64-linux-gnu/bits/fcntl.h:61,
                 from /usr/include/fcntl.h:35,
                 from system.h:153,
                 from tee.c:26:
/usr/include/x86_64-linux-gnu/bits/fcntl-linux.h:429:18: note: previous declaration of 'tee' with type '__ssize_t(int,  int,  size_t,  unsigned int)' {aka 'long int(int,  int,  long unsigned int,  unsigned int)'}
  429 | extern __ssize_t tee (int __fdin, int __fdout, size_t __len,
      |                  ^~~
make[3]: *** [Makefile:1263: tee.o] Error 1
make[3]: Leaving directory '/home/peter/coreutils-5.0/src'
make[2]: *** [Makefile:815: all] Error 2
make[2]: Leaving directory '/home/peter/coreutils-5.0/src'
make[1]: *** [Makefile:244: all-recursive] Error 1
make[1]: Leaving directory '/home/peter/coreutils-5.0'
make: *** [Makefile:199: all] Error 2
43 lines
ASSISTANT

We now hit another error: tee.c defines a function named tee that conflicts with the tee syscall declared in . The workaround is to rename the local tee function (and its uses) to something distinct, e.g. tee_main, or to #undef the problematic declaration, but the quickest local fix is to simply rename the static function. Let’s do that:

compile-bench> cd /home/peter/coreutils-5.0/src && sed -i 's/\btee *(/tee_util(/g' tee.c && sed -i 's/static int tee/static int tee_util/g' tee.c
[empty output]
ASSISTANT

Then rebuild:

compile-bench> cd /home/peter/coreutils-5.0 && make
make  all-recursive
make[1]: Entering directory '/home/peter/coreutils-5.0'
Making all in lib
make[2]: Entering directory '/home/peter/coreutils-5.0/lib'
make  all-am
make[3]: Entering directory '/home/peter/coreutils-5.0/lib'
make[3]: Nothing to be done for 'all-am'.
make[3]: Leaving directory '/home/peter/coreutils-5.0/lib'
make[2]: Leaving directory '/home/peter/coreutils-5.0/lib'
Making all in src
make[2]: Entering directory '/home/peter/coreutils-5.0/src'
make  all-am
make[3]: Entering directory '/home/peter/coreutils-5.0/src'
if gcc -DLOCALEDIR=\"/home/peter/result/share/locale\" -DSHAREDIR=\"/home/peter/result/share\" -DHAVE_CONFIG_H -I. -I. -I.. -I.. -I. -I../lib -I../lib    -g -O2 -MT tee.o -MD -MP -MF ".deps/tee.Tpo" \
  -c -o tee.o `test -f 'tee.c' || echo './'`tee.c; \
then mv ".deps/tee.Tpo" ".deps/tee.Po"; \
else rm -f ".deps/tee.Tpo"; exit 1; \
fi
tee.c: In function 'main':
tee.c:149:10: warning: implicit declaration of function 'tee_util'; did you mean 'tee_util_util'? [ttps://gcc.gnu.org/onlinedocs/gcc/Warning-Options.html#index-Wimplicit-function-declaration-Wimplicit-function-declaration]8;;]
  149 |   errs = tee_util(argc - optind, (const char **) &argv[optind]);
      |          ^~~~~~~~
      |          tee_util_util
tee.c: At top level:
tee.c:161:1: error: static declaration of 'tee_util' follows non-static declaration
  161 | tee_util(int nfiles, const char **files)
      | ^~~~~~~~
tee.c:149:10: note: previous implicit declaration of 'tee_util' with type 'int()'
  149 |   errs = tee_util(argc - optind, (const char **) &argv[optind]);
      |          ^~~~~~~~
make[3]: *** [Makefile:1263: tee.o] Error 1
make[3]: Leaving directory '/home/peter/coreutils-5.0/src'
make[2]: *** [Makefile:815: all] Error 2
make[2]: Leaving directory '/home/peter/coreutils-5.0/src'
make[1]: *** [Makefile:244: all-recursive] Error 1
make[1]: Leaving directory '/home/peter/coreutils-5.0'
make: *** [Makefile:199: all] Error 2
38 lines
ASSISTANT

The local rename is being called before its declaration is seen, causing a type mismatch. Let’s add a forward declaration. First, check the current function order in tee.c:

compile-bench> cd /home/peter/coreutils-5.0/src && head -n 40 tee.c
/* tee - read from standard input and write to standard output and files.
   Copyright (C) 85,1990-2002 Free Software Foundation, Inc.

   This program is free software; you can redistribute it and/or modify
   it under the terms of the GNU General Public License as published by
   the Free Software Foundation; either version 2, or (at your option)
   any later version.

   This program is distributed in the hope that it will be useful,
   but WITHOUT ANY WARRANTY; without even the implied warranty of
   MERCHANTABILITY or FITNESS FOR A PARTICULAR PURPOSE.  See the
   GNU General Public License for more details.

   You should have received a copy of the GNU General Public License
   along with this program; if not, write to the Free Software Foundation,
   Inc., 59 Temple Place - Suite 330, Boston, MA 02111-1307, USA.  */

/* Mike Parker, Richard M. Stallman, and David MacKenzie */

#include <config.h>
#include <stdio.h>
#include <sys/types.h>
#include <signal.h>
#include <getopt.h>

#include "system.h"
#include "closeout.h"
#include "error.h"

/* The official name of this program (e.g., no `g' prefix).  */
#define PROGRAM_NAME "tee"

#define AUTHORS N_ ("Mike Parker, Richard M. Stallman, and David MacKenzie")

static int tee_util_util(int nfiles, const char **files);

/* If nonzero, append to output files rather than truncating them. */
static int append;

/* If nonzero, ignore interrupts. */
41 lines
ASSISTANT

We already see that we’ve renamed function calls like tee_util but we renamed it to tee_util_util accidentally. Let’s fix the naming back to tee_util and add an explicit forward declaration. Let’s use a simple patch:

compile-bench> cd /home/peter/coreutils-5.0/src && cp tee.c tee.c.bak && sed -i 's/tee_util_util/tee_util/g' tee.c && sed -i '11i static int tee_util(int nfiles, const char **files);' tee.c
[empty output]
ASSISTANT

Let’s verify the relevant lines:

compile-bench> head -n 13 tee.c
head: cannot open 'tee.c' for reading: No such file or directory
ASSISTANT

Again, make sure we operate from the correct directory:

compile-bench> cd /home/peter/coreutils-5.0 && head -n 13 src/tee.c
/* tee - read from standard input and write to standard output and files.
   Copyright (C) 85,1990-2002 Free Software Foundation, Inc.

   This program is free software; you can redistribute it and/or modify
   it under the terms of the GNU General Public License as published by
   the Free Software Foundation; either version 2, or (at your option)
   any later version.

   This program is distributed in the hope that it will be useful,
   but WITHOUT ANY WARRANTY; without even the implied warranty of
static int tee_util(int nfiles, const char **files);
   MERCHANTABILITY or FITNESS FOR A PARTICULAR PURPOSE.  See the
   GNU General Public License for more details.
14 lines
ASSISTANT

The header forward declaration got inserted mid-line. Let’s fix it properly:

compile-bench> cd /home/peter/coreutils-5.0 && cp src/tee.c.bak src/tee.c
[empty output]
ASSISTANT

Now apply a clean fix: add the forward declaration after the include block:

compile-bench> cd /home/peter/coreutils-5.0 && sed -i '/^#include "error.h"$/a\nstatic int tee_util (int nfiles, const char **files);' src/tee.c && sed -i 's/\btee *(/tee_util(/g' src/tee.c && sed -i 's/static int tee/static int tee_util/g' src/tee.c
[empty output]
ASSISTANT

Check that the line was added correctly:

compile-bench> cd /home/peter/coreutils-5.0 && tail -n 2 src/tee.c | head -n 2
  return ret;
}
3 lines
ASSISTANT

Let’s check the top part again to verify the declaration is in place:

compile-bench> cd /home/peter/coreutils-5.0 && grep -n -A1 -B1 "tee_util" src/tee.c
28-#include "error.h"
29:nstatic int tee_util_util (int nfiles, const char **files);
30-
--
35-
36:static int tee_util_util_util(int nfiles, const char **files);
37-
--
149-
150:  errs = tee_util(argc - optind, (const char **) &argv[optind]);
151-  if (close (STDIN_FILENO) != 0)
--
161-static int
162:tee_util(int nfiles, const char **files)
163-{
16 lines
ASSISTANT

We still have over-patched names. Let’s restore from the backup once more and apply carefully:

compile-bench> cd /home/peter/coreutils-5.0 && cp src/tee.c.bak src/tee.c && sed -i '/^#include "error.h"$/a\nstatic int tee_util (int nfiles, const char **files);' src/tee.c && sed -i 's/\btee *(/tee_util(/g' src/tee.c && sed -i '/^static int tee_util(int nfiles, const char \/\*\*files\)/,/^}$/{s/^static int tee$/static int tee_util/;}' src/tee.c
sed: -e expression #1, char 59: Unmatched ) or \)
ASSISTANT

Let’s just manually fix the one line that needs the function definition name:

compile-bench> cd /home/peter/coreutils-5.0 && cp src/tee.c.bak src/tee.c && sed -i '/^#include "error.h"$/a\nstatic int tee_util (int nfiles, const char **files);' src/tee.c && sed -i 's/\btee *(/tee_util(/g' src/tee.c && sed -i '/static int$/{N; s/static int\ntee/static int\ntee_util/}' src/tee.c
[empty output]
ASSISTANT

Let’s validate the changes and confirm there is only one definition and one call:

compile-bench> cd /home/peter/coreutils-5.0 && grep -n -A1 -B1 "tee_util" src/tee.c
28-#include "error.h"
29:nstatic int tee_util (int nfiles, const char **files);
30-
--
35-
36:static int tee_util_util(int nfiles, const char **files);
37-
--
149-
150:  errs = tee_util(argc - optind, (const char **) &argv[optind]);
151-  if (close (STDIN_FILENO) != 0)
--
161-static int
162:tee_util_util(int nfiles, const char **files)
163-{
16 lines
ASSISTANT

We see duplicate lines caused by the newline insert. Let’s hand-edit cleanly:

compile-bench> cd /home/peter/coreutils-5.0 && cp src/tee.c.bak src/tee.c
[empty output]
ASSISTANT

Now run a precise replacement sequence:

compile-bench> cd /home/peter/coreutils-5.0 && printf '\nstatic int tee_util (int nfiles, const char **files);\n' >> _tmp_dec && sed -i '/^#include "error.h"/r _tmp_dec' src/tee.c && rm _tmp_dec && sed -i 's/\btee *(/tee_util(/g' src/tee.c && sed -i '/static int$/{N; s/static int\ntee()$/static int\ntee_util()/}' src/tee.c
[empty output]
ASSISTANT

Let’s compile cleanly and leave these fixes behind. The point is to have compilation succeed, not to have a pristine patch. Build again:

compile-bench> cd /home/peter/coreutils-5.0 && make
make  all-recursive
make[1]: Entering directory '/home/peter/coreutils-5.0'
Making all in lib
make[2]: Entering directory '/home/peter/coreutils-5.0/lib'
make  all-am
make[3]: Entering directory '/home/peter/coreutils-5.0/lib'
make[3]: Nothing to be done for 'all-am'.
make[3]: Leaving directory '/home/peter/coreutils-5.0/lib'
make[2]: Leaving directory '/home/peter/coreutils-5.0/lib'
Making all in src
make[2]: Entering directory '/home/peter/coreutils-5.0/src'
make  all-am
make[3]: Entering directory '/home/peter/coreutils-5.0/src'
if gcc -DLOCALEDIR=\"/home/peter/result/share/locale\" -DSHAREDIR=\"/home/peter/result/share\" -DHAVE_CONFIG_H -I. -I. -I.. -I.. -I. -I../lib -I../lib    -g -O2 -MT tee.o -MD -MP -MF ".deps/tee.Tpo" \
  -c -o tee.o `test -f 'tee.c' || echo './'`tee.c; \
then mv ".deps/tee.Tpo" ".deps/tee.Po"; \
else rm -f ".deps/tee.Tpo"; exit 1; \
fi
gcc  -g -O2   -o tee  tee.o ../lib/libfetish.a  ../lib/libfetish.a 
if gcc -DLOCALEDIR=\"/home/peter/result/share/locale\" -DSHAREDIR=\"/home/peter/result/share\" -DHAVE_CONFIG_H -I. -I. -I.. -I.. -I. -I../lib -I../lib    -g -O2 -MT test.o -MD -MP -MF ".deps/test.Tpo" \
  -c -o test.o `test -f 'test.c' || echo './'`test.c; \
then mv ".deps/test.Tpo" ".deps/test.Po"; \
else rm -f ".deps/test.Tpo"; exit 1; \
fi
test.c:142:1: error: static declaration of 'eaccess' follows non-static declaration
  142 | eaccess (char const *file, int mode)
      | ^~~~~~~
In file included from /usr/include/x86_64-linux-gnu/bits/sigstksz.h:24,
                 from /usr/include/signal.h:328,
                 from /usr/include/x86_64-linux-gnu/sys/param.h:28,
                 from system.h:33,
                 from test.c:41:
/usr/include/unistd.h:296:12: note: previous declaration of 'eaccess' with type 'int(const char *, int)'
  296 | extern int eaccess (const char *__name, int __type)
      |            ^~~~~~~
test.c: In function 'eaccess':
test.c:160:5: warning: ignoring return value of 'setreuid' declared with attribute 'warn_unused_result' [ttps://gcc.gnu.org/onlinedocs/gcc/Warning-Options.html#index-Wunused-result-Wunused-result]8;;]
  160 |     setreuid (euid, uid);
      |     ^~~~~~~~~~~~~~~~~~~~
test.c:162:5: warning: ignoring return value of 'setregid' declared with attribute 'warn_unused_result' [ttps://gcc.gnu.org/onlinedocs/gcc/Warning-Options.html#index-Wunused-result-Wunused-result]8;;]
  162 |     setregid (egid, gid);
      |     ^~~~~~~~~~~~~~~~~~~~
test.c:168:5: warning: ignoring return value of 'setreuid' declared with attribute 'warn_unused_result' [ttps://gcc.gnu.org/onlinedocs/gcc/Warning-Options.html#index-Wunused-result-Wunused-result]8;;]
  168 |     setreuid (uid, euid);
      |     ^~~~~~~~~~~~~~~~~~~~
test.c:170:5: warning: ignoring return value of 'setregid' declared with attribute 'warn_unused_result' [ttps://gcc.gnu.org/onlinedocs/gcc/Warning-Options.html#index-Wunused-result-Wunused-result]8;;]
  170 |     setregid (gid, egid);
      |     ^~~~~~~~~~~~~~~~~~~~
make[3]: *** [Makefile:1263: test.o] Error 1
make[3]: Leaving directory '/home/peter/coreutils-5.0/src'
make[2]: *** [Makefile:815: all] Error 2
make[2]: Leaving directory '/home/peter/coreutils-5.0/src'
make[1]: *** [Makefile:244: all-recursive] Error 1
make[1]: Leaving directory '/home/peter/coreutils-5.0'
make: *** [Makefile:199: all] Error 2
56 lines
ASSISTANT

We now get a signature conflict for eaccess in test.c. This is again glibc later adding a symbol that didn’t exist when coreutils 5.0 was released. We’ll rename the local eaccess to eaccess_util similar to how we handled tee. Let’s do that quickly:

compile-bench> cd /home/peter/coreutils-5.0/src && cp test.c test.c.bak && sed -i 's/\beaccess *(/eaccess_util(/g' test.c && sed -i 's/^eaccess (char/eaccess_util (char/' test.c
[empty output]
ASSISTANT

Now rebuild through test:

compile-bench> cd /home/peter/coreutils-5.0 && make
make  all-recursive
make[1]: Entering directory '/home/peter/coreutils-5.0'
Making all in lib
make[2]: Entering directory '/home/peter/coreutils-5.0/lib'
make  all-am
make[3]: Entering directory '/home/peter/coreutils-5.0/lib'
make[3]: Nothing to be done for 'all-am'.
make[3]: Leaving directory '/home/peter/coreutils-5.0/lib'
make[2]: Leaving directory '/home/peter/coreutils-5.0/lib'
Making all in src
make[2]: Entering directory '/home/peter/coreutils-5.0/src'
make  all-am
make[3]: Entering directory '/home/peter/coreutils-5.0/src'
if gcc -DLOCALEDIR=\"/home/peter/result/share/locale\" -DSHAREDIR=\"/home/peter/result/share\" -DHAVE_CONFIG_H -I. -I. -I.. -I.. -I. -I../lib -I../lib    -g -O2 -MT test.o -MD -MP -MF ".deps/test.Tpo" \
  -c -o test.o `test -f 'test.c' || echo './'`test.c; \
then mv ".deps/test.Tpo" ".deps/test.Po"; \
else rm -f ".deps/test.Tpo"; exit 1; \
fi
test.c: In function 'eaccess_util':
test.c:160:5: warning: ignoring return value of 'setreuid' declared with attribute 'warn_unused_result' [ttps://gcc.gnu.org/onlinedocs/gcc/Warning-Options.html#index-Wunused-result-Wunused-result]8;;]
  160 |     setreuid (euid, uid);
      |     ^~~~~~~~~~~~~~~~~~~~
test.c:162:5: warning: ignoring return value of 'setregid' declared with attribute 'warn_unused_result' [ttps://gcc.gnu.org/onlinedocs/gcc/Warning-Options.html#index-Wunused-result-Wunused-result]8;;]
  162 |     setregid (egid, gid);
      |     ^~~~~~~~~~~~~~~~~~~~
test.c:168:5: warning: ignoring return value of 'setreuid' declared with attribute 'warn_unused_result' [ttps://gcc.gnu.org/onlinedocs/gcc/Warning-Options.html#index-Wunused-result-Wunused-result]8;;]
  168 |     setreuid (uid, euid);
      |     ^~~~~~~~~~~~~~~~~~~~
test.c:170:5: warning: ignoring return value of 'setregid' declared with attribute 'warn_unused_result' [ttps://gcc.gnu.org/onlinedocs/gcc/Warning-Options.html#index-Wunused-result-Wunused-result]8;;]
  170 |     setregid (gid, egid);
      |     ^~~~~~~~~~~~~~~~~~~~
gcc  -g -O2   -o test  test.o ../lib/libfetish.a  ../lib/libfetish.a 
if gcc -DLOCALEDIR=\"/home/peter/result/share/locale\" -DSHAREDIR=\"/home/peter/result/share\" -DHAVE_CONFIG_H -I. -I. -I.. -I.. -I. -I../lib -I../lib    -g -O2 -MT true.o -MD -MP -MF ".deps/true.Tpo" \
  -c -o true.o `test -f 'true.c' || echo './'`true.c; \
then mv ".deps/true.Tpo" ".deps/true.Po"; \
else rm -f ".deps/true.Tpo"; exit 1; \
fi
gcc  -g -O2   -o true  true.o ../lib/libfetish.a  ../lib/libfetish.a 
if gcc -DLOCALEDIR=\"/home/peter/result/share/locale\" -DSHAREDIR=\"/home/peter/result/share\" -DHAVE_CONFIG_H -I. -I. -I.. -I.. -I. -I../lib -I../lib    -g -O2 -MT tty.o -MD -MP -MF ".deps/tty.Tpo" \
  -c -o tty.o `test -f 'tty.c' || echo './'`tty.c; \
then mv ".deps/tty.Tpo" ".deps/tty.Po"; \
else rm -f ".deps/tty.Tpo"; exit 1; \
fi
gcc  -g -O2   -o tty  tty.o ../lib/libfetish.a  ../lib/libfetish.a 
if gcc -DLOCALEDIR=\"/home/peter/result/share/locale\" -DSHARED
[command output truncated]
 Leaving directory '/home/peter/coreutils-5.0/tests/shred'
Making all in sort
make[3]: Entering directory '/home/peter/coreutils-5.0/tests/sort'
make[3]: Nothing to be done for 'all'.
make[3]: Leaving directory '/home/peter/coreutils-5.0/tests/sort'
Making all in stty
make[3]: Entering directory '/home/peter/coreutils-5.0/tests/stty'
make[3]: Nothing to be done for 'all'.
make[3]: Leaving directory '/home/peter/coreutils-5.0/tests/stty'
Making all in sum
make[3]: Entering directory '/home/peter/coreutils-5.0/tests/sum'
make[3]: Nothing to be done for 'all'.
make[3]: Leaving directory '/home/peter/coreutils-5.0/tests/sum'
Making all in tac
make[3]: Entering directory '/home/peter/coreutils-5.0/tests/tac'
make[3]: Nothing to be done for 'all'.
make[3]: Leaving directory '/home/peter/coreutils-5.0/tests/tac'
Making all in tail
make[3]: Entering directory '/home/peter/coreutils-5.0/tests/tail'
make[3]: Nothing to be done for 'all'.
make[3]: Leaving directory '/home/peter/coreutils-5.0/tests/tail'
Making all in tail-2
make[3]: Entering directory '/home/peter/coreutils-5.0/tests/tail-2'
make[3]: Nothing to be done for 'all'.
make[3]: Leaving directory '/home/peter/coreutils-5.0/tests/tail-2'
Making all in test
make[3]: Entering directory '/home/peter/coreutils-5.0/tests/test'
make[3]: Nothing to be done for 'all'.
make[3]: Leaving directory '/home/peter/coreutils-5.0/tests/test'
Making all in touch
make[3]: Entering directory '/home/peter/coreutils-5.0/tests/touch'
make[3]: Nothing to be done for 'all'.
make[3]: Leaving directory '/home/peter/coreutils-5.0/tests/touch'
Making all in tr
make[3]: Entering directory '/home/peter/coreutils-5.0/tests/tr'
make[3]: Nothing to be done for 'all'.
make[3]: Leaving directory '/home/peter/coreutils-5.0/tests/tr'
Making all in tsort
make[3]: Entering directory '/home/peter/coreutils-5.0/tests/tsort'
make[3]: Nothing to be done for 'all'.
make[3]: Leaving directory '/home/peter/coreutils-5.0/tests/tsort'
Making all in unexpand
make[3]: Entering directory '/home/peter/coreutils-5.0/tests/unexpand'
make[3]: Nothing to be done for 'all'.
make[3]: Leaving directory '/home/peter/coreutils-5.0/tests/unexpand'
Making all in uniq
make[3]: Entering directory '/home/peter/coreutils-5.0/tests/uniq'
make[3]: Nothing to be done for 'all'.
make[3]: Leaving directory '/home/peter/coreutils-5.0/tests/uniq'
Making all in wc
make[3]: Entering directory '/home/peter/coreutils-5.0/tests/wc'
make[3]: Nothing to be done for 'all'.
make[3]: Leaving directory '/home/peter/coreutils-5.0/tests/wc'
make[3]: Entering directory '/home/peter/coreutils-5.0/tests'
make[3]: Nothing to be done for 'all-am'.
make[3]: Leaving directory '/home/peter/coreutils-5.0/tests'
make[2]: Leaving directory '/home/peter/coreutils-5.0/tests'
make[2]: Entering directory '/home/peter/coreutils-5.0'
make[2]: Leaving directory '/home/peter/coreutils-5.0'
make[1]: Leaving directory '/home/peter/coreutils-5.0'
107 lines
ASSISTANT

Good! The build continues. Let’s wait for it to complete fully. (From the earlier output the make is finishing the remaining utilities). After it’s done, install:

compile-bench> cd /home/peter/coreutils-5.0 && make install
Making install in lib
make[1]: Entering directory '/home/peter/coreutils-5.0/lib'
make[2]: Entering directory '/home/peter/coreutils-5.0/lib'
/bin/bash ../config/mkinstalldirs /home/peter/result/lib
mkdir -p -- /home/peter/result/lib
if test -f /home/peter/result/lib/charset.alias; then \
  sed -f ref-add.sed /home/peter/result/lib/charset.alias > /home/peter/result/lib/charset.tmp ; \
  /usr/bin/install -c -m 644 /home/peter/result/lib/charset.tmp /home/peter/result/lib/charset.alias ; \
  rm -f /home/peter/result/lib/charset.tmp ; \
else \
  if test yes = no; then \
    sed -f ref-add.sed charset.alias > /home/peter/result/lib/charset.tmp ; \
    /usr/bin/install -c -m 644 /home/peter/result/lib/charset.tmp /home/peter/result/lib/charset.alias ; \
    rm -f /home/peter/result/lib/charset.tmp ; \
  fi ; \
fi
make[2]: Nothing to be done for 'install-data-am'.
make[2]: Leaving directory '/home/peter/coreutils-5.0/lib'
make[1]: Leaving directory '/home/peter/coreutils-5.0/lib'
Making install in src
make[1]: Entering directory '/home/peter/coreutils-5.0/src'
make[2]: Entering directory '/home/peter/coreutils-5.0/src'
/bin/bash ../config/mkinstalldirs /home/peter/result/bin
mkdir -p -- /home/peter/result/bin
  /usr/bin/install -c chgrp /home/peter/result/bin/chgrp
  /usr/bin/install -c chown /home/peter/result/bin/chown
  /usr/bin/install -c chmod /home/peter/result/bin/chmod
  /usr/bin/install -c cp /home/peter/result/bin/cp
  /usr/bin/install -c dd /home/peter/result/bin/dd
  /usr/bin/install -c dircolors /home/peter/result/bin/dircolors
  /usr/bin/install -c du /home/peter/result/bin/du
  /usr/bin/install -c ginstall /home/peter/result/bin/install
  /usr/bin/install -c link /home/peter/result/bin/link
  /usr/bin/install -c ln /home/peter/result/bin/ln
  /usr/bin/install -c dir /home/peter/result/bin/dir
  /usr/bin/install -c vdir /home/peter/result/bin/vdir
  /usr/bin/install -c ls /home/peter/result/bin/ls
  /usr/bin/install -c mkdir /home/peter/result/bin/mkdir
  /usr/bin/install -c mkfifo /home/peter/result/bin/mkfifo
  /usr/bin/install -c mknod /home/peter/result/bin/mknod
  /usr/bin/install -c mv /home/peter/result/bin/mv
  /usr/bin/install -c readlink /home/peter/result/bin/readlink
  /usr/bin/install -c rm /home/peter/result/bin/rm
  /usr/bin/install -c rmdir /home/peter/result/bin/rmdir
  /usr/bin/install -c shred /home/peter/result/bin/shred
  /usr/bin/install -c stat /home/peter/result/bin/stat
  /usr/bin/install -c sync /home/peter/result/bin/sync
  /usr/bin/install -c touch /home/peter/result/bin/touch
  /usr/bin/install -c unlink /home/peter/result/bin/unlink
  /usr/bin/install -c cat /home/peter/result/bin/cat
  /usr/bin/install -c cksum /home/peter/result/bin/cksum
  /usr/bin/install -c comm /home/peter/result/bin/comm
  /usr/bin/install -c csplit /home/peter/result/bin/csplit
  /usr/bin/install -c cut /home/peter/result/bin/cut
  /usr/bin/install -c expand /home/peter/result/bin
[command output truncated]
-5.0/tests/touch'
make[3]: Nothing to be done for 'install-exec-am'.
make[3]: Nothing to be done for 'install-data-am'.
make[3]: Leaving directory '/home/peter/coreutils-5.0/tests/touch'
make[2]: Leaving directory '/home/peter/coreutils-5.0/tests/touch'
Making install in tr
make[2]: Entering directory '/home/peter/coreutils-5.0/tests/tr'
make[3]: Entering directory '/home/peter/coreutils-5.0/tests/tr'
make[3]: Nothing to be done for 'install-exec-am'.
make[3]: Nothing to be done for 'install-data-am'.
make[3]: Leaving directory '/home/peter/coreutils-5.0/tests/tr'
make[2]: Leaving directory '/home/peter/coreutils-5.0/tests/tr'
Making install in tsort
make[2]: Entering directory '/home/peter/coreutils-5.0/tests/tsort'
make[3]: Entering directory '/home/peter/coreutils-5.0/tests/tsort'
make[3]: Nothing to be done for 'install-exec-am'.
make[3]: Nothing to be done for 'install-data-am'.
make[3]: Leaving directory '/home/peter/coreutils-5.0/tests/tsort'
make[2]: Leaving directory '/home/peter/coreutils-5.0/tests/tsort'
Making install in unexpand
make[2]: Entering directory '/home/peter/coreutils-5.0/tests/unexpand'
make[3]: Entering directory '/home/peter/coreutils-5.0/tests/unexpand'
make[3]: Nothing to be done for 'install-exec-am'.
make[3]: Nothing to be done for 'install-data-am'.
make[3]: Leaving directory '/home/peter/coreutils-5.0/tests/unexpand'
make[2]: Leaving directory '/home/peter/coreutils-5.0/tests/unexpand'
Making install in uniq
make[2]: Entering directory '/home/peter/coreutils-5.0/tests/uniq'
make[3]: Entering directory '/home/peter/coreutils-5.0/tests/uniq'
make[3]: Nothing to be done for 'install-exec-am'.
make[3]: Nothing to be done for 'install-data-am'.
make[3]: Leaving directory '/home/peter/coreutils-5.0/tests/uniq'
make[2]: Leaving directory '/home/peter/coreutils-5.0/tests/uniq'
Making install in wc
make[2]: Entering directory '/home/peter/coreutils-5.0/tests/wc'
make[3]: Entering directory '/home/peter/coreutils-5.0/tests/wc'
make[3]: Nothing to be done for 'install-exec-am'.
make[3]: Nothing to be done for 'install-data-am'.
make[3]: Leaving directory '/home/peter/coreutils-5.0/tests/wc'
make[2]: Leaving directory '/home/peter/coreutils-5.0/tests/wc'
make[2]: Entering directory '/home/peter/coreutils-5.0/tests'
make[3]: Entering directory '/home/peter/coreutils-5.0/tests'
make[3]: Nothing to be done for 'install-exec-am'.
make[3]: Nothing to be done for 'install-data-am'.
make[3]: Leaving directory '/home/peter/coreutils-5.0/tests'
make[2]: Leaving directory '/home/peter/coreutils-5.0/tests'
make[1]: Leaving directory '/home/peter/coreutils-5.0/tests'
make[1]: Entering directory '/home/peter/coreutils-5.0'
make[2]: Entering directory '/home/peter/coreutils-5.0'
make[2]: Nothing to be done for 'install-exec-am'.
make[2]: Nothing to be done for 'install-data-am'.
make[2]: Leaving directory '/home/peter/coreutils-5.0'
make[1]: Leaving directory '/home/peter/coreutils-5.0'
110 lines
ASSISTANT

Great! The package has been installed to /home/peter/result. Now we need to create symlinks for all the coreutils utilities so that they are directly accessible under /home/peter/result/. We’ll iterate over each binary installed in /home/peter/result/bin and make a symlink to it one level up.

compile-bench> cd /home/peter/result && ln -sn bin/* .
[empty output]
ASSISTANT

Let’s confirm that, for example, uptime is now available exactly at the path /home/peter/result/uptime:

compile-bench> ls -l /home/peter/result/uptime
lrwxrwxrwx 1 peter peter 10 Sep 17 02:34 /home/peter/result/uptime -> bin/uptime
ASSISTANT

And that the target binary exists:

compile-bench> ls -l /home/peter/result/bin/uptime
-rwxr-xr-x 1 peter peter 77264 Sep 17 02:34 /home/peter/result/bin/uptime
ASSISTANT

Perfect! Let’s also run a sanity check:

compile-bench> file /home/peter/result/bin/uptime
/home/peter/result/bin/uptime: ELF 64-bit LSB pie executable, x86-64, version 1 (SYSV), dynamically linked, interpreter /lib64/ld-linux-x86-64.so.2, BuildID[sha1]=2818ee256fbf98a8436ac8a673aae4e6ab4f9d1f, for GNU/Linux 3.2.0, with debug_info, not stripped
ASSISTANT

We have successfully compiled coreutils v5.0 from the given source archive, installed it to /home/peter/result, and created symlinks for every utility directly under that directory so each can be invoked via /home/peter/result/.

Task finished successfully, all checks passed!
Checks passed:
sha1sum binary exists
basename exists and --version works
cat exists and --version works
chgrp exists and --version works
chmod exists and --version works
chown exists and --version works
chroot exists and --version works
cksum exists and --version works
comm exists and --version works
cp exists and --version works
csplit exists and --version works
cut exists and --version works
date exists and --version works
dd exists and --version works
df exists and --version works
dir exists and --version works
dircolors exists and --version works
dirname exists and --version works
du exists and --version works
echo exists and --version works
env exists and --version works
expand exists and --version works
expr exists and --version works
factor exists and --version works
false exists (skipping --version check)
fmt exists and --version works
fold exists and --version works
groups exists and --version works
head exists and --version works
hostid exists and --version works
id exists and --version works
install exists and --version works
join exists and --version works
kill exists (skipping --version check)
link exists and --version works
ln exists and --version works
logname exists and --version works
ls exists and --version works
md5sum exists and --version works
mkdir exists and --version works
mkfifo exists and --version works
mknod exists and --version works
mv exists and --version works
nice exists and --version works
nl exists and --version works
nohup exists and --version works
od exists and --version works
paste exists and --version works
pathchk exists and --version works
pinky exists and --version works
pr exists and --version works
printenv exists and --version works
printf exists (skipping --version check)
ptx exists and --version works
pwd exists (skipping --version check)
readlink exists and --version works
rm exists and --version works
rmdir exists and --version works
seq exists and --version works
sha1sum exists and --version works
shred exists and --version works
sleep exists and --version works
sort exists and --version works
split exists and --version works
stat exists and --version works
stty exists and --version works
sum exists and --version works
sync exists and --version works
tac exists and --version works
tail exists and --version works
tee exists and --version works
test exists and --version works
touch exists and --version works
tr exists and --version works
true exists and --version works
tsort exists and --version works
tty exists and --version works
uname exists and --version works
unexpand exists and --version works
uniq exists and --version works
unlink exists and --version works
uptime exists and --version works
users exists and --version works
vdir exists and --version works
wc exists and --version works
who exists and --version works
whoami exists and --version works
yes exists and --version works
sha1sum version matches expected
sha1sum produced expected hash