Summary
Performance
Cost$1.358
Total elapsed time4m25s
LLM inference time2m31s
Command execution time1m54s
Commands executed60
All details >
Attempt ID s0ua7nnulbi9r Attempt group run-17-09-01-01
Revision 86330ee2c6fb AWS Instance m8i.2xlarge
Start time 2025-09-17T01:39:31.797Z End time 2025-09-17T01:43:57.139Z
Task coreutils-old-version Environment ubuntu-22.04-amd64-offline
Model kimi-k2-0905 logo kimi-k2-0905 OpenRouter slug moonshotai/kimi-k2-0905
Temperature 1 Explicit prompt caching false
User msg after tool call false Max tool calls 90
Total timeout seconds 1200 Single command timeout 600
Cost $1.358 Duration 4m25s
LLM inference time 2m31s Command execution time 1m54s
Final context tokens 30,758 Total output tokens 4,547
Output reasoning tokens 0 Messages 123
Assistant messages 61 User messages 1
System messages 1 Commands executed 60
Task
Task: coreutils-old-version

GNU coreutils 5.0 (from 2003) is a collection of Linux utilities like ls, cp, mv, etc.
Project link: gnu.org/software/coreutils

Task:
Compile and install all coreutils utilities to a specific location.

Difficulties:
The source is very old (2003) and requires heavy patching.

Environment:
Ubuntu 22.04 on amd64, without internet access.

Execution log
SYSTEM

You are a package-building specialist operating a Ubuntu 22.04 bash shell via one tool: run_terminal_cmd.
The current working directory of every run_terminal_cmd is /home/peter.
Execution rules:
- Always pass non-interactive flags for any command that could prompt (e.g., -y, --yes, DEBIAN_FRONTEND=noninteractive).
- Don't include any newlines in the command.
- The environment is offline, assume you have all the necessary tools already installed.
If you encounter any errors or issues while doing the user's request, you must fix them and continue the task.
At the end verify you did the user request correctly.

USER

You are given a coreutils v5.0 source code at /home/peter/coreutils.tar.gz. Please compile the coreutils package and install it to /home/peter/result. Create symlinks for all coreutils utilities so they are available under /home/peter/result/. For example: /home/peter/result/uptime should point to the compiled uptime binary.

ASSISTANT

I'll help you compile the coreutils package and install it to the specified location with symlinks for all utilities.

Let's start by extracting the source code and examining it:

compile-bench> tar -xzf coreutils.tar.gz && ls -la
total 5908
drwxr-x---  1 peter peter    4096 Sep 17 01:39 .
drwxr-xr-x  1 root  root     4096 Sep 15 11:21 ..
-rw-r--r--  1 peter peter     220 Jan  6  2022 .bash_logout
-rw-r--r--  1 peter peter    3771 Jan  6  2022 .bashrc
-rw-r--r--  1 peter peter     807 Jan  6  2022 .profile
drwxr-xr-x 11 peter peter    4096 Apr  2  2003 coreutils-5.0
-rw-r--r--  1 peter peter 6020616 Sep 17 01:39 coreutils.tar.gz
9 lines
ASSISTANT

Good, we have extracted the coreutils-5.0 directory. Let's examine it and check the build requirements:

compile-bench> cd coreutils-5.0 && ls -la
total 1708
drwxr-xr-x 11 peter peter    4096 Apr  2  2003 .
drwxr-x---  1 peter peter    4096 Sep 17 01:39 ..
-rw-r--r--  1 peter peter       0 Apr  2  2003 .kludge-stamp
-rw-r--r--  1 peter peter       7 Mar 30  2003 .prev-version
-rw-r--r--  1 peter peter   29291 Feb 20  2003 ABOUT-NLS
-rw-r--r--  1 peter peter    2819 Oct  3  2002 AUTHORS
-rw-r--r--  1 peter peter   17992 Jan 12  2000 COPYING
-rw-r--r--  1 peter peter   68636 Apr  2  2003 ChangeLog
-rw-r--r--  1 peter peter    1132 Jan 31  2003 GNUmakefile
-rw-r--r--  1 peter peter    9414 Feb 16  2002 INSTALL
-rw-r--r--  1 peter peter    1506 Mar 31  2003 Makefile.am
-rw-r--r--  1 peter peter     736 Mar 20  2003 Makefile.cfg
-rw-r--r--  1 peter peter   20238 Apr  2  2003 Makefile.in
-rw-r--r--  1 peter peter   12314 Apr  1  2003 Makefile.maint
-rw-r--r--  1 peter peter   19177 Apr  2  2003 NEWS
-rw-r--r--  1 peter peter    5949 Mar 29  2003 README
-rw-r--r--  1 peter peter   22800 Apr  2  2003 THANKS
-rw-r--r--  1 peter peter    1840 Feb 19  2003 THANKS-to-translators
-rw-r--r--  1 peter peter     121 Aug 26  2002 THANKStt.in
-rw-r--r--  1 peter peter    2931 Apr  2  2003 TODO
-rw-r--r--  1 peter peter  207137 Apr  2  2003 aclocal.m4
-rwxr-xr-x  1 peter peter    8490 Mar 20  2003 announce-gen
drwxr-xr-x  2 peter peter    4096 Apr  2  2003 config
-rw-r--r--  1 peter peter   40903 Apr  2  2003 config.hin
-rwxr-xr-x  1 peter peter 1159722 Apr  2  2003 configure
-rw-r--r--  1 peter peter    9317 Mar 30  2003 configure.ac
drwxr-xr-x  2 peter peter    4096 Apr  2  2003 doc
drwxr-xr-x  2 peter peter   12288 Apr  2  2003 lib
drwxr-xr-x  2 peter peter    4096 Apr  2  2003 m4
drwxr-xr-x  2 peter peter    4096 Apr  2  2003 man
drwxr-xr-x  5 peter peter    4096 Apr  2  2003 old
drwxr-xr-x  2 peter peter    4096 Apr  2  2003 po
drwxr-xr-x  2 peter peter    4096 Apr  2  2003 src
drwxr-xr-x 45 peter peter    4096 Apr  2  2003 tests
36 lines
ASSISTANT

Let's look at the README file to understand the build process:

compile-bench> cd coreutils-5.0 && head -50 README
These are the GNU core utilities.  This package is the union of
the GNU fileutils, sh-utils, and textutils packages.

Most of these programs have significant advantages over their Unix
counterparts, such as greater speed, additional options, and fewer
arbitrary limits.

The programs that can be built with this package are:

  basename cat chgrp chmod chown chroot cksum comm cp csplit cut date dd
  df dir dircolors dirname du echo env expand expr factor false fmt fold
  ginstall groups head hostid hostname id join kill link ln logname ls
  md5sum mkdir mkfifo mknod mv nice nl nohup od paste pathchk pinky pr
  printenv printf ptx pwd readlink rm rmdir seq sha1sum shred sleep sort
  split stat stty su sum sync tac tail tee test touch tr true tsort tty
  uname unexpand uniq unlink uptime users vdir wc who whoami yes

See the file NEWS for a list of major changes in the current release.

See the file INSTALL for compilation and installation instructions.

These programs are intended to be POSIX.2 compliant (with BSD and other
extensions), like the rest of the GNU system.

The ls, dir, and vdir commands are all separate executables instead of
one program that checks argv[0] because people often rename these
programs to things like gls, gnuls, l, etc.  Renaming a program
file shouldn't affect how it operates, so that people can get the
behavior they want with whatever name they want.

Special thanks to Paul Eggert, Brian Matthews, Bruce Evans, Karl Berry,
Kaveh Ghazi, and François Pinard for help with debugging and porting
these programs.  Many thanks to all of the people who have taken the
time to submit problem reports and fixes.  All contributed changes are
attributed in the ChangeLog file.

And thanks to the following people who have provided accounts for
portability testing on many different types of systems: Bob Proulx,
Christian Robert, François Pinard, Greg McGary, Harlan Stenn,
Joel N. Weber, Mark D. Roth, Matt Schalit, Nelson H. F. Beebe,
Réjean Payette, Sam Tardieu.

Thanks to Michael Stone for inflicting test releases of the fileutils
on Debian's unstable distribution, and to all the kind folks who used
that distribution and found and reported bugs.

Note that each man page is now automatically generated from a template
and from the corresponding --help usage message.  Patches to the template
files (man/*.x) are welcome.  However, the authoritative documentation
is in texinfo form in the doc directory.
51 lines
ASSISTANT

Now let's check the INSTALL file to understand the build process:

compile-bench> cd coreutils-5.0 && head -30 INSTALL
Copyright 1994, 1995, 1996, 1999, 2000, 2001 Free Software Foundation,
Inc.

   This file is free documentation; the Free Software Foundation gives
unlimited permission to copy, distribute and modify it.

Basic Installation
==================

   These are generic installation instructions.

   The `configure' shell script attempts to guess correct values for
various system-dependent variables used during compilation.  It uses
those values to create a `Makefile' in each directory of the package.
It may also create one or more `.h' files containing system-dependent
definitions.  Finally, it creates a shell script `config.status' that
you can run in the future to recreate the current configuration, and a
file `config.log' containing compiler output (useful mainly for
debugging `configure').

   It can also use an optional file (typically called `config.cache'
and enabled with `--cache-file=config.cache' or simply `-C') that saves
the results of its tests to speed up reconfiguring.  (Caching is
disabled by default to prevent problems with accidental use of stale
cache files.)

   If you need to do unusual things to compile the package, please try
to figure out how `configure' could check whether to do them, and mail
diffs or instructions to the address given in the `README' so they can
be considered for the next release.  If you are using the cache, and at
31 lines
ASSISTANT

Let's create the result directory and configure the build with our custom installation path:

compile-bench> mkdir -p /home/peter/result
[empty output]
ASSISTANT

Let's run the configure script to set up the build with our installation prefix:

compile-bench> cd coreutils-5.0 && ./configure --prefix=/home/peter/result
checking build system type... x86_64-unknown-linux-gnu
checking host system type... x86_64-unknown-linux-gnu
checking for a BSD-compatible install... /usr/bin/install -c
checking whether build environment is sane... yes
checking for gawk... no
checking for mawk... mawk
checking whether make sets $(MAKE)... yes
checking for perl5.003 or newer... yes
checking for gcc... gcc
checking for C compiler default output... a.out
checking whether the C compiler works... yes
checking whether we are cross compiling... no
checking for suffix of executables... 
checking for suffix of object files... o
checking whether we are using the GNU C compiler... yes
checking whether gcc accepts -g... yes
checking for gcc option to accept ANSI C... none needed
checking for style of include used by make... GNU
checking dependency style of gcc... gcc3
checking how to run the C preprocessor... gcc -E
checking for egrep... grep -E
checking whether gcc needs -traditional... no
checking for ranlib... ranlib
checking whether ln -s works... yes
checking for AIX... no
checking for ANSI C header files... yes
checking for sys/types.h... yes
checking for sys/stat.h... yes
checking for stdlib.h... yes
checking for string.h... yes
checking for memory.h... yes
checking for strings.h... yes
checking for inttypes.h... yes
checking for stdint.h... yes
checking for unistd.h... yes
checking minix/config.h usability... no
checking minix/config.h presence... no
checking for minix/config.h... no
checking for uname... yes
checking for chroot... yes
checking for gethostid... yes
checking for strerror in -lcposix... no
checking for special C compiler options needed for large files... no
checking for _FILE_OFFSET_BITS value needed for large files... no
checking for _LARGE_FILES value needed for large files... no
checking for gcc option to accept ANSI C... none needed
checking for function prototypes... yes
checking for ANSI C header files... (cached) yes
checking for string.h... (cached) yes
checking whether byte ordering is bigendian... no
checking for an ANSI C-conforming const... yes
checking for working volatile... yes
checking for inline... inline
checking for working long double with more range or precision than double... no
checking errno.h usability... yes
checking errno.h presence... yes
checking for errno.h... yes
checking fcntl.h usability... yes
checking fcntl.h presence... yes
checking for fcntl.h... yes
checking float.h usability... yes
checking float.h presence... yes
checking for float.h... yes
checking hurd.h usability... no
checking hurd.h presence... no
checking for hurd.h... no
checking limits.h usability... yes
checking limits.h presence... yes
checking for limits.h... yes
checking for memory.h... (cached) yes
[command output truncated]
checking shadow.h presence... yes
checking for shadow.h... yes
checking for struct spwd.sp_pwdp... yes
checking for getspnam... yes
checking for library containing crypt... -lcrypt
checking for msgfmt... no
checking for gmsgfmt... :
checking for xgettext... no
checking for msgmerge... no
checking whether NLS is requested... yes
checking for GNU gettext in libc... yes
configure: creating ./config.status
config.status: creating Makefile
config.status: creating doc/Makefile
config.status: creating lib/Makefile
config.status: creating man/Makefile
config.status: creating m4/Makefile
config.status: creating po/Makefile.in
config.status: creating src/Makefile
config.status: creating tests/Makefile
config.status: creating tests/basename/Makefile
config.status: creating tests/chgrp/Makefile
config.status: creating tests/chmod/Makefile
config.status: creating tests/chown/Makefile
config.status: creating tests/cp/Makefile
config.status: creating tests/cut/Makefile
config.status: creating tests/date/Makefile
config.status: creating tests/dd/Makefile
config.status: creating tests/dircolors/Makefile
config.status: creating tests/du/Makefile
config.status: creating tests/expr/Makefile
config.status: creating tests/factor/Makefile
config.status: creating tests/fmt/Makefile
config.status: creating tests/head/Makefile
config.status: creating tests/install/Makefile
config.status: creating tests/join/Makefile
config.status: creating tests/ln/Makefile
config.status: creating tests/ls-2/Makefile
config.status: creating tests/ls/Makefile
config.status: creating tests/md5sum/Makefile
config.status: creating tests/misc/Makefile
config.status: creating tests/mkdir/Makefile
config.status: creating tests/mv/Makefile
config.status: creating tests/od/Makefile
config.status: creating tests/pr/Makefile
config.status: creating tests/rm/Makefile
config.status: creating tests/rmdir/Makefile
config.status: creating tests/seq/Makefile
config.status: creating tests/sha1sum/Makefile
config.status: creating tests/shred/Makefile
config.status: creating tests/sort/Makefile
config.status: creating tests/stty/Makefile
config.status: creating tests/sum/Makefile
config.status: creating tests/tac/Makefile
config.status: creating tests/tail-2/Makefile
config.status: creating tests/tail/Makefile
config.status: creating tests/test/Makefile
config.status: creating tests/touch/Makefile
config.status: creating tests/tr/Makefile
config.status: creating tests/tsort/Makefile
config.status: creating tests/unexpand/Makefile
config.status: creating tests/uniq/Makefile
config.status: creating tests/wc/Makefile
config.status: creating config.h
config.status: linking ./lib/ftw_.h to lib/ftw.h
config.status: executing depfiles commands
config.status: executing default-1 commands
config.status: creating po/POTFILES
config.status: creating po/Makefile
141 lines
ASSISTANT

The configuration completed successfully. Now let's build the package using make:

compile-bench> cd coreutils-5.0 && make -j$(nproc)
make  all-recursive
make[1]: Entering directory '/home/peter/coreutils-5.0'
Making all in lib
make[2]: Entering directory '/home/peter/coreutils-5.0/lib'
make  all-am
make[3]: Entering directory '/home/peter/coreutils-5.0/lib'
if gcc -DLIBDIR=\"/home/peter/result/lib\" -DHAVE_CONFIG_H -I. -I. -I.. -I.. -I.    -g -O2 -MT acl.o -MD -MP -MF ".deps/acl.Tpo" \
  -c -o acl.o `test -f 'acl.c' || echo './'`acl.c; \
then mv ".deps/acl.Tpo" ".deps/acl.Po"; \
else rm -f ".deps/acl.Tpo"; exit 1; \
fi
if gcc -DLIBDIR=\"/home/peter/result/lib\" -DHAVE_CONFIG_H -I. -I. -I.. -I.. -I.    -g -O2 -MT getdate.o -MD -MP -MF ".deps/getdate.Tpo" \
  -c -o getdate.o `test -f 'getdate.c' || echo './'`getdate.c; \
then mv ".deps/getdate.Tpo" ".deps/getdate.Po"; \
else rm -f ".deps/getdate.Tpo"; exit 1; \
fi
if gcc -DLIBDIR=\"/home/peter/result/lib\" -DHAVE_CONFIG_H -I. -I. -I.. -I.. -I.    -g -O2 -MT posixtm.o -MD -MP -MF ".deps/posixtm.Tpo" \
  -c -o posixtm.o `test -f 'posixtm.c' || echo './'`posixtm.c; \
then mv ".deps/posixtm.Tpo" ".deps/posixtm.Po"; \
else rm -f ".deps/posixtm.Tpo"; exit 1; \
fi
if gcc -DLIBDIR=\"/home/peter/result/lib\" -DHAVE_CONFIG_H -I. -I. -I.. -I.. -I.    -g -O2 -MT posixver.o -MD -MP -MF ".deps/posixver.Tpo" \
  -c -o posixver.o `test -f 'posixver.c' || echo './'`posixver.c; \
then mv ".deps/posixver.Tpo" ".deps/posixver.Po"; \
else rm -f ".deps/posixver.Tpo"; exit 1; \
fi
if gcc -DLIBDIR=\"/home/peter/result/lib\" -DHAVE_CONFIG_H -I. -I. -I.. -I.. -I.    -g -O2 -MT strftime.o -MD -MP -MF ".deps/strftime.Tpo" \
  -c -o strftime.o `test -f 'strftime.c' || echo './'`strftime.c; \
then mv ".deps/strftime.Tpo" ".deps/strftime.Po"; \
else rm -f ".deps/strftime.Tpo"; exit 1; \
fi
if gcc -DLIBDIR=\"/home/peter/result/lib\" -DHAVE_CONFIG_H -I. -I. -I.. -I.. -I.    -g -O2 -MT getopt.o -MD -MP -MF ".deps/getopt.Tpo" \
  -c -o getopt.o `test -f 'getopt.c' || echo './'`getopt.c; \
then mv ".deps/getopt.Tpo" ".deps/getopt.Po"; \
else rm -f ".deps/getopt.Tpo"; exit 1; \
fi
if gcc -DLIBDIR=\"/home/peter/result/lib\" -DHAVE_CONFIG_H -I. -I. -I.. -I.. -I.    -g -O2 -MT getopt1.o -MD -MP -MF ".deps/getopt1.Tpo" \
  -c -o getopt1.o `test -f 'getopt1.c' || echo './'`getopt1.c; \
then mv ".deps/getopt1.Tpo" ".deps/getopt1.Po"; \
else rm -f ".deps/getopt1.Tpo"; exit 1; \
fi
if gcc -DLIBDIR=\"/home/peter/result/lib\" -DHAVE_CONFIG_H -I. -I. -I.. -I.. -I.    -g -O2 -MT hash.o -MD -MP -MF ".deps/hash.Tpo" \
  -c -o hash.o `test -f 'hash.c' || echo './'`hash.c; \
then mv ".deps/hash.Tpo" ".deps/hash.Po"; \
else rm -f ".deps/hash.Tpo"; exit 1; \
fi
if gcc -DLIBDIR=\"/home/peter/result/lib\" -DHAVE_CONFIG_H -I. -I. -I.. -I.. -I.    -g -O2 -MT hash-pjw.o -MD -MP -MF ".deps/hash-pjw.Tpo" \
  -c -o hash-pjw.o `test -f 'hash-pjw.c' || echo './'`hash-pjw.c; \
then mv ".deps/hash-pjw.Tpo" ".deps/hash-pjw.Po"; \
else rm -f ".deps/hash-pjw.Tpo"; exit 1; \
fi
if gcc -DLIBDIR=\"/home/peter/result/lib\" -DHAVE_CONFIG_H -I. -I. -I..
[command output truncated]
usr/include/x86_64-linux-gnu/bits/fcntl.h:61,
                 from /usr/include/fcntl.h:35,
                 from system.h:153,
                 from tee.c:26:
/usr/include/x86_64-linux-gnu/bits/fcntl-linux.h:429:18: note: previous declaration of 'tee' with type '__ssize_t(int,  int,  size_t,  unsigned int)' {aka 'long int(int,  int,  long unsigned int,  unsigned int)'}
  429 | extern __ssize_t tee (int __fdin, int __fdout, size_t __len,
      |                  ^~~
if gcc -DLOCALEDIR=\"/home/peter/result/share/locale\" -DSHAREDIR=\"/home/peter/result/share\" -DHAVE_CONFIG_H -I. -I. -I.. -I.. -I. -I../lib -I../lib    -g -O2 -MT tty.o -MD -MP -MF ".deps/tty.Tpo" \
  -c -o tty.o `test -f 'tty.c' || echo './'`tty.c; \
then mv ".deps/tty.Tpo" ".deps/tty.Po"; \
else rm -f ".deps/tty.Tpo"; exit 1; \
fi
make[3]: *** [Makefile:1263: tee.o] Error 1
make[3]: *** Waiting for unfinished jobs....
test.c:142:1: error: static declaration of 'eaccess' follows non-static declaration
  142 | eaccess (char const *file, int mode)
      | ^~~~~~~
In file included from /usr/include/x86_64-linux-gnu/bits/sigstksz.h:24,
                 from /usr/include/signal.h:328,
                 from /usr/include/x86_64-linux-gnu/sys/param.h:28,
                 from system.h:33,
                 from test.c:41:
/usr/include/unistd.h:296:12: note: previous declaration of 'eaccess' with type 'int(const char *, int)'
  296 | extern int eaccess (const char *__name, int __type)
      |            ^~~~~~~
test.c: In function 'eaccess':
test.c:160:5: warning: ignoring return value of 'setreuid' declared with attribute 'warn_unused_result' [ttps://gcc.gnu.org/onlinedocs/gcc/Warning-Options.html#index-Wunused-result-Wunused-result]8;;]
  160 |     setreuid (euid, uid);
      |     ^~~~~~~~~~~~~~~~~~~~
test.c:162:5: warning: ignoring return value of 'setregid' declared with attribute 'warn_unused_result' [ttps://gcc.gnu.org/onlinedocs/gcc/Warning-Options.html#index-Wunused-result-Wunused-result]8;;]
  162 |     setregid (egid, gid);
      |     ^~~~~~~~~~~~~~~~~~~~
test.c:168:5: warning: ignoring return value of 'setreuid' declared with attribute 'warn_unused_result' [ttps://gcc.gnu.org/onlinedocs/gcc/Warning-Options.html#index-Wunused-result-Wunused-result]8;;]
  168 |     setreuid (uid, euid);
      |     ^~~~~~~~~~~~~~~~~~~~
test.c:170:5: warning: ignoring return value of 'setregid' declared with attribute 'warn_unused_result' [ttps://gcc.gnu.org/onlinedocs/gcc/Warning-Options.html#index-Wunused-result-Wunused-result]8;;]
  170 |     setregid (gid, egid);
      |     ^~~~~~~~~~~~~~~~~~~~
make[3]: *** [Makefile:1263: test.o] Error 1
make[3]: Leaving directory '/home/peter/coreutils-5.0/src'
make[2]: *** [Makefile:815: all] Error 2
make[2]: Leaving directory '/home/peter/coreutils-5.0/src'
make[1]: *** [Makefile:244: all-recursive] Error 1
make[1]: Leaving directory '/home/peter/coreutils-5.0'
make: *** [Makefile:199: all] Error 2
99 lines
ASSISTANT

There are compilation errors due to conflicts with modern glibc (tee function and eaccess). These are common compatibility issues when compiling old coreutils. Let's check what specific version we have and see if we can fix the compilation issues.

Let's see if there's a different approach by checking what tools are available:

compile-bench> cd coreutils-5.0 && gcc --version
gcc (Ubuntu 11.4.0-1ubuntu1~22.04.2) 11.4.0
Copyright (C) 2021 Free Software Foundation, Inc.
This is free software; see the source for copying conditions.  There is NO
warranty; not even for MERCHANTABILITY or FITNESS FOR A PARTICULAR PURPOSE.

5 lines
ASSISTANT

We have a very modern GCC (11.4.0) which is causing compatibility issues with the 2003 era coreutils 5.0. Let's try some workarounds. Let's see if we can patch the problematic files or use compiler flags to make it compatible:

compile-bench> cd coreutils-5.0 && make clean
Making clean in tests
make[1]: Entering directory '/home/peter/coreutils-5.0/tests'
Making clean in wc
make[2]: Entering directory '/home/peter/coreutils-5.0/tests/wc'
test -z "a0.O a0.E a1.O a1.E a2.O a2.E a3.O a3.E a4.O a4.E a5.O a5.E a6.O a6.E a7.O a7.E a8.O a8.E a9.O a9.E b0.O b0.E b1.O b1.E c0.O c0.E c1.O c1.E c2.O c2.E" || rm -f a0.O a0.E a1.O a1.E a2.O a2.E a3.O a3.E a4.O a4.E a5.O a5.E a6.O a6.E a7.O a7.E a8.O a8.E a9.O a9.E b0.O b0.E b1.O b1.E c0.O c0.E c1.O c1.E c2.O c2.E
make[2]: Leaving directory '/home/peter/coreutils-5.0/tests/wc'
Making clean in uniq
make[2]: Entering directory '/home/peter/coreutils-5.0/tests/uniq'
test -z "1.O 1.E 2.O 2.E 3.O 3.E 4.O 4.E 5.O 5.E 6.O 6.E 7.O 7.E 8.O 8.E 9.O 9.E 10.O 10.E 11.O 11.E 12.O 12.E 13.O 13.E 20.O 20.E 21.O 21.E 22.O 22.E 23.O 23.E obs30.O obs30.E 31.O 31.E 32.O 32.E 33.O 33.E 34.O 34.E 35.O 35.E obs40.O obs40.E obs41.O obs41.E 42.O 42.E 43.O 43.E obs44.O obs44.E obs45.O obs45.E 50.O 50.E 51.O 51.E 52.O 52.E 53.O 53.E 54.O 54.E 55.O 55.E 56.O 56.E 57.O 57.E 60.O 60.E 61.O 61.E 62.O 62.E 63.O 63.E 64.O 64.E 65.O 65.E 90.O 90.E 91.O 91.E 92.O 92.E 93.O 93.E 94.O 94.E 101.O 101.E 102.O 102.E 110.O 110.E 111.O 111.E 112.O 112.E 113.O 113.E 114.O 114.E 115.O 115.E 116.O 116.E 117.O 117.E 118.O 118.E 119.O 119.E" || rm -f 1.O 1.E 2.O 2.E 3.O 3.E 4.O 4.E 5.O 5.E 6.O 6.E 7.O 7.E 8.O 8.E 9.O 9.E 10.O 10.E 11.O 11.E 12.O 12.E 13.O 13.E 20.O 20.E 21.O 21.E 22.O 22.E 23.O 23.E obs30.O obs30.E 31.O 31.E 32.O 32.E 33.O 33.E 34.O 34.E 35.O 35.E obs40.O obs40.E obs41.O obs41.E 42.O 42.E 43.O 43.E obs44.O obs44.E obs45.O obs45.E 50.O 50.E 51.O 51.E 52.O 52.E 53.O 53.E 54.O 54.E 55.O 55.E 56.O 56.E 57.O 57.E 60.O 60.E 61.O 61.E 62.O 62.E 63.O 63.E 64.O 64.E 65.O 65.E 90.O 90.E 91.O 91.E 92.O 92.E 93.O 93.E 94.O 94.E 101.O 101.E 102.O 102.E 110.O 110.E 111.O 111.E 112.O 112.E 113.O 113.E 114.O 114.E 115.O 115.E 116.O 116.E 117.O 117.E 118.O 118.E 119.O 119.E
make[2]: Leaving directory '/home/peter/coreutils-5.0/tests/uniq'
Making clean in unexpand
make[2]: Entering directory '/home/peter/coreutils-5.0/tests/unexpand'
make[2]: Nothing to be done for 'clean'.
make[2]: Leaving directory '/home/peter/coreutils-5.0/tests/unexpand'
Making clean in tsort
make[2]: Entering directory '/home/peter/coreutils-5.0/tests/tsort'
make[2]: Nothing to be done for 'clean'.
make[2]: Leaving directory '/home/peter/coreutils-5.0/tests/tsort'
Making clean in tr
make[2]: Entering directory '/home/peter/coreutils-5.0/tests/tr'
test -z "1.O 1.E 2.O 2.E 3.O 3.E 4.O 4.E 5.O 5.E 6.O 6.E 7.O 7.E 8.O 8.E 9.O 9.E a.O a.E b.O b.E c.O c.E d.O d.E e.O e.E f.O f.E g.O g.E h.O h.E i.O i.E j.O j.E k.O k.E l.O l.E m.O m.E n.O n.E o.O o.E p.O p.E q.O q.E r.O r.E s.O s.E t.O t.E u.O u.E v.O v.E w.O w.E x.O x.E y.O y.E z.O z.E range-a-a.O range-a-a.E null.O null.E upcase.O upcase.E dncase.O dncase.E rep-cclass.O rep-cclass.E rep-1.O rep-1.E rep-2.O rep-2.E rep-3.O rep-3.E o-rep-1.O o-rep-1.E o-rep-2.O o-rep-2.E esc.O esc.E ross-0
[command output truncated]
-fr *.o
make[1]: Leaving directory '/home/peter/coreutils-5.0/po'
Making clean in m4
make[1]: Entering directory '/home/peter/coreutils-5.0/m4'
make[1]: Nothing to be done for 'clean'.
make[1]: Leaving directory '/home/peter/coreutils-5.0/m4'
Making clean in man
make[1]: Entering directory '/home/peter/coreutils-5.0/man'
make[1]: Nothing to be done for 'clean'.
make[1]: Leaving directory '/home/peter/coreutils-5.0/man'
Making clean in doc
make[1]: Entering directory '/home/peter/coreutils-5.0/doc'
rm -f coreutils.aux coreutils.cp coreutils.cps coreutils.fl coreutils.fn \
  coreutils.ky coreutils.log coreutils.op coreutils.pg \
  coreutils.tmp coreutils.toc coreutils.tp coreutils.tps \
  coreutils.vr coreutils.dvi coreutils.pdf coreutils.ps
rm -f vti.tmp
make[1]: Leaving directory '/home/peter/coreutils-5.0/doc'
Making clean in src
make[1]: Entering directory '/home/peter/coreutils-5.0/src'
test -z "chgrp chown chmod cp dd dircolors du ginstall link ln dir vdir ls mkdir mkfifo mknod mv readlink rm rmdir shred stat sync touch unlink cat cksum comm csplit cut expand fmt fold head join md5sum nl od paste pr ptx sha1sum sort split sum tac tail tr tsort unexpand uniq wc basename date dirname echo env expr factor false hostname id kill logname pathchk printenv printf pwd seq sleep tee test true tty whoami yes  uname chroot hostid nice pinky users who uptime stty df" || rm -f chgrp chown chmod cp dd dircolors du ginstall link ln dir vdir ls mkdir mkfifo mknod mv readlink rm rmdir shred stat sync touch unlink cat cksum comm csplit cut expand fmt fold head join md5sum nl od paste pr ptx sha1sum sort split sum tac tail tr tsort unexpand uniq wc basename date dirname echo env expr factor false hostname id kill logname pathchk printenv printf pwd seq sleep tee test true tty whoami yes  uname chroot hostid nice pinky users who uptime stty df > /dev/null 2>&1 || /bin/rm -f chgrp chown chmod cp dd dircolors du ginstall link ln dir vdir ls mkdir mkfifo mknod mv readlink rm rmdir shred stat sync touch unlink cat cksum comm csplit cut expand fmt fold head join md5sum nl od paste pr ptx sha1sum sort split sum tac tail tr tsort unexpand uniq wc basename date dirname echo env expr factor false hostname id kill logname pathchk printenv printf pwd seq sleep tee test true tty whoami yes  uname chroot hostid nice pinky users who uptime stty df
test -z "groups  nohup su" || rm -f groups  nohup su
rm -f *.o core *.core
make[1]: Leaving directory '/home/peter/coreutils-5.0/src'
Making clean in lib
make[1]: Entering directory '/home/peter/coreutils-5.0/lib'
test -z "charset.alias ref-add.sed ref-del.sed" || rm -f charset.alias ref-add.sed ref-del.sed
test -z "libfetish.a" || rm -f libfetish.a
rm -f *.o core *.core
make[1]: Leaving directory '/home/peter/coreutils-5.0/lib'
Making clean in .
make[1]: Entering directory '/home/peter/coreutils-5.0'
make[1]: Nothing to be done for 'clean-am'.
make[1]: Leaving directory '/home/peter/coreutils-5.0'
57 lines
ASSISTANT

Now, let's try a different approach. Let's configure with some compatibility flags to address the issues we saw:

1. tee function conflict
2. eaccess function conflict

Let's fix these issues by using some compiler flags:

compile-bench> cd coreutils-5.0 && CFLAGS="-Wno-error -D_GNU_SOURCE -D_DEFAULT_SOURCE" CXXFLAGS="-Wno-error" ./configure --prefix=/home/peter/result
checking build system type... x86_64-unknown-linux-gnu
checking host system type... x86_64-unknown-linux-gnu
checking for a BSD-compatible install... /usr/bin/install -c
checking whether build environment is sane... yes
checking for gawk... no
checking for mawk... mawk
checking whether make sets $(MAKE)... yes
checking for perl5.003 or newer... yes
checking for gcc... gcc
checking for C compiler default output... a.out
checking whether the C compiler works... yes
checking whether we are cross compiling... no
checking for suffix of executables... 
checking for suffix of object files... o
checking whether we are using the GNU C compiler... yes
checking whether gcc accepts -g... yes
checking for gcc option to accept ANSI C... none needed
checking for style of include used by make... GNU
checking dependency style of gcc... gcc3
checking how to run the C preprocessor... gcc -E
checking for egrep... grep -E
checking whether gcc needs -traditional... no
checking for ranlib... ranlib
checking whether ln -s works... yes
checking for AIX... no
checking for ANSI C header files... yes
checking for sys/types.h... yes
checking for sys/stat.h... yes
checking for stdlib.h... yes
checking for string.h... yes
checking for memory.h... yes
checking for strings.h... yes
checking for inttypes.h... yes
checking for stdint.h... yes
checking for unistd.h... yes
checking minix/config.h usability... no
checking minix/config.h presence... no
checking for minix/config.h... no
checking for uname... yes
checking for chroot... yes
checking for gethostid... yes
checking for strerror in -lcposix... no
checking for special C compiler options needed for large files... no
checking for _FILE_OFFSET_BITS value needed for large files... no
checking for _LARGE_FILES value needed for large files... no
checking for gcc option to accept ANSI C... none needed
checking for function prototypes... yes
checking for ANSI C header files... (cached) yes
checking for string.h... (cached) yes
checking whether byte ordering is bigendian... no
checking for an ANSI C-conforming const... yes
checking for working volatile... yes
checking for inline... inline
checking for working long double with more range or precision than double... no
checking errno.h usability... yes
checking errno.h presence... yes
checking for errno.h... yes
checking fcntl.h usability... yes
checking fcntl.h presence... yes
checking for fcntl.h... yes
checking float.h usability... yes
checking float.h presence... yes
checking for float.h... yes
checking hurd.h usability... no
checking hurd.h presence... no
checking for hurd.h... no
checking limits.h usability... yes
checking limits.h presence... yes
checking for limits.h... yes
checking for memory.h... (cached) yes
[command output truncated]
checking shadow.h presence... yes
checking for shadow.h... yes
checking for struct spwd.sp_pwdp... yes
checking for getspnam... yes
checking for library containing crypt... -lcrypt
checking for msgfmt... no
checking for gmsgfmt... :
checking for xgettext... no
checking for msgmerge... no
checking whether NLS is requested... yes
checking for GNU gettext in libc... yes
configure: creating ./config.status
config.status: creating Makefile
config.status: creating doc/Makefile
config.status: creating lib/Makefile
config.status: creating man/Makefile
config.status: creating m4/Makefile
config.status: creating po/Makefile.in
config.status: creating src/Makefile
config.status: creating tests/Makefile
config.status: creating tests/basename/Makefile
config.status: creating tests/chgrp/Makefile
config.status: creating tests/chmod/Makefile
config.status: creating tests/chown/Makefile
config.status: creating tests/cp/Makefile
config.status: creating tests/cut/Makefile
config.status: creating tests/date/Makefile
config.status: creating tests/dd/Makefile
config.status: creating tests/dircolors/Makefile
config.status: creating tests/du/Makefile
config.status: creating tests/expr/Makefile
config.status: creating tests/factor/Makefile
config.status: creating tests/fmt/Makefile
config.status: creating tests/head/Makefile
config.status: creating tests/install/Makefile
config.status: creating tests/join/Makefile
config.status: creating tests/ln/Makefile
config.status: creating tests/ls-2/Makefile
config.status: creating tests/ls/Makefile
config.status: creating tests/md5sum/Makefile
config.status: creating tests/misc/Makefile
config.status: creating tests/mkdir/Makefile
config.status: creating tests/mv/Makefile
config.status: creating tests/od/Makefile
config.status: creating tests/pr/Makefile
config.status: creating tests/rm/Makefile
config.status: creating tests/rmdir/Makefile
config.status: creating tests/seq/Makefile
config.status: creating tests/sha1sum/Makefile
config.status: creating tests/shred/Makefile
config.status: creating tests/sort/Makefile
config.status: creating tests/stty/Makefile
config.status: creating tests/sum/Makefile
config.status: creating tests/tac/Makefile
config.status: creating tests/tail-2/Makefile
config.status: creating tests/tail/Makefile
config.status: creating tests/test/Makefile
config.status: creating tests/touch/Makefile
config.status: creating tests/tr/Makefile
config.status: creating tests/tsort/Makefile
config.status: creating tests/unexpand/Makefile
config.status: creating tests/uniq/Makefile
config.status: creating tests/wc/Makefile
config.status: creating config.h
config.status: linking ./lib/ftw_.h to lib/ftw.h
config.status: executing depfiles commands
config.status: executing default-1 commands
config.status: creating po/POTFILES
config.status: creating po/Makefile
141 lines
ASSISTANT

Now let's try to build the package with these additional flags. Let's compile just the source files first to make sure it works:

compile-bench> cd coreutils-5.0 && make -j$(nproc) CFLAGS="-Wno-error -w -D_GNU_SOURCE -D_DEFAULT_SOURCE -D_FORTIFY_SOURCE=1" CXXFLAGS="-Wno-error" LDFLAGS=""
make  all-recursive
make[1]: Entering directory '/home/peter/coreutils-5.0'
Making all in lib
make[2]: Entering directory '/home/peter/coreutils-5.0/lib'
make  all-am
make[3]: Entering directory '/home/peter/coreutils-5.0/lib'
if gcc -DLIBDIR=\"/home/peter/result/lib\" -DHAVE_CONFIG_H -I. -I. -I.. -I.. -I.    -Wno-error -w -D_GNU_SOURCE -D_DEFAULT_SOURCE -D_FORTIFY_SOURCE=1 -MT acl.o -MD -MP -MF ".deps/acl.Tpo" \
  -c -o acl.o `test -f 'acl.c' || echo './'`acl.c; \
then mv ".deps/acl.Tpo" ".deps/acl.Po"; \
else rm -f ".deps/acl.Tpo"; exit 1; \
fi
if gcc -DLIBDIR=\"/home/peter/result/lib\" -DHAVE_CONFIG_H -I. -I. -I.. -I.. -I.    -Wno-error -w -D_GNU_SOURCE -D_DEFAULT_SOURCE -D_FORTIFY_SOURCE=1 -MT getdate.o -MD -MP -MF ".deps/getdate.Tpo" \
  -c -o getdate.o `test -f 'getdate.c' || echo './'`getdate.c; \
then mv ".deps/getdate.Tpo" ".deps/getdate.Po"; \
else rm -f ".deps/getdate.Tpo"; exit 1; \
fi
if gcc -DLIBDIR=\"/home/peter/result/lib\" -DHAVE_CONFIG_H -I. -I. -I.. -I.. -I.    -Wno-error -w -D_GNU_SOURCE -D_DEFAULT_SOURCE -D_FORTIFY_SOURCE=1 -MT posixtm.o -MD -MP -MF ".deps/posixtm.Tpo" \
  -c -o posixtm.o `test -f 'posixtm.c' || echo './'`posixtm.c; \
then mv ".deps/posixtm.Tpo" ".deps/posixtm.Po"; \
else rm -f ".deps/posixtm.Tpo"; exit 1; \
fi
if gcc -DLIBDIR=\"/home/peter/result/lib\" -DHAVE_CONFIG_H -I. -I. -I.. -I.. -I.    -Wno-error -w -D_GNU_SOURCE -D_DEFAULT_SOURCE -D_FORTIFY_SOURCE=1 -MT posixver.o -MD -MP -MF ".deps/posixver.Tpo" \
  -c -o posixver.o `test -f 'posixver.c' || echo './'`posixver.c; \
then mv ".deps/posixver.Tpo" ".deps/posixver.Po"; \
else rm -f ".deps/posixver.Tpo"; exit 1; \
fi
if gcc -DLIBDIR=\"/home/peter/result/lib\" -DHAVE_CONFIG_H -I. -I. -I.. -I.. -I.    -Wno-error -w -D_GNU_SOURCE -D_DEFAULT_SOURCE -D_FORTIFY_SOURCE=1 -MT strftime.o -MD -MP -MF ".deps/strftime.Tpo" \
  -c -o strftime.o `test -f 'strftime.c' || echo './'`strftime.c; \
then mv ".deps/strftime.Tpo" ".deps/strftime.Po"; \
else rm -f ".deps/strftime.Tpo"; exit 1; \
fi
if gcc -DLIBDIR=\"/home/peter/result/lib\" -DHAVE_CONFIG_H -I. -I. -I.. -I.. -I.    -Wno-error -w -D_GNU_SOURCE -D_DEFAULT_SOURCE -D_FORTIFY_SOURCE=1 -MT getopt.o -MD -MP -MF ".deps/getopt.Tpo" \
  -c -o getopt.o `test -f 'getopt.c' || echo './'`getopt.c; \
then mv ".deps/getopt.Tpo" ".deps/getopt.Po"; \
else rm -f ".deps/getopt.Tpo"; exit 1; \
fi
if gcc -DLIBDIR=\"/home/peter/result/lib\" -DHAVE_CONFIG_H -I. -I. -I.. -I.. -I.    -Wno-error -w -D_GNU_SOURCE -D_DEFAULT_SOURCE -D_FORTIFY_SOURCE=1 -MT getopt1.o -MD -MP -MF ".deps/getopt1.Tpo" \
  -c -o getopt1.o `test -f 'getopt1.c' || echo './'`getopt1.c; \
then mv ".deps/getopt1.Tpo" ".deps/getopt1.Po"; \
else rm -f ".deps/getopt1.Tpo"; exit 1; \
fi
if gcc -DLIBDIR=\"/home/peter/result/lib\" -DHAVE_CONFIG_H -I. -I. -I.. -I.. -I.    -Wno-error -w -D_GNU_SOURCE -D_DEFAULT_SOURCE -D_FORTIFY_SOURCE=1 -MT hash.o -MD -MP -MF ".deps/hash.Tpo" \
  -c -o hash.o `test -f 'hash.c' || echo './'`hash.c; \

[command output truncated]
rue.Po"; \
else rm -f ".deps/true.Tpo"; exit 1; \
fi
if gcc -DLOCALEDIR=\"/home/peter/result/share/locale\" -DSHAREDIR=\"/home/peter/result/share\" -DHAVE_CONFIG_H -I. -I. -I.. -I.. -I. -I../lib -I../lib    -Wno-error -w -D_GNU_SOURCE -D_DEFAULT_SOURCE -D_FORTIFY_SOURCE=1 -MT tty.o -MD -MP -MF ".deps/tty.Tpo" \
  -c -o tty.o `test -f 'tty.c' || echo './'`tty.c; \
then mv ".deps/tty.Tpo" ".deps/tty.Po"; \
else rm -f ".deps/tty.Tpo"; exit 1; \
fi
if gcc -DLOCALEDIR=\"/home/peter/result/share/locale\" -DSHAREDIR=\"/home/peter/result/share\" -DHAVE_CONFIG_H -I. -I. -I.. -I.. -I. -I../lib -I../lib    -Wno-error -w -D_GNU_SOURCE -D_DEFAULT_SOURCE -D_FORTIFY_SOURCE=1 -MT whoami.o -MD -MP -MF ".deps/whoami.Tpo" \
  -c -o whoami.o `test -f 'whoami.c' || echo './'`whoami.c; \
then mv ".deps/whoami.Tpo" ".deps/whoami.Po"; \
else rm -f ".deps/whoami.Tpo"; exit 1; \
fi
if gcc -DLOCALEDIR=\"/home/peter/result/share/locale\" -DSHAREDIR=\"/home/peter/result/share\" -DHAVE_CONFIG_H -I. -I. -I.. -I.. -I. -I../lib -I../lib    -Wno-error -w -D_GNU_SOURCE -D_DEFAULT_SOURCE -D_FORTIFY_SOURCE=1 -MT yes.o -MD -MP -MF ".deps/yes.Tpo" \
  -c -o yes.o `test -f 'yes.c' || echo './'`yes.c; \
then mv ".deps/yes.Tpo" ".deps/yes.Po"; \
else rm -f ".deps/yes.Tpo"; exit 1; \
fi
tee.c:35:12: error: conflicting types for 'tee'; have 'int(int,  const char **)'
   35 | static int tee (int nfiles, const char **files);
      |            ^~~
In file included from /usr/include/x86_64-linux-gnu/bits/fcntl.h:61,
                 from /usr/include/fcntl.h:35,
                 from system.h:153,
                 from tee.c:26:
/usr/include/x86_64-linux-gnu/bits/fcntl-linux.h:429:18: note: previous declaration of 'tee' with type '__ssize_t(int,  int,  size_t,  unsigned int)' {aka 'long int(int,  int,  long unsigned int,  unsigned int)'}
  429 | extern __ssize_t tee (int __fdin, int __fdout, size_t __len,
      |                  ^~~
test.c:142:1: error: static declaration of 'eaccess' follows non-static declaration
  142 | eaccess (char const *file, int mode)
      | ^~~~~~~
In file included from /usr/include/x86_64-linux-gnu/bits/sigstksz.h:24,
                 from /usr/include/signal.h:328,
                 from /usr/include/x86_64-linux-gnu/sys/param.h:28,
                 from system.h:33,
                 from test.c:41:
/usr/include/unistd.h:296:12: note: previous declaration of 'eaccess' with type 'int(const char *, int)'
  296 | extern int eaccess (const char *__name, int __type)
      |            ^~~~~~~
make[3]: *** [Makefile:1263: tee.o] Error 1
make[3]: *** Waiting for unfinished jobs....
make[3]: *** [Makefile:1263: test.o] Error 1
make[3]: Leaving directory '/home/peter/coreutils-5.0/src'
make[2]: *** [Makefile:815: all] Error 2
make[2]: Leaving directory '/home/peter/coreutils-5.0/src'
make[1]: *** [Makefile:244: all-recursive] Error 1
make[1]: Leaving directory '/home/peter/coreutils-5.0'
make: *** [Makefile:199: all] Error 2
94 lines
ASSISTANT

I'll try patching the problematic files individually. Let's fix the two problematic files:

compile-bench> cd coreutils-5.0/src && cp tee.c tee.c.bak && sed 's/static int tee (int nfiles, const char \*\*files);/static int local_tee (int nfiles, const char \*\*files);/' tee.c | sed 's/tee (nfiles, files)/local_tee (nfiles, files)/g' > tee.tmp && mv tee.tmp tee.c
[empty output]
ASSISTANT

Now let's fix the eaccess function conflict in the test.c file:

compile-bench> cd coreutils-5.0/src && cp test.c test.c.bak && sed 's/eaccess (char const \*file, int mode)/local_eaccess (char const \*file, int mode)/' test.c | sed 's/if (eaccess (",
bash: eval: line 16: unexpected EOF while looking for matching `''
bash: eval: line 17: syntax error: unexpected end of file
3 lines
ASSISTANT

Let me fix the sed command issue:

compile-bench> cd coreutils-5.0/src && sed 's/eaccess (char const \*file, int mode)/local_eaccess (char const \*file, int mode)/' test.c > test.tmp && sed 's/if (eaccess (/if (local_eaccess (/g' test.tmp > test_new.c && mv test_new.c test.c
[empty output]
ASSISTANT

Let's try another patch approach to fix the tee.c file and rename the function properly:

compile-bench> cd coreutils-5.0/src && cat tee.c | sed 's/static int tee (int nfiles, const char \*\*files);/static int local_tee (int nfiles, const char \*\*files);/' | sed 's/tee (nfiles, files)/local_tee (nfiles, files)/g' > tee_new.c && mv tee_new.c tee.c
[empty output]
ASSISTANT

Let's check if our patches worked by trying to compile again:

compile-bench> cd coreutils-5.0 && make CFLAGS="-Wno-error -w -D_GNU_SOURCE -D_DEFAULT_SOURCE -D_FORTIFY_SOURCE=1" CXXFLAGS="-Wno-error" LDFLAGS=""
make  all-recursive
make[1]: Entering directory '/home/peter/coreutils-5.0'
Making all in lib
make[2]: Entering directory '/home/peter/coreutils-5.0/lib'
make  all-am
make[3]: Entering directory '/home/peter/coreutils-5.0/lib'
make[3]: Nothing to be done for 'all-am'.
make[3]: Leaving directory '/home/peter/coreutils-5.0/lib'
make[2]: Leaving directory '/home/peter/coreutils-5.0/lib'
Making all in src
make[2]: Entering directory '/home/peter/coreutils-5.0/src'
make  all-am
make[3]: Entering directory '/home/peter/coreutils-5.0/src'
gcc  -Wno-error -w -D_GNU_SOURCE -D_DEFAULT_SOURCE -D_FORTIFY_SOURCE=1   -o chgrp  chgrp.o chown-core.o ../lib/libfetish.a  ../lib/libfetish.a 
gcc  -Wno-error -w -D_GNU_SOURCE -D_DEFAULT_SOURCE -D_FORTIFY_SOURCE=1   -o chown  chown.o chown-core.o ../lib/libfetish.a  ../lib/libfetish.a 
gcc  -Wno-error -w -D_GNU_SOURCE -D_DEFAULT_SOURCE -D_FORTIFY_SOURCE=1   -o chmod  chmod.o ../lib/libfetish.a  ../lib/libfetish.a 
gcc  -Wno-error -w -D_GNU_SOURCE -D_DEFAULT_SOURCE -D_FORTIFY_SOURCE=1   -o cp  cp.o copy.o cp-hash.o ../lib/libfetish.a  ../lib/libfetish.a 
gcc  -Wno-error -w -D_GNU_SOURCE -D_DEFAULT_SOURCE -D_FORTIFY_SOURCE=1   -o dd  dd.o ../lib/libfetish.a  ../lib/libfetish.a 
gcc  -Wno-error -w -D_GNU_SOURCE -D_DEFAULT_SOURCE -D_FORTIFY_SOURCE=1   -o dircolors  dircolors.o ../lib/libfetish.a  ../lib/libfetish.a 
gcc  -Wno-error -w -D_GNU_SOURCE -D_DEFAULT_SOURCE -D_FORTIFY_SOURCE=1   -o du  du.o ../lib/libfetish.a  ../lib/libfetish.a 
gcc  -Wno-error -w -D_GNU_SOURCE -D_DEFAULT_SOURCE -D_FORTIFY_SOURCE=1   -o ginstall  install.o copy.o cp-hash.o ../lib/libfetish.a  ../lib/libfetish.a 
gcc  -Wno-error -w -D_GNU_SOURCE -D_DEFAULT_SOURCE -D_FORTIFY_SOURCE=1   -o link  link.o ../lib/libfetish.a  ../lib/libfetish.a 
gcc  -Wno-error -w -D_GNU_SOURCE -D_DEFAULT_SOURCE -D_FORTIFY_SOURCE=1   -o ln  ln.o ../lib/libfetish.a  ../lib/libfetish.a 
gcc  -Wno-error -w -D_GNU_SOURCE -D_DEFAULT_SOURCE -D_FORTIFY_SOURCE=1   -o dir  ls.o ls-dir.o ../lib/libfetish.a  ../lib/libfetish.a  
gcc  -Wno-error -w -D_GNU_SOURCE -D_DEFAULT_SOURCE -D_FORTIFY_SOURCE=1   -o vdir  ls.o ls-vdir.o ../lib/libfetish.a  ../lib/libfetish.a  
gcc  -Wno-error -w -D_GNU_SOURCE -D_DEFAULT_SOURCE -D_FORTIFY_SOURCE=1   -o ls  ls.o ls-ls.o ../lib/libfetish.a  ../lib/libfetish.a  
gcc  -Wno-error -w -D_GNU_SOURCE -D_DEFAULT_SOURCE -D_FORTIFY_SOURCE=1   -o mkdir  mkdir.o ../lib/libfetish.a  ../lib/libfetish.a 
gcc  -Wno-error -w -D_GNU_SOURCE -D_DEFAULT_SOURCE -D_FORTIFY_SOURCE=1   -o mkfifo  mkfifo.o ../lib/libfetish.a  ../lib/libfetish.a 
gcc  -Wno-error -w -D_GNU_SOURCE -D_DEFAULT_SOURCE -D_FORTIFY_SOURCE=1   -o mknod  mknod.o ../lib/libfetish.a  ../lib/libfetish.a 
gcc  -Wno-error -w -D_GNU_SOURCE -D_DEFAULT_SOURCE -D_FORTIFY_SOURCE=1   -o mv  mv.o copy.o cp-hash.o remove.o ../lib/libfetish.a  ../lib/libfetish.a 
gcc  -Wno-error -w -D_GNU_SOURCE -D_DEFAULT_SOURCE -D_FORTIFY_SOURCE=1   -o readlink  readlink.o ../lib/libfetish.a  ../l
[command output truncated]
AULT_SOURCE -D_FORTIFY_SOURCE=1   -o kill  kill.o ../lib/libfetish.a  ../lib/libfetish.a 
gcc  -Wno-error -w -D_GNU_SOURCE -D_DEFAULT_SOURCE -D_FORTIFY_SOURCE=1   -o logname  logname.o ../lib/libfetish.a  ../lib/libfetish.a 
gcc  -Wno-error -w -D_GNU_SOURCE -D_DEFAULT_SOURCE -D_FORTIFY_SOURCE=1   -o pathchk  pathchk.o ../lib/libfetish.a  ../lib/libfetish.a 
gcc  -Wno-error -w -D_GNU_SOURCE -D_DEFAULT_SOURCE -D_FORTIFY_SOURCE=1   -o printenv  printenv.o ../lib/libfetish.a  ../lib/libfetish.a 
gcc  -Wno-error -w -D_GNU_SOURCE -D_DEFAULT_SOURCE -D_FORTIFY_SOURCE=1   -o printf  printf.o ../lib/libfetish.a  ../lib/libfetish.a   
gcc  -Wno-error -w -D_GNU_SOURCE -D_DEFAULT_SOURCE -D_FORTIFY_SOURCE=1   -o pwd  pwd.o ../lib/libfetish.a  ../lib/libfetish.a 
gcc  -Wno-error -w -D_GNU_SOURCE -D_DEFAULT_SOURCE -D_FORTIFY_SOURCE=1   -o seq  seq.o ../lib/libfetish.a  ../lib/libfetish.a -lm 
gcc  -Wno-error -w -D_GNU_SOURCE -D_DEFAULT_SOURCE -D_FORTIFY_SOURCE=1   -o sleep  sleep.o ../lib/libfetish.a  ../lib/libfetish.a -lm    
if gcc -DLOCALEDIR=\"/home/peter/result/share/locale\" -DSHAREDIR=\"/home/peter/result/share\" -DHAVE_CONFIG_H -I. -I. -I.. -I.. -I. -I../lib -I../lib    -Wno-error -w -D_GNU_SOURCE -D_DEFAULT_SOURCE -D_FORTIFY_SOURCE=1 -MT tee.o -MD -MP -MF ".deps/tee.Tpo" \
  -c -o tee.o `test -f 'tee.c' || echo './'`tee.c; \
then mv ".deps/tee.Tpo" ".deps/tee.Po"; \
else rm -f ".deps/tee.Tpo"; exit 1; \
fi
tee.c: In function 'main':
tee.c:149:10: error: too few arguments to function 'tee'
  149 |   errs = tee (argc - optind, (const char **) &argv[optind]);
      |          ^~~
In file included from /usr/include/x86_64-linux-gnu/bits/fcntl.h:61,
                 from /usr/include/fcntl.h:35,
                 from system.h:153,
                 from tee.c:26:
/usr/include/x86_64-linux-gnu/bits/fcntl-linux.h:429:18: note: declared here
  429 | extern __ssize_t tee (int __fdin, int __fdout, size_t __len,
      |                  ^~~
tee.c: At top level:
tee.c:161:1: error: conflicting types for 'tee'; have 'int(int,  const char **)'
  161 | tee (int nfiles, const char **files)
      | ^~~
In file included from /usr/include/x86_64-linux-gnu/bits/fcntl.h:61,
                 from /usr/include/fcntl.h:35,
                 from system.h:153,
                 from tee.c:26:
/usr/include/x86_64-linux-gnu/bits/fcntl-linux.h:429:18: note: previous declaration of 'tee' with type '__ssize_t(int,  int,  size_t,  unsigned int)' {aka 'long int(int,  int,  long unsigned int,  unsigned int)'}
  429 | extern __ssize_t tee (int __fdin, int __fdout, size_t __len,
      |                  ^~~
make[3]: *** [Makefile:1263: tee.o] Error 1
make[3]: Leaving directory '/home/peter/coreutils-5.0/src'
make[2]: *** [Makefile:815: all] Error 2
make[2]: Leaving directory '/home/peter/coreutils-5.0/src'
make[1]: *** [Makefile:244: all-recursive] Error 1
make[1]: Leaving directory '/home/peter/coreutils-5.0'
make: *** [Makefile:199: all] Error 2
75 lines
ASSISTANT

We need to fix both the function declaration issue and the function call issue. Let me try a more comprehensive fix.

Fix tee.c file:

compile-bench> cd coreutils-5.0/src && mv tee.c.bak tee.c
[empty output]
ASSISTANT

Let me apply a better fix to the tee.c file, changing both the declaration and the usage systematically:

compile-bench> cd coreutils-5.0/src && sed 's/tee (int nfiles/local_tee (int nfiles/' tee.c | sed 's/errs = tee (/errs = local_tee (/' | sed 's/tee (int nfiles/local_tee (int nfiles/' > tee_new.c && mv tee_new.c tee.c
[empty output]
ASSISTANT

Let me fix the test.c file systematically as well:

compile-bench> cd coreutils-5.0/src && mv test.c.bak test.c && sed 's/eaccess (char const/local_eaccess (char const/' test.c > test_new.c && mv test_new.c test.c
mv: cannot stat 'test.c.bak': No such file or directory
ASSISTANT

Let's get the original test.c file back:

compile-bench> cd coreutils-5.0/src && git checkout -- test.c 2>/dev/null || hg revert --no-backup -- . 2>/dev/null || git restore -- . 2>/dev/null || true
[empty output]
ASSISTANT

Let me try to fix the test file in a simpler way:

compile-bench> cd coreutils-5.0/src && sed 's/^eaccess (/local_eaccess (/' test.c > test_new.c && mv test_new.c test.c
[empty output]
ASSISTANT

Now let's try building again to check if the patches worked:

compile-bench> cd coreutils-5.0 && make CFLAGS="-Wno-error -w -D_GNU_SOURCE -D_DEFAULT_SOURCE -D_FORTIFY_SOURCE=1" CXXFLAGS="-Wno-error" LDFLAGS=""
make  all-recursive
make[1]: Entering directory '/home/peter/coreutils-5.0'
Making all in lib
make[2]: Entering directory '/home/peter/coreutils-5.0/lib'
make  all-am
make[3]: Entering directory '/home/peter/coreutils-5.0/lib'
make[3]: Nothing to be done for 'all-am'.
make[3]: Leaving directory '/home/peter/coreutils-5.0/lib'
make[2]: Leaving directory '/home/peter/coreutils-5.0/lib'
Making all in src
make[2]: Entering directory '/home/peter/coreutils-5.0/src'
make  all-am
make[3]: Entering directory '/home/peter/coreutils-5.0/src'
if gcc -DLOCALEDIR=\"/home/peter/result/share/locale\" -DSHAREDIR=\"/home/peter/result/share\" -DHAVE_CONFIG_H -I. -I. -I.. -I.. -I. -I../lib -I../lib    -Wno-error -w -D_GNU_SOURCE -D_DEFAULT_SOURCE -D_FORTIFY_SOURCE=1 -MT tee.o -MD -MP -MF ".deps/tee.Tpo" \
  -c -o tee.o `test -f 'tee.c' || echo './'`tee.c; \
then mv ".deps/tee.Tpo" ".deps/tee.Po"; \
else rm -f ".deps/tee.Tpo"; exit 1; \
fi
gcc  -Wno-error -w -D_GNU_SOURCE -D_DEFAULT_SOURCE -D_FORTIFY_SOURCE=1   -o tee  tee.o ../lib/libfetish.a  ../lib/libfetish.a 
/usr/bin/ld: tee.o: in function `main':
tee.c:(.text+0x364): undefined reference to `local_tee'
collect2: error: ld returned 1 exit status
make[3]: *** [Makefile:1072: tee] Error 1
make[3]: Leaving directory '/home/peter/coreutils-5.0/src'
make[2]: *** [Makefile:815: all] Error 2
make[2]: Leaving directory '/home/peter/coreutils-5.0/src'
make[1]: *** [Makefile:244: all-recursive] Error 1
make[1]: Leaving directory '/home/peter/coreutils-5.0'
make: *** [Makefile:199: all] Error 2
30 lines
ASSISTANT

Great! It's making progress. Now I need to fix the function call in tee.c. Let me fix the function definition as well:

compile-bench> cd coreutils-5.0/src && sed 's/tee (int nfiles/local_tee (int nfiles/' tee.c > tee_new.c && mv tee_new.c tee.c
[empty output]
ASSISTANT

Let's try building again:

compile-bench> cd coreutils-5.0 && make CFLAGS="-Wno-error -w -D_GNU_SOURCE -D_DEFAULT_SOURCE -D_FORTIFY_SOURCE=1" CXXFLAGS="-Wno-error" LDFLAGS=""
make  all-recursive
make[1]: Entering directory '/home/peter/coreutils-5.0'
Making all in lib
make[2]: Entering directory '/home/peter/coreutils-5.0/lib'
make  all-am
make[3]: Entering directory '/home/peter/coreutils-5.0/lib'
make[3]: Nothing to be done for 'all-am'.
make[3]: Leaving directory '/home/peter/coreutils-5.0/lib'
make[2]: Leaving directory '/home/peter/coreutils-5.0/lib'
Making all in src
make[2]: Entering directory '/home/peter/coreutils-5.0/src'
make  all-am
make[3]: Entering directory '/home/peter/coreutils-5.0/src'
if gcc -DLOCALEDIR=\"/home/peter/result/share/locale\" -DSHAREDIR=\"/home/peter/result/share\" -DHAVE_CONFIG_H -I. -I. -I.. -I.. -I. -I../lib -I../lib    -Wno-error -w -D_GNU_SOURCE -D_DEFAULT_SOURCE -D_FORTIFY_SOURCE=1 -MT tee.o -MD -MP -MF ".deps/tee.Tpo" \
  -c -o tee.o `test -f 'tee.c' || echo './'`tee.c; \
then mv ".deps/tee.Tpo" ".deps/tee.Po"; \
else rm -f ".deps/tee.Tpo"; exit 1; \
fi
gcc  -Wno-error -w -D_GNU_SOURCE -D_DEFAULT_SOURCE -D_FORTIFY_SOURCE=1   -o tee  tee.o ../lib/libfetish.a  ../lib/libfetish.a 
/usr/bin/ld: tee.o: in function `main':
tee.c:(.text+0x364): undefined reference to `local_tee'
collect2: error: ld returned 1 exit status
make[3]: *** [Makefile:1072: tee] Error 1
make[3]: Leaving directory '/home/peter/coreutils-5.0/src'
make[2]: *** [Makefile:815: all] Error 2
make[2]: Leaving directory '/home/peter/coreutils-5.0/src'
make[1]: *** [Makefile:244: all-recursive] Error 1
make[1]: Leaving directory '/home/peter/coreutils-5.0'
make: *** [Makefile:199: all] Error 2
30 lines
ASSISTANT

I need to fix the function signature call in the main function. Let me fix both the declaration and usage properly:

compile-bench> cd coreutils-5.0/src && sed 's/errs = tee/emerrs = local_tee/' tee.c > tee_new.c && mv tee_new.c tee.c
[empty output]
ASSISTANT

There's a typo. Let me fix it:

compile-bench> cd coreutils-5.0/src && sed 's/emerrs = local_tee/errs = local_tee/' tee.c > tee_new.c && mv tee_new.c tee.c
[empty output]
ASSISTANT

Let's try building again:

compile-bench> cd coreutils-5.0 && make CFLAGS="-Wno-error -w -D_GNU_SOURCE -D_DEFAULT_SOURCE -D_FORTIFY_SOURCE=1" CXXFLAGS="-Wno-error" LDFLAGS=""
make  all-recursive
make[1]: Entering directory '/home/peter/coreutils-5.0'
Making all in lib
make[2]: Entering directory '/home/peter/coreutils-5.0/lib'
make  all-am
make[3]: Entering directory '/home/peter/coreutils-5.0/lib'
make[3]: Nothing to be done for 'all-am'.
make[3]: Leaving directory '/home/peter/coreutils-5.0/lib'
make[2]: Leaving directory '/home/peter/coreutils-5.0/lib'
Making all in src
make[2]: Entering directory '/home/peter/coreutils-5.0/src'
make  all-am
make[3]: Entering directory '/home/peter/coreutils-5.0/src'
if gcc -DLOCALEDIR=\"/home/peter/result/share/locale\" -DSHAREDIR=\"/home/peter/result/share\" -DHAVE_CONFIG_H -I. -I. -I.. -I.. -I. -I../lib -I../lib    -Wno-error -w -D_GNU_SOURCE -D_DEFAULT_SOURCE -D_FORTIFY_SOURCE=1 -MT tee.o -MD -MP -MF ".deps/tee.Tpo" \
  -c -o tee.o `test -f 'tee.c' || echo './'`tee.c; \
then mv ".deps/tee.Tpo" ".deps/tee.Po"; \
else rm -f ".deps/tee.Tpo"; exit 1; \
fi
gcc  -Wno-error -w -D_GNU_SOURCE -D_DEFAULT_SOURCE -D_FORTIFY_SOURCE=1   -o tee  tee.o ../lib/libfetish.a  ../lib/libfetish.a 
/usr/bin/ld: tee.o: in function `main':
tee.c:(.text+0x364): undefined reference to `local_tee'
collect2: error: ld returned 1 exit status
make[3]: *** [Makefile:1072: tee] Error 1
make[3]: Leaving directory '/home/peter/coreutils-5.0/src'
make[2]: *** [Makefile:815: all] Error 2
make[2]: Leaving directory '/home/peter/coreutils-5.0/src'
make[1]: *** [Makefile:244: all-recursive] Error 1
make[1]: Leaving directory '/home/peter/coreutils-5.0'
make: *** [Makefile:199: all] Error 2
30 lines
ASSISTANT

Let me check what the function call looks like in the file:

compile-bench> cd coreutils-5.0/src && grep -n "local_tee" tee.c
35:static int local_local_local_tee (int nfiles, const char **files);
149:  errs = local_tee (argc - optind, (const char **) &argv[optind]);
161:local_local_local_tee (int nfiles, const char **files)
4 lines
ASSISTANT

The sed commands got applied multiple times. Let me restore the original and fix it properly one time:

compile-bench> cd coreutils-5.0/src && git checkout -- tee.c 2>/dev/null || cp tee.c.bak tee.c 2>/dev/null || true
[empty output]
ASSISTANT

Now let me apply a single comprehensive fix:

compile-bench> cd coreutils-5.0/src && cat tee.c | sed 's/static int tee(/static int local_tee(/' | sed 's/errs = tee(/errs = local_tee(/' | sed '/^tee (int nfiles/c\nlocal_tee (int nfiles' > tee_new.c && mv tee_new.c tee.c
[empty output]
ASSISTANT

Let me try building again:

compile-bench> cd coreutils-5.0/src && gcc -Wno-error -w -D_GNU_SOURCE -D_DEFAULT_SOURCE -D_FORTIFY_SOURCE=1 -c tee.c -o tee.o
tee.c:20:10: fatal error: config.h: No such file or directory
   20 | #include <config.h>
      |          ^~~~~~~~~~
compilation terminated.
5 lines
ASSISTANT

We need to be in the right directory and use the proper environment:

compile-bench> cd coreutils-5.0 && make -j$(nproc) CFLAGS="-Wno-error -w -D_GNU_SOURCE -D_DEFAULT_SOURCE -D_FORTIFY_SOURCE=1" CXXFLAGS="-Wno-error" LDFLAGS=""
make  all-recursive
make[1]: Entering directory '/home/peter/coreutils-5.0'
Making all in lib
make[2]: Entering directory '/home/peter/coreutils-5.0/lib'
make  all-am
make[3]: Entering directory '/home/peter/coreutils-5.0/lib'
make[3]: Nothing to be done for 'all-am'.
make[3]: Leaving directory '/home/peter/coreutils-5.0/lib'
make[2]: Leaving directory '/home/peter/coreutils-5.0/lib'
Making all in src
make[2]: Entering directory '/home/peter/coreutils-5.0/src'
make  all-am
make[3]: Entering directory '/home/peter/coreutils-5.0/src'
if gcc -DLOCALEDIR=\"/home/peter/result/share/locale\" -DSHAREDIR=\"/home/peter/result/share\" -DHAVE_CONFIG_H -I. -I. -I.. -I.. -I. -I../lib -I../lib    -Wno-error -w -D_GNU_SOURCE -D_DEFAULT_SOURCE -D_FORTIFY_SOURCE=1 -MT tee.o -MD -MP -MF ".deps/tee.Tpo" \
  -c -o tee.o `test -f 'tee.c' || echo './'`tee.c; \
then mv ".deps/tee.Tpo" ".deps/tee.Po"; \
else rm -f ".deps/tee.Tpo"; exit 1; \
fi
if gcc -DLOCALEDIR=\"/home/peter/result/share/locale\" -DSHAREDIR=\"/home/peter/result/share\" -DHAVE_CONFIG_H -I. -I. -I.. -I.. -I. -I../lib -I../lib    -Wno-error -w -D_GNU_SOURCE -D_DEFAULT_SOURCE -D_FORTIFY_SOURCE=1 -MT test.o -MD -MP -MF ".deps/test.Tpo" \
  -c -o test.o `test -f 'test.c' || echo './'`test.c; \
then mv ".deps/test.Tpo" ".deps/test.Po"; \
else rm -f ".deps/test.Tpo"; exit 1; \
fi
if gcc -DLOCALEDIR=\"/home/peter/result/share/locale\" -DSHAREDIR=\"/home/peter/result/share\" -DHAVE_CONFIG_H -I. -I. -I.. -I.. -I. -I../lib -I../lib    -Wno-error -w -D_GNU_SOURCE -D_DEFAULT_SOURCE -D_FORTIFY_SOURCE=1 -MT uname.o -MD -MP -MF ".deps/uname.Tpo" \
  -c -o uname.o `test -f 'uname.c' || echo './'`uname.c; \
then mv ".deps/uname.Tpo" ".deps/uname.Po"; \
else rm -f ".deps/uname.Tpo"; exit 1; \
fi
if gcc -DLOCALEDIR=\"/home/peter/result/share/locale\" -DSHAREDIR=\"/home/peter/result/share\" -DHAVE_CONFIG_H -I. -I. -I.. -I.. -I. -I../lib -I../lib    -Wno-error -w -D_GNU_SOURCE -D_DEFAULT_SOURCE -D_FORTIFY_SOURCE=1 -MT chroot.o -MD -MP -MF ".deps/chroot.Tpo" \
  -c -o chroot.o `test -f 'chroot.c' || echo './'`chroot.c; \
then mv ".deps/chroot.Tpo" ".deps/chroot.Po"; \
else rm -f ".deps/chroot.Tpo"; exit 1; \
fi
gcc  -Wno-error -w -D_GNU_SOURCE -D_DEFAULT_SOURCE -D_FORTIFY_SOURCE=1   -o true  true.o ../lib/libfetish.a  ../lib/libfetish.a 
gcc  -Wno-error -w -D_GNU_SOURCE -D_DEFAULT_SOURCE -D_FORTIFY_SOURCE=1   -o tty  tty.o ../lib/libfetish.a  ../lib/libfetish.a 
gcc  -Wno-error -w -D_GNU_SOURCE -D_DEFAULT_SOURCE -D_FORTIFY_SOURCE=1   -o whoami  whoami.o ../lib/libfetish.a  ../lib/libfetish.a 
gcc  -Wno-error -w -D_GNU_SOURCE -D_DEFAULT_SOURCE -D_FORTIFY_SOURCE=1   -o yes  yes.o ../lib/libfetish.a  ../lib/libfetish.a 
if gcc -DLOCALEDIR=\"/home/peter/result/share/locale\" -DSHAREDIR=\"/home/peter/result/share\" -DHAVE_CONFIG_H -I. -I. -I.. -I.. -I. -I../lib -I../lib    -Wno-error -w -D_GNU_SOURCE -D_DEFAULT_SOURCE -D_FORTIFY_SOURCE=1 -MT hostid.o -MD -MP -MF ".deps/hostid.Tpo" \
  -c -o ho
[command output truncated]
ptime.o -MD -MP -MF ".deps/uptime.Tpo" \
  -c -o uptime.o `test -f 'uptime.c' || echo './'`uptime.c; \
then mv ".deps/uptime.Tpo" ".deps/uptime.Po"; \
else rm -f ".deps/uptime.Tpo"; exit 1; \
fi
if gcc -DLOCALEDIR=\"/home/peter/result/share/locale\" -DSHAREDIR=\"/home/peter/result/share\" -DHAVE_CONFIG_H -I. -I. -I.. -I.. -I. -I../lib -I../lib    -Wno-error -w -D_GNU_SOURCE -D_DEFAULT_SOURCE -D_FORTIFY_SOURCE=1 -MT stty.o -MD -MP -MF ".deps/stty.Tpo" \
  -c -o stty.o `test -f 'stty.c' || echo './'`stty.c; \
then mv ".deps/stty.Tpo" ".deps/stty.Po"; \
else rm -f ".deps/stty.Tpo"; exit 1; \
fi
if gcc -DLOCALEDIR=\"/home/peter/result/share/locale\" -DSHAREDIR=\"/home/peter/result/share\" -DHAVE_CONFIG_H -I. -I. -I.. -I.. -I. -I../lib -I../lib    -Wno-error -w -D_GNU_SOURCE -D_DEFAULT_SOURCE -D_FORTIFY_SOURCE=1 -MT df.o -MD -MP -MF ".deps/df.Tpo" \
  -c -o df.o `test -f 'df.c' || echo './'`df.c; \
then mv ".deps/df.Tpo" ".deps/df.Po"; \
else rm -f ".deps/df.Tpo"; exit 1; \
fi
rm -f groups groups-t
rm -f nohup nohup-t
sed \
  -e 's!@''bindir''@!/home/peter/result/bin!' \
  -e 's/@''GNU_PACKAGE''@/GNU coreutils/' \
  -e 's/@''PACKAGE_BUGREPORT''@/[email protected]/' \
  -e 's/@''VERSION''@/5.0/' groups.sh > groups-t
sed \
  -e 's!@''bindir''@!/home/peter/result/bin!' \
  -e 's/@''GNU_PACKAGE''@/GNU coreutils/' \
  -e 's/@''PACKAGE_BUGREPORT''@/[email protected]/' \
  -e 's/@''VERSION''@/5.0/' nohup.sh > nohup-t
chmod +x groups-t
chmod +x nohup-t
mv groups-t groups
mv nohup-t nohup
if gcc -DLOCALEDIR=\"/home/peter/result/share/locale\" -DSHAREDIR=\"/home/peter/result/share\" -DHAVE_CONFIG_H -I. -I. -I.. -I.. -I. -I../lib -I../lib    -Wno-error -w -D_GNU_SOURCE -D_DEFAULT_SOURCE -D_FORTIFY_SOURCE=1 -MT su.o -MD -MP -MF ".deps/su.Tpo" \
  -c -o su.o `test -f 'su.c' || echo './'`su.c; \
then mv ".deps/su.Tpo" ".deps/su.Po"; \
else rm -f ".deps/su.Tpo"; exit 1; \
fi
gcc  -Wno-error -w -D_GNU_SOURCE -D_DEFAULT_SOURCE -D_FORTIFY_SOURCE=1   -o tee  tee.o ../lib/libfetish.a  ../lib/libfetish.a 
gcc  -Wno-error -w -D_GNU_SOURCE -D_DEFAULT_SOURCE -D_FORTIFY_SOURCE=1   -o uname  uname.o ../lib/libfetish.a  ../lib/libfetish.a 
gcc  -Wno-error -w -D_GNU_SOURCE -D_DEFAULT_SOURCE -D_FORTIFY_SOURCE=1   -o chroot  chroot.o ../lib/libfetish.a  ../lib/libfetish.a 
gcc  -Wno-error -w -D_GNU_SOURCE -D_DEFAULT_SOURCE -D_FORTIFY_SOURCE=1   -o hostid  hostid.o ../lib/libfetish.a  ../lib/libfetish.a 
/usr/bin/ld: tee.o: in function `main':
tee.c:(.text+0x364): undefined reference to `local_tee'
collect2: error: ld returned 1 exit status
make[3]: *** [Makefile:1072: tee] Error 1
make[3]: *** Waiting for unfinished jobs....
make[3]: Leaving directory '/home/peter/coreutils-5.0/src'
make[2]: *** [Makefile:815: all] Error 2
make[2]: Leaving directory '/home/peter/coreutils-5.0/src'
make[1]: *** [Makefile:244: all-recursive] Error 1
make[1]: Leaving directory '/home/peter/coreutils-5.0'
make: *** [Makefile:199: all] Error 2
92 lines
ASSISTANT

Let's check the current tee.c file to see what's wrong:

compile-bench> cd coreutils-5.0/src && head -35 tee.c | tail -20
   Inc., 59 Temple Place - Suite 330, Boston, MA 02111-1307, USA.  */

/* Mike Parker, Richard M. Stallman, and David MacKenzie */

#include <config.h>
#include <stdio.h>
#include <sys/types.h>
#include <signal.h>
#include <getopt.h>

#include "system.h"
#include "closeout.h"
#include "error.h"

/* The official name of this program (e.g., no `g' prefix).  */
#define PROGRAM_NAME "tee"

#define AUTHORS N_ ("Mike Parker, Richard M. Stallman, and David MacKenzie")

static int local_local_local_tee (int nfiles, const char **files);
21 lines
ASSISTANT

The sed command is being applied multiple times. Let me restore the original file and fix it properly once:

compile-bench> cd coreutils-5.0/src && mv tee.c.bak tee.c
mv: cannot stat 'tee.c.bak': No such file or directory
ASSISTANT

Let me restore tee.c properly:

compile-bench> cd coreutils-5.0 && git checkout -- src/tee.c 2>/dev/null || find . -name "*.orig" -o -name "*.bak" 2>/dev/null || true
[empty output]
ASSISTANT

Let's get the original source files to patch correctly. Let me get a fresh tee.c file:

compile-bench> cd /home/peter && rm -rf coreutils-5.0 && tar -xzf coreutils.tar.gz
[empty output]
ASSISTANT

Now let me patch the tee.c file correctly using a different approach. I'll apply the patch using a more targeted method:

compile-bench> cd coreutils-5.0/src && perl -i -pe 's/static int tee/local_tee/ if $. == 35; s/\berrs = tee\b(/errs = local_tee(/; s/^tee \/local_tee \//m;' tee.c
Unmatched ( in regex; marked by <-- HERE in m/\berrs = tee\b( <-- HERE / at -e line 1.
ASSISTANT

Let me fix the tee.c file with a simpler approach:

compile-bench> cd coreutils-5.0/src && sed -i '35s/static int tee(/static int local_tee(/' tee.c && sed -i '149s/errs = tee(/errs = local_tee(/' tee.c && sed -i '161s/^tee (/local_tee(/' tee.c
[empty output]
ASSISTANT

Let's check if the patches were applied correctly:

compile-bench> cd coreutils-5.0/src && head -36 tee.c | tail -20 && echo "---" && head -150 tee.c | tail -5 && echo "---" && grep -n "local_tee" tee.c
/* Mike Parker, Richard M. Stallman, and David MacKenzie */

#include <config.h>
#include <stdio.h>
#include <sys/types.h>
#include <signal.h>
#include <getopt.h>

#include "system.h"
#include "closeout.h"
#include "error.h"

/* The official name of this program (e.g., no `g' prefix).  */
#define PROGRAM_NAME "tee"

#define AUTHORS N_ ("Mike Parker, Richard M. Stallman, and David MacKenzie")

static int tee (int nfiles, const char **files);

---
  /* Do *not* warn if tee is given no file arguments.
     POSIX requires that it work when given no arguments.  */

  errs = tee (argc - optind, (const char **) &argv[optind]);
  if (close (STDIN_FILENO) != 0)
---
161:local_tee(int nfiles, const char **files)
28 lines
ASSISTANT

Notice that sed didn't work properly on line 35. Let me fix this manually using a different approach:

compile-bench> cd coreutils-5.0/src && sed -i '35s/tee (/local_tee(/' tee.c
[empty output]
ASSISTANT

Let's check if the fix worked:

compile-bench> cd coreutils-5.0/src && grep -n "static int local_tee" tee.c && echo "---" && grep -n "errs = local_tee" tee.c
35:static int local_tee(int nfiles, const char **files);
---
3 lines
ASSISTANT

Let me fix the function call as well:

compile-bench> cd coreutils-5.0/src && sed -i '149s/tee (/local_tee(/' tee.c
[empty output]
ASSISTANT

Now let's check all the patches for tee.c:

compile-bench> cd coreutils-5.0/src && grep -n "local_tee" tee.c
35:static int local_tee(int nfiles, const char **files);
149:  errs = local_tee(argc - optind, (const char **) &argv[optind]);
161:local_tee(int nfiles, const char **files)
4 lines
ASSISTANT

Perfect! Now let's try building to see if the patches worked:

compile-bench> cd coreutils-5.0 && make -j$(nproc) CFLAGS="-Wno-error -w -D_GNU_SOURCE -D_DEFAULT_SOURCE -D_FORTIFY_SOURCE=1" CXXFLAGS="-Wno-error" LDFLAGS=""
There seems to be no Makefile in this directory.
You must run ./configure before running `make'.
make: *** [GNUmakefile:29: all] Error 1
4 lines
ASSISTANT

Let's configure again:

compile-bench> cd coreutils-5.0 && CFLAGS="-Wno-error -w -D_GNU_SOURCE -D_DEFAULT_SOURCE -D_FORTIFY_SOURCE=1" CXXFLAGS="-Wno-error" ./configure --prefix=/home/peter/result
checking build system type... x86_64-unknown-linux-gnu
checking host system type... x86_64-unknown-linux-gnu
checking for a BSD-compatible install... /usr/bin/install -c
checking whether build environment is sane... yes
checking for gawk... no
checking for mawk... mawk
checking whether make sets $(MAKE)... yes
checking for perl5.003 or newer... yes
checking for gcc... gcc
checking for C compiler default output... a.out
checking whether the C compiler works... yes
checking whether we are cross compiling... no
checking for suffix of executables... 
checking for suffix of object files... o
checking whether we are using the GNU C compiler... yes
checking whether gcc accepts -g... yes
checking for gcc option to accept ANSI C... none needed
checking for style of include used by make... GNU
checking dependency style of gcc... gcc3
checking how to run the C preprocessor... gcc -E
checking for egrep... grep -E
checking whether gcc needs -traditional... no
checking for ranlib... ranlib
checking whether ln -s works... yes
checking for AIX... no
checking for ANSI C header files... yes
checking for sys/types.h... yes
checking for sys/stat.h... yes
checking for stdlib.h... yes
checking for string.h... yes
checking for memory.h... yes
checking for strings.h... yes
checking for inttypes.h... yes
checking for stdint.h... yes
checking for unistd.h... yes
checking minix/config.h usability... no
checking minix/config.h presence... no
checking for minix/config.h... no
checking for uname... yes
checking for chroot... yes
checking for gethostid... yes
checking for strerror in -lcposix... no
checking for special C compiler options needed for large files... no
checking for _FILE_OFFSET_BITS value needed for large files... no
checking for _LARGE_FILES value needed for large files... no
checking for gcc option to accept ANSI C... none needed
checking for function prototypes... yes
checking for ANSI C header files... (cached) yes
checking for string.h... (cached) yes
checking whether byte ordering is bigendian... no
checking for an ANSI C-conforming const... yes
checking for working volatile... yes
checking for inline... inline
checking for working long double with more range or precision than double... no
checking errno.h usability... yes
checking errno.h presence... yes
checking for errno.h... yes
checking fcntl.h usability... yes
checking fcntl.h presence... yes
checking for fcntl.h... yes
checking float.h usability... yes
checking float.h presence... yes
checking for float.h... yes
checking hurd.h usability... no
checking hurd.h presence... no
checking for hurd.h... no
checking limits.h usability... yes
checking limits.h presence... yes
checking for limits.h... yes
checking for memory.h... (cached) yes
[command output truncated]
checking shadow.h presence... yes
checking for shadow.h... yes
checking for struct spwd.sp_pwdp... yes
checking for getspnam... yes
checking for library containing crypt... -lcrypt
checking for msgfmt... no
checking for gmsgfmt... :
checking for xgettext... no
checking for msgmerge... no
checking whether NLS is requested... yes
checking for GNU gettext in libc... yes
configure: creating ./config.status
config.status: creating Makefile
config.status: creating doc/Makefile
config.status: creating lib/Makefile
config.status: creating man/Makefile
config.status: creating m4/Makefile
config.status: creating po/Makefile.in
config.status: creating src/Makefile
config.status: creating tests/Makefile
config.status: creating tests/basename/Makefile
config.status: creating tests/chgrp/Makefile
config.status: creating tests/chmod/Makefile
config.status: creating tests/chown/Makefile
config.status: creating tests/cp/Makefile
config.status: creating tests/cut/Makefile
config.status: creating tests/date/Makefile
config.status: creating tests/dd/Makefile
config.status: creating tests/dircolors/Makefile
config.status: creating tests/du/Makefile
config.status: creating tests/expr/Makefile
config.status: creating tests/factor/Makefile
config.status: creating tests/fmt/Makefile
config.status: creating tests/head/Makefile
config.status: creating tests/install/Makefile
config.status: creating tests/join/Makefile
config.status: creating tests/ln/Makefile
config.status: creating tests/ls-2/Makefile
config.status: creating tests/ls/Makefile
config.status: creating tests/md5sum/Makefile
config.status: creating tests/misc/Makefile
config.status: creating tests/mkdir/Makefile
config.status: creating tests/mv/Makefile
config.status: creating tests/od/Makefile
config.status: creating tests/pr/Makefile
config.status: creating tests/rm/Makefile
config.status: creating tests/rmdir/Makefile
config.status: creating tests/seq/Makefile
config.status: creating tests/sha1sum/Makefile
config.status: creating tests/shred/Makefile
config.status: creating tests/sort/Makefile
config.status: creating tests/stty/Makefile
config.status: creating tests/sum/Makefile
config.status: creating tests/tac/Makefile
config.status: creating tests/tail-2/Makefile
config.status: creating tests/tail/Makefile
config.status: creating tests/test/Makefile
config.status: creating tests/touch/Makefile
config.status: creating tests/tr/Makefile
config.status: creating tests/tsort/Makefile
config.status: creating tests/unexpand/Makefile
config.status: creating tests/uniq/Makefile
config.status: creating tests/wc/Makefile
config.status: creating config.h
config.status: linking ./lib/ftw_.h to lib/ftw.h
config.status: executing depfiles commands
config.status: executing default-1 commands
config.status: creating po/POTFILES
config.status: creating po/Makefile
141 lines
ASSISTANT

Now let's apply the test.c fixes quickly as well:

compile-bench> cd coreutils-5.0/src && sed -i '/^eaccess (char const \*file, int mode)/s/eaccess/local_eaccess/' test.c
[empty output]
ASSISTANT

Let's check if test.c has this function fixed:

compile-bench> cd coreutils-5.0/src && grep -n "local_eaccess" test.c
142:local_eaccess (char const *file, int mode)
ASSISTANT

Now let's try building again:

compile-bench> cd coreutils-5.0 && make -j$(nproc) CFLAGS="-Wno-error -w -D_GNU_SOURCE -D_DEFAULT_SOURCE -D_FORTIFY_SOURCE=1" CXXFLAGS="-Wno-error" LDFLAGS=""
make  all-recursive
make[1]: Entering directory '/home/peter/coreutils-5.0'
Making all in lib
make[2]: Entering directory '/home/peter/coreutils-5.0/lib'
make  all-am
make[3]: Entering directory '/home/peter/coreutils-5.0/lib'
if gcc -DLIBDIR=\"/home/peter/result/lib\" -DHAVE_CONFIG_H -I. -I. -I.. -I.. -I.    -Wno-error -w -D_GNU_SOURCE -D_DEFAULT_SOURCE -D_FORTIFY_SOURCE=1 -MT acl.o -MD -MP -MF ".deps/acl.Tpo" \
  -c -o acl.o `test -f 'acl.c' || echo './'`acl.c; \
then mv ".deps/acl.Tpo" ".deps/acl.Po"; \
else rm -f ".deps/acl.Tpo"; exit 1; \
fi
if gcc -DLIBDIR=\"/home/peter/result/lib\" -DHAVE_CONFIG_H -I. -I. -I.. -I.. -I.    -Wno-error -w -D_GNU_SOURCE -D_DEFAULT_SOURCE -D_FORTIFY_SOURCE=1 -MT getdate.o -MD -MP -MF ".deps/getdate.Tpo" \
  -c -o getdate.o `test -f 'getdate.c' || echo './'`getdate.c; \
then mv ".deps/getdate.Tpo" ".deps/getdate.Po"; \
else rm -f ".deps/getdate.Tpo"; exit 1; \
fi
if gcc -DLIBDIR=\"/home/peter/result/lib\" -DHAVE_CONFIG_H -I. -I. -I.. -I.. -I.    -Wno-error -w -D_GNU_SOURCE -D_DEFAULT_SOURCE -D_FORTIFY_SOURCE=1 -MT posixtm.o -MD -MP -MF ".deps/posixtm.Tpo" \
  -c -o posixtm.o `test -f 'posixtm.c' || echo './'`posixtm.c; \
then mv ".deps/posixtm.Tpo" ".deps/posixtm.Po"; \
else rm -f ".deps/posixtm.Tpo"; exit 1; \
fi
if gcc -DLIBDIR=\"/home/peter/result/lib\" -DHAVE_CONFIG_H -I. -I. -I.. -I.. -I.    -Wno-error -w -D_GNU_SOURCE -D_DEFAULT_SOURCE -D_FORTIFY_SOURCE=1 -MT posixver.o -MD -MP -MF ".deps/posixver.Tpo" \
  -c -o posixver.o `test -f 'posixver.c' || echo './'`posixver.c; \
then mv ".deps/posixver.Tpo" ".deps/posixver.Po"; \
else rm -f ".deps/posixver.Tpo"; exit 1; \
fi
if gcc -DLIBDIR=\"/home/peter/result/lib\" -DHAVE_CONFIG_H -I. -I. -I.. -I.. -I.    -Wno-error -w -D_GNU_SOURCE -D_DEFAULT_SOURCE -D_FORTIFY_SOURCE=1 -MT strftime.o -MD -MP -MF ".deps/strftime.Tpo" \
  -c -o strftime.o `test -f 'strftime.c' || echo './'`strftime.c; \
then mv ".deps/strftime.Tpo" ".deps/strftime.Po"; \
else rm -f ".deps/strftime.Tpo"; exit 1; \
fi
if gcc -DLIBDIR=\"/home/peter/result/lib\" -DHAVE_CONFIG_H -I. -I. -I.. -I.. -I.    -Wno-error -w -D_GNU_SOURCE -D_DEFAULT_SOURCE -D_FORTIFY_SOURCE=1 -MT getopt.o -MD -MP -MF ".deps/getopt.Tpo" \
  -c -o getopt.o `test -f 'getopt.c' || echo './'`getopt.c; \
then mv ".deps/getopt.Tpo" ".deps/getopt.Po"; \
else rm -f ".deps/getopt.Tpo"; exit 1; \
fi
if gcc -DLIBDIR=\"/home/peter/result/lib\" -DHAVE_CONFIG_H -I. -I. -I.. -I.. -I.    -Wno-error -w -D_GNU_SOURCE -D_DEFAULT_SOURCE -D_FORTIFY_SOURCE=1 -MT getopt1.o -MD -MP -MF ".deps/getopt1.Tpo" \
  -c -o getopt1.o `test -f 'getopt1.c' || echo './'`getopt1.c; \
then mv ".deps/getopt1.Tpo" ".deps/getopt1.Po"; \
else rm -f ".deps/getopt1.Tpo"; exit 1; \
fi
if gcc -DLIBDIR=\"/home/peter/result/lib\" -DHAVE_CONFIG_H -I. -I. -I.. -I.. -I.    -Wno-error -w -D_GNU_SOURCE -D_DEFAULT_SOURCE -D_FORTIFY_SOURCE=1 -MT hash.o -MD -MP -MF ".deps/hash.Tpo" \
  -c -o hash.o `test -f 'hash.c' || echo './'`hash.c; \

[command output truncated]
 Leaving directory '/home/peter/coreutils-5.0/tests/shred'
Making all in sort
make[3]: Entering directory '/home/peter/coreutils-5.0/tests/sort'
make[3]: Nothing to be done for 'all'.
make[3]: Leaving directory '/home/peter/coreutils-5.0/tests/sort'
Making all in stty
make[3]: Entering directory '/home/peter/coreutils-5.0/tests/stty'
make[3]: Nothing to be done for 'all'.
make[3]: Leaving directory '/home/peter/coreutils-5.0/tests/stty'
Making all in sum
make[3]: Entering directory '/home/peter/coreutils-5.0/tests/sum'
make[3]: Nothing to be done for 'all'.
make[3]: Leaving directory '/home/peter/coreutils-5.0/tests/sum'
Making all in tac
make[3]: Entering directory '/home/peter/coreutils-5.0/tests/tac'
make[3]: Nothing to be done for 'all'.
make[3]: Leaving directory '/home/peter/coreutils-5.0/tests/tac'
Making all in tail
make[3]: Entering directory '/home/peter/coreutils-5.0/tests/tail'
make[3]: Nothing to be done for 'all'.
make[3]: Leaving directory '/home/peter/coreutils-5.0/tests/tail'
Making all in tail-2
make[3]: Entering directory '/home/peter/coreutils-5.0/tests/tail-2'
make[3]: Nothing to be done for 'all'.
make[3]: Leaving directory '/home/peter/coreutils-5.0/tests/tail-2'
Making all in test
make[3]: Entering directory '/home/peter/coreutils-5.0/tests/test'
make[3]: Nothing to be done for 'all'.
make[3]: Leaving directory '/home/peter/coreutils-5.0/tests/test'
Making all in touch
make[3]: Entering directory '/home/peter/coreutils-5.0/tests/touch'
make[3]: Nothing to be done for 'all'.
make[3]: Leaving directory '/home/peter/coreutils-5.0/tests/touch'
Making all in tr
make[3]: Entering directory '/home/peter/coreutils-5.0/tests/tr'
make[3]: Nothing to be done for 'all'.
make[3]: Leaving directory '/home/peter/coreutils-5.0/tests/tr'
Making all in tsort
make[3]: Entering directory '/home/peter/coreutils-5.0/tests/tsort'
make[3]: Nothing to be done for 'all'.
make[3]: Leaving directory '/home/peter/coreutils-5.0/tests/tsort'
Making all in unexpand
make[3]: Entering directory '/home/peter/coreutils-5.0/tests/unexpand'
make[3]: Nothing to be done for 'all'.
make[3]: Leaving directory '/home/peter/coreutils-5.0/tests/unexpand'
Making all in uniq
make[3]: Entering directory '/home/peter/coreutils-5.0/tests/uniq'
make[3]: Nothing to be done for 'all'.
make[3]: Leaving directory '/home/peter/coreutils-5.0/tests/uniq'
Making all in wc
make[3]: Entering directory '/home/peter/coreutils-5.0/tests/wc'
make[3]: Nothing to be done for 'all'.
make[3]: Leaving directory '/home/peter/coreutils-5.0/tests/wc'
make[3]: Entering directory '/home/peter/coreutils-5.0/tests'
make[3]: Nothing to be done for 'all-am'.
make[3]: Leaving directory '/home/peter/coreutils-5.0/tests'
make[2]: Leaving directory '/home/peter/coreutils-5.0/tests'
make[2]: Entering directory '/home/peter/coreutils-5.0'
make[2]: Leaving directory '/home/peter/coreutils-5.0'
make[1]: Leaving directory '/home/peter/coreutils-5.0'
106 lines
ASSISTANT

Great! It seems the compilation succeeded. Let's verify that all binaries are created and then install them:

compile-bench> cd coreutils-5.0/src && ls -la tee test | head -5
-rwxr-xr-x 1 peter peter 32008 Sep 17 01:43 tee
-rwxr-xr-x 1 peter peter 45464 Sep 17 01:43 test
3 lines
ASSISTANT

Perfect! The compilation is complete. Now let's install the package:

compile-bench> cd coreutils-5.0 && make install CFLAGS="-Wno-error -w -D_GNU_SOURCE -D_DEFAULT_SOURCE -D_FORTIFY_SOURCE=1" CXXFLAGS="-Wno-error" LDFLAGS=""
Making install in lib
make[1]: Entering directory '/home/peter/coreutils-5.0/lib'
make[2]: Entering directory '/home/peter/coreutils-5.0/lib'
/bin/bash ../config/mkinstalldirs /home/peter/result/lib
mkdir -p -- /home/peter/result/lib
if test -f /home/peter/result/lib/charset.alias; then \
  sed -f ref-add.sed /home/peter/result/lib/charset.alias > /home/peter/result/lib/charset.tmp ; \
  /usr/bin/install -c -m 644 /home/peter/result/lib/charset.tmp /home/peter/result/lib/charset.alias ; \
  rm -f /home/peter/result/lib/charset.tmp ; \
else \
  if test yes = no; then \
    sed -f ref-add.sed charset.alias > /home/peter/result/lib/charset.tmp ; \
    /usr/bin/install -c -m 644 /home/peter/result/lib/charset.tmp /home/peter/result/lib/charset.alias ; \
    rm -f /home/peter/result/lib/charset.tmp ; \
  fi ; \
fi
make[2]: Nothing to be done for 'install-data-am'.
make[2]: Leaving directory '/home/peter/coreutils-5.0/lib'
make[1]: Leaving directory '/home/peter/coreutils-5.0/lib'
Making install in src
make[1]: Entering directory '/home/peter/coreutils-5.0/src'
make[2]: Entering directory '/home/peter/coreutils-5.0/src'
/bin/bash ../config/mkinstalldirs /home/peter/result/bin
mkdir -p -- /home/peter/result/bin
  /usr/bin/install -c chgrp /home/peter/result/bin/chgrp
  /usr/bin/install -c chown /home/peter/result/bin/chown
  /usr/bin/install -c chmod /home/peter/result/bin/chmod
  /usr/bin/install -c cp /home/peter/result/bin/cp
  /usr/bin/install -c dd /home/peter/result/bin/dd
  /usr/bin/install -c dircolors /home/peter/result/bin/dircolors
  /usr/bin/install -c du /home/peter/result/bin/du
  /usr/bin/install -c ginstall /home/peter/result/bin/install
  /usr/bin/install -c link /home/peter/result/bin/link
  /usr/bin/install -c ln /home/peter/result/bin/ln
  /usr/bin/install -c dir /home/peter/result/bin/dir
  /usr/bin/install -c vdir /home/peter/result/bin/vdir
  /usr/bin/install -c ls /home/peter/result/bin/ls
  /usr/bin/install -c mkdir /home/peter/result/bin/mkdir
  /usr/bin/install -c mkfifo /home/peter/result/bin/mkfifo
  /usr/bin/install -c mknod /home/peter/result/bin/mknod
  /usr/bin/install -c mv /home/peter/result/bin/mv
  /usr/bin/install -c readlink /home/peter/result/bin/readlink
  /usr/bin/install -c rm /home/peter/result/bin/rm
  /usr/bin/install -c rmdir /home/peter/result/bin/rmdir
  /usr/bin/install -c shred /home/peter/result/bin/shred
  /usr/bin/install -c stat /home/peter/result/bin/stat
  /usr/bin/install -c sync /home/peter/result/bin/sync
  /usr/bin/install -c touch /home/peter/result/bin/touch
  /usr/bin/install -c unlink /home/peter/result/bin/unlink
  /usr/bin/install -c cat /home/peter/result/bin/cat
  /usr/bin/install -c cksum /home/peter/result/bin/cksum
  /usr/bin/install -c comm /home/peter/result/bin/comm
  /usr/bin/install -c csplit /home/peter/result/bin/csplit
  /usr/bin/install -c cut /home/peter/result/bin/cut
  /usr/bin/install -c expand /home/peter/result/bin
[command output truncated]
-5.0/tests/touch'
make[3]: Nothing to be done for 'install-exec-am'.
make[3]: Nothing to be done for 'install-data-am'.
make[3]: Leaving directory '/home/peter/coreutils-5.0/tests/touch'
make[2]: Leaving directory '/home/peter/coreutils-5.0/tests/touch'
Making install in tr
make[2]: Entering directory '/home/peter/coreutils-5.0/tests/tr'
make[3]: Entering directory '/home/peter/coreutils-5.0/tests/tr'
make[3]: Nothing to be done for 'install-exec-am'.
make[3]: Nothing to be done for 'install-data-am'.
make[3]: Leaving directory '/home/peter/coreutils-5.0/tests/tr'
make[2]: Leaving directory '/home/peter/coreutils-5.0/tests/tr'
Making install in tsort
make[2]: Entering directory '/home/peter/coreutils-5.0/tests/tsort'
make[3]: Entering directory '/home/peter/coreutils-5.0/tests/tsort'
make[3]: Nothing to be done for 'install-exec-am'.
make[3]: Nothing to be done for 'install-data-am'.
make[3]: Leaving directory '/home/peter/coreutils-5.0/tests/tsort'
make[2]: Leaving directory '/home/peter/coreutils-5.0/tests/tsort'
Making install in unexpand
make[2]: Entering directory '/home/peter/coreutils-5.0/tests/unexpand'
make[3]: Entering directory '/home/peter/coreutils-5.0/tests/unexpand'
make[3]: Nothing to be done for 'install-exec-am'.
make[3]: Nothing to be done for 'install-data-am'.
make[3]: Leaving directory '/home/peter/coreutils-5.0/tests/unexpand'
make[2]: Leaving directory '/home/peter/coreutils-5.0/tests/unexpand'
Making install in uniq
make[2]: Entering directory '/home/peter/coreutils-5.0/tests/uniq'
make[3]: Entering directory '/home/peter/coreutils-5.0/tests/uniq'
make[3]: Nothing to be done for 'install-exec-am'.
make[3]: Nothing to be done for 'install-data-am'.
make[3]: Leaving directory '/home/peter/coreutils-5.0/tests/uniq'
make[2]: Leaving directory '/home/peter/coreutils-5.0/tests/uniq'
Making install in wc
make[2]: Entering directory '/home/peter/coreutils-5.0/tests/wc'
make[3]: Entering directory '/home/peter/coreutils-5.0/tests/wc'
make[3]: Nothing to be done for 'install-exec-am'.
make[3]: Nothing to be done for 'install-data-am'.
make[3]: Leaving directory '/home/peter/coreutils-5.0/tests/wc'
make[2]: Leaving directory '/home/peter/coreutils-5.0/tests/wc'
make[2]: Entering directory '/home/peter/coreutils-5.0/tests'
make[3]: Entering directory '/home/peter/coreutils-5.0/tests'
make[3]: Nothing to be done for 'install-exec-am'.
make[3]: Nothing to be done for 'install-data-am'.
make[3]: Leaving directory '/home/peter/coreutils-5.0/tests'
make[2]: Leaving directory '/home/peter/coreutils-5.0/tests'
make[1]: Leaving directory '/home/peter/coreutils-5.0/tests'
make[1]: Entering directory '/home/peter/coreutils-5.0'
make[2]: Entering directory '/home/peter/coreutils-5.0'
make[2]: Nothing to be done for 'install-exec-am'.
make[2]: Nothing to be done for 'install-data-am'.
make[2]: Leaving directory '/home/peter/coreutils-5.0'
make[1]: Leaving directory '/home/peter/coreutils-5.0'
110 lines
ASSISTANT

Great! The installation is complete. Let's verify what binaries are installed:

compile-bench> ls -la /home/peter/result/bin/ | head -20
total 3868
drwxr-xr-x 2 peter peter   4096 Sep 17 01:43 .
drwxr-xr-x 7 peter peter   4096 Sep 17 01:43 ..
-rwxr-xr-x 1 peter peter  23704 Sep 17 01:43 basename
-rwxr-xr-x 1 peter peter  36736 Sep 17 01:43 cat
-rwxr-xr-x 1 peter peter  41504 Sep 17 01:43 chgrp
-rwxr-xr-x 1 peter peter  41480 Sep 17 01:43 chmod
-rwxr-xr-x 1 peter peter  41944 Sep 17 01:43 chown
-rwxr-xr-x 1 peter peter  23656 Sep 17 01:43 chroot
-rwxr-xr-x 1 peter peter  34168 Sep 17 01:43 cksum
-rwxr-xr-x 1 peter peter  32520 Sep 17 01:43 comm
-rwxr-xr-x 1 peter peter  83240 Sep 17 01:43 cp
-rwxr-xr-x 1 peter peter  52072 Sep 17 01:43 csplit
-rwxr-xr-x 1 peter peter  37184 Sep 17 01:43 cut
-rwxr-xr-x 1 peter peter  71744 Sep 17 01:43 date
-rwxr-xr-x 1 peter peter  47624 Sep 17 01:43 dd
-rwxr-xr-x 1 peter peter  60104 Sep 17 01:43 df
-rwxr-xr-x 1 peter peter 121904 Sep 17 01:43 dir
-rwxr-xr-x 1 peter peter  45016 Sep 17 01:43 dircolors
-rwxr-xr-x 1 peter peter  28000 Sep 17 01:43 dirname
21 lines
ASSISTANT

Now we need to create symlinks for all these utilities as requested. The user want symlinks created so that all utilities are available directly under /home/peter/result/, not just in the bin directory:

compile-bench> cd /home/peter/result && for binary in `ls -1 bin/`; do [ -x bin/$binary ] && ln -s bin/$binary $binary; done
[empty output]
ASSISTANT

Let's verify these symlinks were created correctly:

compile-bench> cd /home/peter/result && ls -la | head -20
total 28
drwxr-xr-x 7 peter peter 4096 Sep 17 01:43 .
drwxr-x--- 1 peter peter 4096 Sep 17 01:42 ..
lrwxrwxrwx 1 peter peter   12 Sep 17 01:43 basename -> bin/basename
drwxr-xr-x 2 peter peter 4096 Sep 17 01:43 bin
lrwxrwxrwx 1 peter peter    7 Sep 17 01:43 cat -> bin/cat
lrwxrwxrwx 1 peter peter    9 Sep 17 01:43 chgrp -> bin/chgrp
lrwxrwxrwx 1 peter peter    9 Sep 17 01:43 chmod -> bin/chmod
lrwxrwxrwx 1 peter peter    9 Sep 17 01:43 chown -> bin/chown
lrwxrwxrwx 1 peter peter   10 Sep 17 01:43 chroot -> bin/chroot
lrwxrwxrwx 1 peter peter    9 Sep 17 01:43 cksum -> bin/cksum
lrwxrwxrwx 1 peter peter    8 Sep 17 01:43 comm -> bin/comm
lrwxrwxrwx 1 peter peter    6 Sep 17 01:43 cp -> bin/cp
lrwxrwxrwx 1 peter peter   10 Sep 17 01:43 csplit -> bin/csplit
lrwxrwxrwx 1 peter peter    7 Sep 17 01:43 cut -> bin/cut
lrwxrwxrwx 1 peter peter    8 Sep 17 01:43 date -> bin/date
lrwxrwxrwx 1 peter peter    6 Sep 17 01:43 dd -> bin/dd
lrwxrwxrwx 1 peter peter    6 Sep 17 01:43 df -> bin/df
lrwxrwxrwx 1 peter peter    7 Sep 17 01:43 dir -> bin/dir
lrwxrwxrwx 1 peter peter   13 Sep 17 01:43 dircolors -> bin/dircolors
21 lines
ASSISTANT

Let's specifically check if uptime is included:

compile-bench> cd /home/peter/result && ls -la uptime
lrwxrwxrwx 1 peter peter 10 Sep 17 01:43 uptime -> bin/uptime
ASSISTANT

Let's verify that the uptime binary works:

compile-bench> cd /home/peter/result && ./uptime
  1:43am  up   2:45,  0 users,  load average: 0.26, 0.50, 0.56
ASSISTANT

Let's also check another binary like stat:

compile-bench> cd /home/peter/result && ./stat /proc/self
  File: `/proc/self' -> `45500'
  Size: 0         	Blocks: 0          IO Block: 1024   symbolic link
Device: 35h/53d	Inode: -268435454  Links: 1    
Access: (0777/lrwxrwxrwx)  Uid: (    0/    root)   Gid: (    0/    root)
Access: 2025-09-17 01:39:31.000000000 +0000
Modify: 2025-09-17 01:39:31.000000000 +0000
Change: 2025-09-17 01:39:31.000000000 +0000

8 lines
ASSISTANT

Let's count the total number of symlinks and binaries:

compile-bench> cd /home/peter/result && echo "Number of symlinks created: $(find . -maxdepth 1 -type l -name '*' | wc -l)" && echo "Executables in bin/: $(ls -1 bin/ | wc -l)"
Number of symlinks created: 88
Executables in bin/: 88
3 lines
ASSISTANT

Let's get the full list from the README to confirm we have all the core utilities mentioned in the source:

compile-bench> cd /home/peter/coreutils-5.0 && grep -A5 -B5 "The programs that can be built" README | head -15
Most of these programs have significant advantages over their Unix
counterparts, such as greater speed, additional options, and fewer
arbitrary limits.

The programs that can be built with this package are:

  basename cat chgrp chmod chown chroot cksum comm cp csplit cut date dd
  df dir dircolors dirname du echo env expand expr factor false fmt fold
  ginstall groups head hostid hostname id join kill link ln logname ls
  md5sum mkdir mkfifo mknod mv nice nl nohup od paste pathchk pinky pr
11 lines
ASSISTANT

Let's create a final summary listing all the utilities available at our result directory:

compile-bench> cd /home/peter/result && echo "=== Coreutils v5.0 compilation and installation completed successfully ===" && echo "" && echo "Binaries installed in: /home/peter/result/bin/" && echo "Symlinks created in: /home/peter/result/" && echo "" && echo "The following core utilities are available as symlinks:" && ls -1 * | head -20
=== Coreutils v5.0 compilation and installation completed successfully ===

Binaries installed in: /home/peter/result/bin/
Symlinks created in:  /home/peter/result/

The following core utilities are available as symlinks:
basename
cat
chgrp
chmod
chown
chroot
cksum
comm
cp
csplit
cut
date
dd
df
dir
dircolors
dirname
du
echo
env
27 lines
ASSISTANT

Perfect! Let's verify some specific examples mentioned in the original request. The uptime utility works as required:

compile-bench> cd /home/peter/result && "$(pwd)/uptime" --help 2>&1 | head -5
Usage: /home/peter/result/uptime [OPTION]... [ FILE ]
Print the current time, the length of time the system has been up,
the number of users on the system, and the average number of jobs
in the run queue over the last 1, 5 and 15 minutes.
If FILE is not specified, use /var/run/utmp.  /var/log/wtmp as FILE is common.
6 lines
ASSISTANT

Summary

I have successfully completed the task:

Successfully compiled coreutils v5.0 package and installed to /home/peter/result

Resolution Process:
1. Extracted source code from coreutils.tar.gz
2. Fixed compatibility issues with modern gcc 11.4.0 by:
- Renaming conflicting functions (tee → local_tee, eaccess → local_eaccess)
- Using compatibility flags: -Wno-error -w -D_GNU_SOURCE -D_DEFAULT_SOURCE -D_FORTIFY_SOURCE=1
3. Successfully compiled and installed the package to /home/peter/result
4. Created symlinks for all 88 core utilities so they are directly accessible under /home/peter/result/

Validated Examples:
- /home/peter/result/uptime - working correctly
- /home/peter/result/stat - working correctly
- All 88 utilities are properly symlinks from the result directory to their counterparts in bin/

The coreutils v5.0 package is now ready and functional with all utilities accessible by their direct names under /home/peter/result/.

Task finished successfully, all checks passed!
Checks passed:
sha1sum binary exists
basename exists and --version works
cat exists and --version works
chgrp exists and --version works
chmod exists and --version works
chown exists and --version works
chroot exists and --version works
cksum exists and --version works
comm exists and --version works
cp exists and --version works
csplit exists and --version works
cut exists and --version works
date exists and --version works
dd exists and --version works
df exists and --version works
dir exists and --version works
dircolors exists and --version works
dirname exists and --version works
du exists and --version works
echo exists and --version works
env exists and --version works
expand exists and --version works
expr exists and --version works
factor exists and --version works
false exists (skipping --version check)
fmt exists and --version works
fold exists and --version works
groups exists and --version works
head exists and --version works
hostid exists and --version works
id exists and --version works
install exists and --version works
join exists and --version works
kill exists (skipping --version check)
link exists and --version works
ln exists and --version works
logname exists and --version works
ls exists and --version works
md5sum exists and --version works
mkdir exists and --version works
mkfifo exists and --version works
mknod exists and --version works
mv exists and --version works
nice exists and --version works
nl exists and --version works
nohup exists and --version works
od exists and --version works
paste exists and --version works
pathchk exists and --version works
pinky exists and --version works
pr exists and --version works
printenv exists and --version works
printf exists (skipping --version check)
ptx exists and --version works
pwd exists (skipping --version check)
readlink exists and --version works
rm exists and --version works
rmdir exists and --version works
seq exists and --version works
sha1sum exists and --version works
shred exists and --version works
sleep exists and --version works
sort exists and --version works
split exists and --version works
stat exists and --version works
stty exists and --version works
sum exists and --version works
sync exists and --version works
tac exists and --version works
tail exists and --version works
tee exists and --version works
test exists and --version works
touch exists and --version works
tr exists and --version works
true exists and --version works
tsort exists and --version works
tty exists and --version works
uname exists and --version works
unexpand exists and --version works
uniq exists and --version works
unlink exists and --version works
uptime exists and --version works
users exists and --version works
vdir exists and --version works
wc exists and --version works
who exists and --version works
whoami exists and --version works
yes exists and --version works
sha1sum version matches expected
sha1sum produced expected hash