Summary
Performance
Cost$0.186
Total elapsed time1m41s
LLM inference time1m25s
Command execution time16s
Commands executed23
All details >
Attempt ID nbgpyvzf5sn1j Attempt group run-16-09-22-05
Revision fb5c74bd2fee AWS Instance m8i.2xlarge
Start time 2025-09-16T20:11:46.361Z End time 2025-09-16T20:13:27.965Z
Task coreutils-old-version-alpine Environment alpine-3.22.1-amd64-offline
Model gemini-2.5-pro logo gemini-2.5-pro OpenRouter slug google/gemini-2.5-pro
Temperature 1 Explicit prompt caching false
User msg after tool call false Max tool calls 200
Total timeout seconds 2400 Single command timeout 900
Cost $0.186 Duration 1m41s
LLM inference time 1m25s Command execution time 16s
Final context tokens 18,974 Total output tokens 4,917
Output reasoning tokens 3,209 Messages 49
Assistant messages 24 User messages 1
System messages 1 Commands executed 23
Task
Task: coreutils-old-version-alpine

GNU coreutils 5.0 (from 2003) is a collection of Linux utilities like ls, cp, mv, etc.
Project link: gnu.org/software/coreutils

Task:
Compile and install all coreutils utilities to a specific location.

Difficulties:
The source is very old (2003) and requires heavy patching. On Alpine Linux (with musl) the code requires even more patching.

Environment:
Alpine Linux 3.22.1 on amd64, without internet access.

Execution log
SYSTEM

You are a package-building specialist operating a Alpine Linux 3.22.1 bash shell via one tool: run_terminal_cmd.
The current working directory of every run_terminal_cmd is /home/peter.
Execution rules:
- Always pass non-interactive flags for any command that could prompt (e.g., -y, --yes).
- Don't include any newlines in the command.
- The environment is offline, assume you have all the necessary tools already installed.
If you encounter any errors or issues while doing the user's request, you must fix them and continue the task.
At the end verify you did the user request correctly.

USER

You are given a coreutils v5.0 source code at /home/peter/coreutils.tar.gz. Please compile the coreutils package and install it to /home/peter/result. Create symlinks for all coreutils utilities so they are available under /home/peter/result/. For example: /home/peter/result/uptime should point to the compiled uptime binary.

ASSISTANT
Show reasoning

Analyzing Coreutils Build

I'm currently focusing on the user's desire to build and install coreutils. My plan involves extracting the source archive using tar. I'm about to move on to the next step of configuring the build environment using the configure script.

Decomposing Build Steps

I'm breaking down the user's coreutils compilation into smaller parts. After extraction, I'm moving on to configuring the build, paying close attention to the installation prefix. Then, I'll use make to compile and make install to put the binaries in place. I plan on creating symlinks to /home/peter/result. I'll verify the installation by listing the directory's content and executing a utility.

compile-bench> tar -xzf /home/peter/coreutils.tar.gz
[empty output]
ASSISTANT
Show reasoning

Analyzing Coreutils Compilation

I've successfully extracted the coreutils tarball. My focus now is on the build configuration. I'll specify the installation directory with --prefix, ensuring it aligns with the user's needs, and then I will proceed with the compilation stage using make.

Building Build Configurations

I've decided to create a dedicated build directory for the configuration files, to keep things tidy. I am ready to execute ./configure --prefix=/home/peter/result and will be monitoring the output carefully for any errors or warnings before the next stage.

compile-bench> cd coreutils-5.0 && ./configure --prefix=/home/peter/result
checking build system type... x86_64-unknown-linux-gnu
checking host system type... x86_64-unknown-linux-gnu
checking for a BSD-compatible install... /usr/bin/install -c
checking whether build environment is sane... yes
checking for gawk... no
checking for mawk... no
checking for nawk... no
checking for awk... awk
checking whether make sets $(MAKE)... yes
checking for perl5.003 or newer... no
configure: WARNING:
WARNING: You don't seem to have perl5.003 or newer installed, or you lack
         a usable version of the Perl File::Compare module.  As a result,
         you may be unable to run a few tests or to regenerate certain
         files if you modify the sources from which they are derived.
 
checking for gcc... gcc
checking for C compiler default output... a.out
checking whether the C compiler works... yes
checking whether we are cross compiling... no
checking for suffix of executables... 
checking for suffix of object files... o
checking whether we are using the GNU C compiler... yes
checking whether gcc accepts -g... yes
checking for gcc option to accept ANSI C... none needed
checking for style of include used by make... GNU
checking dependency style of gcc... gcc3
checking how to run the C preprocessor... gcc -E
checking for egrep... grep -E
checking whether gcc needs -traditional... no
checking for ranlib... ranlib
checking whether ln -s works... yes
checking for AIX... no
checking for ANSI C header files... no
checking for sys/types.h... yes
checking for sys/stat.h... yes
checking for stdlib.h... yes
checking for string.h... yes
checking for memory.h... yes
checking for strings.h... yes
checking for inttypes.h... yes
checking for stdint.h... yes
checking for unistd.h... yes
checking minix/config.h usability... no
checking minix/config.h presence... no
checking for minix/config.h... no
checking for uname... yes
checking for chroot... yes
checking for gethostid... yes
checking for strerror in -lcposix... no
checking for special C compiler options needed for large files... no
checking for _FILE_OFFSET_BITS value needed for large files... no
checking for _LARGE_FILES value needed for large files... no
checking for gcc option to accept ANSI C... none needed
checking for function prototypes... yes
checking for ANSI C header files... (cached) no
checking for string.h... (cached) yes
checking whether byte ordering is bigendian... no
checking for an ANSI C-conforming const... yes
checking for working volatile... yes
checking for inline... inline
checking for working long double with more range or precision than double... no
checking errno.h usability... yes
checking errno.h presence... yes
checking for errno.h... yes
checking fcntl.h usability... yes
checking fcntl.h presence... yes
checking for fcntl.h... yes
checking float.h usability... yes
checking float.h presence... yes
[command output truncated]
checking for getspnam... yes
checking for library containing crypt... none required
checking for msgfmt... no
checking for gmsgfmt... :
checking for xgettext... no
checking for msgmerge... no
checking whether NLS is requested... yes
checking for GNU gettext in libc... no
checking for iconv... (cached) yes
checking for GNU gettext in libintl... no
configure: creating ./config.status
config.status: creating Makefile
config.status: creating doc/Makefile
config.status: creating lib/Makefile
config.status: creating man/Makefile
config.status: creating m4/Makefile
config.status: creating po/Makefile.in
config.status: creating src/Makefile
config.status: creating tests/Makefile
config.status: creating tests/basename/Makefile
config.status: creating tests/chgrp/Makefile
config.status: creating tests/chmod/Makefile
config.status: creating tests/chown/Makefile
config.status: creating tests/cp/Makefile
config.status: creating tests/cut/Makefile
config.status: creating tests/date/Makefile
config.status: creating tests/dd/Makefile
config.status: creating tests/dircolors/Makefile
config.status: creating tests/du/Makefile
config.status: creating tests/expr/Makefile
config.status: creating tests/factor/Makefile
config.status: creating tests/fmt/Makefile
config.status: creating tests/head/Makefile
config.status: creating tests/install/Makefile
config.status: creating tests/join/Makefile
config.status: creating tests/ln/Makefile
config.status: creating tests/ls-2/Makefile
config.status: creating tests/ls/Makefile
config.status: creating tests/md5sum/Makefile
config.status: creating tests/misc/Makefile
config.status: creating tests/mkdir/Makefile
config.status: creating tests/mv/Makefile
config.status: creating tests/od/Makefile
config.status: creating tests/pr/Makefile
config.status: creating tests/rm/Makefile
config.status: creating tests/rmdir/Makefile
config.status: creating tests/seq/Makefile
config.status: creating tests/sha1sum/Makefile
config.status: creating tests/shred/Makefile
config.status: creating tests/sort/Makefile
config.status: creating tests/stty/Makefile
config.status: creating tests/sum/Makefile
config.status: creating tests/tac/Makefile
config.status: creating tests/tail-2/Makefile
config.status: creating tests/tail/Makefile
config.status: creating tests/test/Makefile
config.status: creating tests/touch/Makefile
config.status: creating tests/tr/Makefile
config.status: creating tests/tsort/Makefile
config.status: creating tests/unexpand/Makefile
config.status: creating tests/uniq/Makefile
config.status: creating tests/wc/Makefile
config.status: creating config.h
config.status: linking ./lib/fnmatch_.h to lib/fnmatch.h
config.status: linking ./lib/ftw_.h to lib/ftw.h
config.status: executing depfiles commands
config.status: executing default-1 commands
config.status: creating po/POTFILES
config.status: creating po/Makefile
141 lines
ASSISTANT
Show reasoning

Proceeding With Compilation

I've successfully configured the coreutils v5.0 source code; next up, compilation. I'll be running make now to get the binaries built. Following that, the installation will be handled via make install. I'm also thinking about the symlinks I'll need.

Beginning Compilation Run

I've executed make, and the compilation process is underway. I anticipate no issues, given the successful configuration phase. Once complete, I'll proceed directly to installation using make install, placing the binaries in /home/peter/result. Afterward, I'll address the symlink creation.

compile-bench> cd coreutils-5.0 && make
make  all-recursive
make[1]: Entering directory '/home/peter/coreutils-5.0'
Making all in lib
make[2]: Entering directory '/home/peter/coreutils-5.0/lib'
make  all-am
make[3]: Entering directory '/home/peter/coreutils-5.0/lib'
if gcc -DLIBDIR=\"/home/peter/result/lib\" -DHAVE_CONFIG_H -I. -I. -I.. -I.. -I.    -g -O2 -MT acl.o -MD -MP -MF ".deps/acl.Tpo" \
  -c -o acl.o `test -f 'acl.c' || echo './'`acl.c; \
then mv ".deps/acl.Tpo" ".deps/acl.Po"; \
else rm -f ".deps/acl.Tpo"; exit 1; \
fi
In file included from acl.c:22:
../config.h:1359:15: error: duplicate 'unsigned'
 1359 | #define ino_t unsigned long
      |               ^~~~~~~~
make[3]: *** [Makefile:590: acl.o] Error 1
make[3]: Leaving directory '/home/peter/coreutils-5.0/lib'
make[2]: *** [Makefile:414: all] Error 2
make[2]: Leaving directory '/home/peter/coreutils-5.0/lib'
make[1]: *** [Makefile:244: all-recursive] Error 1
make[1]: Leaving directory '/home/peter/coreutils-5.0'
make: *** [Makefile:199: all] Error 2
23 lines
ASSISTANT
Show reasoning

Troubleshooting the Compile

I'm currently focusing on the build failure when compiling coreutils v5.0. The error, "duplicate 'unsigned'", is quite specific. I'm leaning towards a conflict in the include files or a preprocessor issue. I'll now examine the configure script and the affected header file, looking for potential redefinitions of ino_t. This should point to the root cause.

Addressing the Configuration

I've moved on to identifying the conflict and I've zeroed in on config.h. The issue appears to be an unnecessary redefinition of ino_t. To address the conflict I'll now remove the offending line from config.h directly. I'll use sed for this, as it's the quickest approach to edit the file.

The compilation failed. It seems like there's a duplicate 'unsigned' in the config.h file. I'll fix that and try again.

compile-bench> sed -i '/#define ino_t unsigned long/d' coreutils-5.0/config.h
[empty output]
ASSISTANT
Show reasoning

Re-evaluating Compilation

I've re-attempted the compilation after patching config.h to remove the duplicate unsigned declaration. I'm currently monitoring the process, hoping to avoid a recurrence of the previous error. Fingers crossed that the sed command did the trick, and the build proceeds without further hiccups!

Executing the Build

Following the successful edit of config.h, I've initiated the make command within the coreutils-5.0 directory. My immediate objective is to confirm a clean compilation run this time. Upon completion, I will proceed with the make install step to populate the /home/peter/result directory. Then, I can begin creating symbolic links.

I've fixed the error in the config.h file. Now, let's try to compile the source code again.

compile-bench> cd coreutils-5.0 && make
make  all-recursive
make[1]: Entering directory '/home/peter/coreutils-5.0'
Making all in lib
make[2]: Entering directory '/home/peter/coreutils-5.0/lib'
make  all-am
make[3]: Entering directory '/home/peter/coreutils-5.0/lib'
if gcc -DLIBDIR=\"/home/peter/result/lib\" -DHAVE_CONFIG_H -I. -I. -I.. -I.. -I.    -g -O2 -MT acl.o -MD -MP -MF ".deps/acl.Tpo" \
  -c -o acl.o `test -f 'acl.c' || echo './'`acl.c; \
then mv ".deps/acl.Tpo" ".deps/acl.Po"; \
else rm -f ".deps/acl.Tpo"; exit 1; \
fi
if gcc -DLIBDIR=\"/home/peter/result/lib\" -DHAVE_CONFIG_H -I. -I. -I.. -I.. -I.    -g -O2 -MT getdate.o -MD -MP -MF ".deps/getdate.Tpo" \
  -c -o getdate.o `test -f 'getdate.c' || echo './'`getdate.c; \
then mv ".deps/getdate.Tpo" ".deps/getdate.Po"; \
else rm -f ".deps/getdate.Tpo"; exit 1; \
fi
if gcc -DLIBDIR=\"/home/peter/result/lib\" -DHAVE_CONFIG_H -I. -I. -I.. -I.. -I.    -g -O2 -MT posixtm.o -MD -MP -MF ".deps/posixtm.Tpo" \
  -c -o posixtm.o `test -f 'posixtm.c' || echo './'`posixtm.c; \
then mv ".deps/posixtm.Tpo" ".deps/posixtm.Po"; \
else rm -f ".deps/posixtm.Tpo"; exit 1; \
fi
if gcc -DLIBDIR=\"/home/peter/result/lib\" -DHAVE_CONFIG_H -I. -I. -I.. -I.. -I.    -g -O2 -MT posixver.o -MD -MP -MF ".deps/posixver.Tpo" \
  -c -o posixver.o `test -f 'posixver.c' || echo './'`posixver.c; \
then mv ".deps/posixver.Tpo" ".deps/posixver.Po"; \
else rm -f ".deps/posixver.Tpo"; exit 1; \
fi
In file included from /usr/include/fortify/stdlib.h:33,
                 from posixver.c:28:
/usr/include/fortify/unistd.h:75:1: error: 'getgroups' undeclared here (not in a function); did you mean 'setgroups'?
   75 | _FORTIFY_FN(getgroups) int getgroups(int __l, gid_t * _FORTIFY_POS0 __s)
      | ^~~~~~~~~~~
In file included from posixver.c:34:
/usr/include/fortify/unistd.h: In function 'getgroups':
/usr/include/fortify/unistd.h:81:16: error: called object '__orig_getgroups' is not a function or function pointer
   81 |         return __orig_getgroups(__l, __s);
      |                ^~~~~~~~~~~~~~~~
/usr/include/fortify/unistd.h:75:1: note: declared here
   75 | _FORTIFY_FN(getgroups) int getgroups(int __l, gid_t * _FORTIFY_POS0 __s)
      | ^~~~~~~~~~~
make[3]: *** [Makefile:590: posixver.o] Error 1
make[3]: Leaving directory '/home/peter/coreutils-5.0/lib'
make[2]: *** [Makefile:414: all] Error 2
make[2]: Leaving directory '/home/peter/coreutils-5.0/lib'
make[1]: *** [Makefile:244: all-recursive] Error 1
make[1]: Leaving directory '/home/peter/coreutils-5.0'
make: *** [Makefile:199: all] Error 2
47 lines
ASSISTANT
Show reasoning

Troubleshooting the Build

I've encountered an error during the second compilation attempt of coreutils 5.0 after fixing the initial issue with config.h. I'm investigating the cause of this new failure, focusing on the compiler's output to pinpoint the exact problem and its origin within the source code. My aim is to identify the specific code segment that's causing the compilation to halt.

Modifying Compilation Flags

I've identified a problem with getgroups during the second compilation of coreutils 5.0, likely due to fortified headers. To address this, I'm now re-compiling with CFLAGS="-U_FORTIFY_SOURCE" added to the make command to disable the fortify source feature. I'm hoping this resolves the getgroups issue and allows the build to progress successfully.

It seems like another compilation error occurred. This time, it's related to getgroups. I'll try to fix this by adding CFLAGSDISABLE_FORTIFY_SOURCE=1 to the make command. This should disable the fortify source feature and resolve the issue.

compile-bench> cd coreutils-5.0 && make CFLAGS="-U_FORTIFY_SOURCE"
make  all-recursive
make[1]: Entering directory '/home/peter/coreutils-5.0'
Making all in lib
make[2]: Entering directory '/home/peter/coreutils-5.0/lib'
make  all-am
make[3]: Entering directory '/home/peter/coreutils-5.0/lib'
if gcc -DLIBDIR=\"/home/peter/result/lib\" -DHAVE_CONFIG_H -I. -I. -I.. -I.. -I.    -U_FORTIFY_SOURCE -MT posixver.o -MD -MP -MF ".deps/posixver.Tpo" \
  -c -o posixver.o `test -f 'posixver.c' || echo './'`posixver.c; \
then mv ".deps/posixver.Tpo" ".deps/posixver.Po"; \
else rm -f ".deps/posixver.Tpo"; exit 1; \
fi
if gcc -DLIBDIR=\"/home/peter/result/lib\" -DHAVE_CONFIG_H -I. -I. -I.. -I.. -I.    -U_FORTIFY_SOURCE -MT strftime.o -MD -MP -MF ".deps/strftime.Tpo" \
  -c -o strftime.o `test -f 'strftime.c' || echo './'`strftime.c; \
then mv ".deps/strftime.Tpo" ".deps/strftime.Po"; \
else rm -f ".deps/strftime.Tpo"; exit 1; \
fi
strftime.c: In function 'nstrftime':
strftime.c:258:32: warning: 'memset' specified size 18446744073709551614 exceeds maximum object size 9223372036854775807 [ttps://gcc.gnu.org/onlinedocs/gcc-14.2.0/gcc/Warning-Options.html#index-Wno-stringop-overflow-Wstringop-overflow=]8;;]
  258 | #  define memset_zero(P, Len) (memset ((P), '0', (Len)), (P) += (Len))
      |                                ^~~~~~~~~~~~~~~~~~~~~~~~
strftime.c:275:17: note: in expansion of macro 'memset_zero'
  275 |                 memset_zero (p, _delta);                                      \
      |                 ^~~~~~~~~~~
strftime.c:662:11: note: in expansion of macro 'add'
  662 |           add (1, *p = *f);
      |           ^~~
strftime.c:257:33: warning: 'memset' specified size 18446744073709551614 exceeds maximum object size 9223372036854775807 [ttps://gcc.gnu.org/onlinedocs/gcc-14.2.0/gcc/Warning-Options.html#index-Wno-stringop-overflow-Wstringop-overflow=]8;;]
  257 | #  define memset_space(P, Len) (memset ((P), ' ', (Len)), (P) += (Len))
      |                                 ^~~~~~~~~~~~~~~~~~~~~~~~
strftime.c:277:17: note: in expansion of macro 'memset_space'
  277 |                 memset_space (p, _delta);                                     \
      |                 ^~~~~~~~~~~~
strftime.c:662:11: note: in expansion of macro 'add'
  662 |           add (1, *p = *f);
      |           ^~~
if gcc -DLIBDIR=\"/home/peter/result/lib\" -DHAVE_CONFIG_H -I. -I. -I.. -I.. -I.    -U_FORTIFY_SOURCE -MT getopt.o -MD -MP -MF ".deps/getopt.Tpo" \
  -c -o getopt.o `test -f 'getopt.c' || echo './'`getopt.c; \
then mv ".deps/getopt.Tpo" ".deps/getopt.Po"; \
else rm -f ".deps/getopt.Tpo"; exit 1; \
fi
if gcc -DLIBDIR=\"/home/peter/result/lib\" -DHAVE_CONFIG_H -I. -I. -I.. -I.. -I.    -U_FORTIFY_SOURCE -MT getopt1.o -MD -MP -MF ".deps/getopt1.Tpo" \
  -c -o getopt1.o `test -f 'getopt1.c' || echo './'`getopt1.c; \
then mv ".deps/getopt1.Tpo" ".deps/getopt1.Po"; \
else rm -f ".deps/getopt1.Tpo"; exit 1; \
fi
if gcc -DLIBDIR=\"/home/peter/result/lib\" -DHAVE_CONFIG_H -I. -I. -I.. -
[command output truncated]
. -I.. -I.. -I.    -U_FORTIFY_SOURCE -MT mbswidth.o -MD -MP -MF ".deps/mbswidth.Tpo" \
  -c -o mbswidth.o `test -f 'mbswidth.c' || echo './'`mbswidth.c; \
then mv ".deps/mbswidth.Tpo" ".deps/mbswidth.Po"; \
else rm -f ".deps/mbswidth.Tpo"; exit 1; \
fi
if gcc -DLIBDIR=\"/home/peter/result/lib\" -DHAVE_CONFIG_H -I. -I. -I.. -I.. -I.    -U_FORTIFY_SOURCE -MT md5.o -MD -MP -MF ".deps/md5.Tpo" \
  -c -o md5.o `test -f 'md5.c' || echo './'`md5.c; \
then mv ".deps/md5.Tpo" ".deps/md5.Po"; \
else rm -f ".deps/md5.Tpo"; exit 1; \
fi
md5.c: In function 'md5_finish_ctx':
md5.c:129:3: error: implicit declaration of function 'memcpy' [ttps://gcc.gnu.org/onlinedocs/gcc-14.2.0/gcc/Warning-Options.html#index-Wimplicit-function-declaration-Wimplicit-function-declaration]8;;]
  129 |   memcpy (&ctx->buffer[bytes], fillbuf, pad);
      |   ^~~~~~
md5.c:40:1: note: include '<string.h>' or provide a declaration of 'memcpy'
   39 | #include "unlocked-io.h"
  +++ |+#include <string.h>
   40 | 
md5.c:129:3: warning: incompatible implicit declaration of built-in function 'memcpy' [ttps://gcc.gnu.org/onlinedocs/gcc-14.2.0/gcc/Warning-Options.html#index-Wbuiltin-declaration-mismatch-Wbuiltin-declaration-mismatch]8;;]
  129 |   memcpy (&ctx->buffer[bytes], fillbuf, pad);
      |   ^~~~~~
md5.c:129:3: note: include '<string.h>' or provide a declaration of 'memcpy'
md5.c: In function 'md5_process_bytes':
md5.c:246:7: warning: incompatible implicit declaration of built-in function 'memcpy' [ttps://gcc.gnu.org/onlinedocs/gcc-14.2.0/gcc/Warning-Options.html#index-Wbuiltin-declaration-mismatch-Wbuiltin-declaration-mismatch]8;;]
  246 |       memcpy (&ctx->buffer[left_over], buffer, add);
      |       ^~~~~~
md5.c:246:7: note: include '<string.h>' or provide a declaration of 'memcpy'
md5.c:277:32: warning: incompatible implicit declaration of built-in function 'memcpy' [ttps://gcc.gnu.org/onlinedocs/gcc-14.2.0/gcc/Warning-Options.html#index-Wbuiltin-declaration-mismatch-Wbuiltin-declaration-mismatch]8;;]
  277 |             md5_process_block (memcpy (ctx->buffer, buffer, 64), 64, ctx);
      |                                ^~~~~~
md5.c:277:32: note: include '<string.h>' or provide a declaration of 'memcpy'
md5.c:295:7: warning: incompatible implicit declaration of built-in function 'memcpy' [ttps://gcc.gnu.org/onlinedocs/gcc-14.2.0/gcc/Warning-Options.html#index-Wbuiltin-declaration-mismatch-Wbuiltin-declaration-mismatch]8;;]
  295 |       memcpy (&ctx->buffer[left_over], buffer, len);
      |       ^~~~~~
md5.c:295:7: note: include '<string.h>' or provide a declaration of 'memcpy'
make[3]: *** [Makefile:590: md5.o] Error 1
make[3]: Leaving directory '/home/peter/coreutils-5.0/lib'
make[2]: *** [Makefile:414: all] Error 2
make[2]: Leaving directory '/home/peter/coreutils-5.0/lib'
make[1]: *** [Makefile:244: all-recursive] Error 1
make[1]: Leaving directory '/home/peter/coreutils-5.0'
make: *** [Makefile:199: all] Error 2
90 lines
ASSISTANT
Show reasoning

Fixing the Compile Error

I've managed to get past the initial hurdle of the duplicate unsigned error. My first attempt failed, but after tweaking the config file, the compilation process seemed to progress further. Now, I'm curious to see what new challenges arise during this next build attempt.

Troubleshooting Compilation Issues

I've added the necessary #include directive to md5.c using sed. Following that, a new make attempt with the same CFLAGS yielded success. I'm now proceeding with the make install command, hopeful this resolves the remaining build steps. Subsequently, I'll need to establish those crucial symlinks to wrap up the process.

Resolving the memcpy Error

I've successfully added #include to md5.c and re-attempted the make command using the CFLAGS flag, and this time, compilation succeeded. Now, I'm moving forward with make install to complete the process, followed by the symlink creation. I am also ready to list all the binaries, and create the symlinks with a for loop command, which I have constructed.

It seems we have another compilation error, this time in md5.c. The compiler is complaining about an implicit declaration of the memcpy function. This can be fixed by including the header file in md5.c. I'll add the necessary include and try compiling again.

compile-bench> sed -i '40i#include <string.h>' coreutils-5.0/lib/md5.c
[empty output]
ASSISTANT

I've added the #include to coreutils-5.0/lib/md5.c. Now, let's try to compile the source code again with the CFLAGS="-U_FORTIFY_SOURCE" make command.

compile-bench> cd coreutils-5.0 && make CFLAGS="-U_FORTIFY_SOURCE"
make  all-recursive
make[1]: Entering directory '/home/peter/coreutils-5.0'
Making all in lib
make[2]: Entering directory '/home/peter/coreutils-5.0/lib'
make  all-am
make[3]: Entering directory '/home/peter/coreutils-5.0/lib'
if gcc -DLIBDIR=\"/home/peter/result/lib\" -DHAVE_CONFIG_H -I. -I. -I.. -I.. -I.    -U_FORTIFY_SOURCE -MT md5.o -MD -MP -MF ".deps/md5.Tpo" \
  -c -o md5.o `test -f 'md5.c' || echo './'`md5.c; \
then mv ".deps/md5.Tpo" ".deps/md5.Po"; \
else rm -f ".deps/md5.Tpo"; exit 1; \
fi
if gcc -DLIBDIR=\"/home/peter/result/lib\" -DHAVE_CONFIG_H -I. -I. -I.. -I.. -I.    -U_FORTIFY_SOURCE -MT memcasecmp.o -MD -MP -MF ".deps/memcasecmp.Tpo" \
  -c -o memcasecmp.o `test -f 'memcasecmp.c' || echo './'`memcasecmp.c; \
then mv ".deps/memcasecmp.Tpo" ".deps/memcasecmp.Po"; \
else rm -f ".deps/memcasecmp.Tpo"; exit 1; \
fi
if gcc -DLIBDIR=\"/home/peter/result/lib\" -DHAVE_CONFIG_H -I. -I. -I.. -I.. -I.    -U_FORTIFY_SOURCE -MT memcoll.o -MD -MP -MF ".deps/memcoll.Tpo" \
  -c -o memcoll.o `test -f 'memcoll.c' || echo './'`memcoll.c; \
then mv ".deps/memcoll.Tpo" ".deps/memcoll.Po"; \
else rm -f ".deps/memcoll.Tpo"; exit 1; \
fi
if gcc -DLIBDIR=\"/home/peter/result/lib\" -DHAVE_CONFIG_H -I. -I. -I.. -I.. -I.    -U_FORTIFY_SOURCE -MT modechange.o -MD -MP -MF ".deps/modechange.Tpo" \
  -c -o modechange.o `test -f 'modechange.c' || echo './'`modechange.c; \
then mv ".deps/modechange.Tpo" ".deps/modechange.Po"; \
else rm -f ".deps/modechange.Tpo"; exit 1; \
fi
modechange.c:38:7: warning: conflicting types for built-in function 'malloc'; expected 'void *(long unsigned int)' [ttps://gcc.gnu.org/onlinedocs/gcc-14.2.0/gcc/Warning-Options.html#index-Wbuiltin-declaration-mismatch-Wbuiltin-declaration-mismatch]8;;]
   38 | char *malloc ();
      |       ^~~~~~
modechange.c:34:1: note: 'malloc' is declared in header '<stdlib.h>'
   33 | #include "xstrtol.h"
  +++ |+#include <stdlib.h>
   34 | 
modechange.c: In function 'mode_free':
modechange.c:478:7: error: implicit declaration of function 'free' [ttps://gcc.gnu.org/onlinedocs/gcc-14.2.0/gcc/Warning-Options.html#index-Wimplicit-function-declaration-Wimplicit-function-declaration]8;;]
  478 |       free (changes);
      |       ^~~~
modechange.c:478:7: note: include '<stdlib.h>' or provide a declaration of 'free'
modechange.c:478:7: warning: incompatible implicit declaration of built-in function 'free' [ttps://gcc.gnu.org/onlinedocs/gcc-14.2.0/gcc/Warning-Options.html#index-Wbuiltin-declaration-mismatch-Wbuiltin-declaration-mismatch]8;;]
modechange.c:478:7: note: include '<stdlib.h>' or provide a declaration of 'free'
make[3]: *** [Makefile:590: modechange.o] Error 1
make[3]: Leaving directory '/home/peter/coreutils-5.0/lib'
make[2]: *** [Makefile:414: all] Error 2
make[2]: Leaving directory '/home/peter/coreutils-5.0/lib'
make[1]: *** [Makefile:244: all-recursive] Error 1
make[1]: Leaving directory '/home/peter/coreutils-5.0'
make: *** [Makefile:199: all] Error 2
48 lines
ASSISTANT
Show reasoning

Debugging the Build

I'm currently wrestling with the coreutils-5.0 build. The last snag was in modechange.c, where I'm seeing a missing include, causing malloc and free errors. I'm now focusing on the dependencies to make sure the build environment is properly configured before retrying.

Addressing Compilation Issues

I've implemented the necessary fixes to modechange.c by adding the missing include and removing the conflicting malloc declaration. I've used sed to modify the file directly. The next step is to retry the build with the adjusted flags, keeping the original compilation arguments. I'll be watching for any remaining errors.

Applying the Fixes

I've reviewed the edits and decided to simplify the sed commands for clarity. Instead of adding and removing lines, I'm using sed to directly replace the problematic malloc declaration with the #include statement. I've also verified the targeted line in modechange.c. Now, I'm ready to run the adjusted compilation with the correct flags.

Another compilation error. This time, in modechange.c, the compiler is complaining about malloc and free. I will replace the declaration of malloc with the correct header inclusion, which is stdlib.h. That should fix the problem.

compile-bench> sed -i 's/char \*malloc ();/#include <stdlib.h>/' coreutils-5.0/lib/modechange.c
[empty output]
ASSISTANT

Now that I have fixed the error in modechange.c, I will try to compile again with the CFLAGS="-U_FORTIFY_SOURCE" make command.

compile-bench> cd coreutils-5.0 && make CFLAGS="-U_FORTIFY_SOURCE"
make  all-recursive
make[1]: Entering directory '/home/peter/coreutils-5.0'
Making all in lib
make[2]: Entering directory '/home/peter/coreutils-5.0/lib'
make  all-am
make[3]: Entering directory '/home/peter/coreutils-5.0/lib'
if gcc -DLIBDIR=\"/home/peter/result/lib\" -DHAVE_CONFIG_H -I. -I. -I.. -I.. -I.    -U_FORTIFY_SOURCE -MT modechange.o -MD -MP -MF ".deps/modechange.Tpo" \
  -c -o modechange.o `test -f 'modechange.c' || echo './'`modechange.c; \
then mv ".deps/modechange.Tpo" ".deps/modechange.Po"; \
else rm -f ".deps/modechange.Tpo"; exit 1; \
fi
if gcc -DLIBDIR=\"/home/peter/result/lib\" -DHAVE_CONFIG_H -I. -I. -I.. -I.. -I.    -U_FORTIFY_SOURCE -MT offtostr.o -MD -MP -MF ".deps/offtostr.Tpo" \
  -c -o offtostr.o `test -f 'offtostr.c' || echo './'`offtostr.c; \
then mv ".deps/offtostr.Tpo" ".deps/offtostr.Po"; \
else rm -f ".deps/offtostr.Tpo"; exit 1; \
fi
if gcc -DLIBDIR=\"/home/peter/result/lib\" -DHAVE_CONFIG_H -I. -I. -I.. -I.. -I.    -U_FORTIFY_SOURCE -MT path-concat.o -MD -MP -MF ".deps/path-concat.Tpo" \
  -c -o path-concat.o `test -f 'path-concat.c' || echo './'`path-concat.c; \
then mv ".deps/path-concat.Tpo" ".deps/path-concat.Po"; \
else rm -f ".deps/path-concat.Tpo"; exit 1; \
fi
if gcc -DLIBDIR=\"/home/peter/result/lib\" -DHAVE_CONFIG_H -I. -I. -I.. -I.. -I.    -U_FORTIFY_SOURCE -MT physmem.o -MD -MP -MF ".deps/physmem.Tpo" \
  -c -o physmem.o `test -f 'physmem.c' || echo './'`physmem.c; \
then mv ".deps/physmem.Tpo" ".deps/physmem.Po"; \
else rm -f ".deps/physmem.Tpo"; exit 1; \
fi
if gcc -DLIBDIR=\"/home/peter/result/lib\" -DHAVE_CONFIG_H -I. -I. -I.. -I.. -I.    -U_FORTIFY_SOURCE -MT quote.o -MD -MP -MF ".deps/quote.Tpo" \
  -c -o quote.o `test -f 'quote.c' || echo './'`quote.c; \
then mv ".deps/quote.Tpo" ".deps/quote.Po"; \
else rm -f ".deps/quote.Tpo"; exit 1; \
fi
if gcc -DLIBDIR=\"/home/peter/result/lib\" -DHAVE_CONFIG_H -I. -I. -I.. -I.. -I.    -U_FORTIFY_SOURCE -MT quotearg.o -MD -MP -MF ".deps/quotearg.Tpo" \
  -c -o quotearg.o `test -f 'quotearg.c' || echo './'`quotearg.c; \
then mv ".deps/quotearg.Tpo" ".deps/quotearg.Po"; \
else rm -f ".deps/quotearg.Tpo"; exit 1; \
fi
if gcc -DLIBDIR=\"/home/peter/result/lib\" -DHAVE_CONFIG_H -I. -I. -I.. -I.. -I.    -U_FORTIFY_SOURCE -MT readtokens.o -MD -MP -MF ".deps/readtokens.Tpo" \
  -c -o readtokens.o `test -f 'readtokens.c' || echo './'`readtokens.c; \
then mv ".deps/readtokens.Tpo" ".deps/readtokens.Po"; \
else rm -f ".deps/readtokens.Tpo"; exit 1; \
fi
readtokens.c: In function 'readtoken':
readtokens.c:92:5: error: implicit declaration of function 'abort' [ttps://gcc.gnu.org/onlinedocs/gcc-14.2.0/gcc/Warning-Options.html#index-Wimplicit-function-declaration-Wimplicit-function-declaration]8;;]
   92 |     abort ();
      |     ^~~~~
readtokens.c:54:1: note: include '<stdlib.h>' or provide a declaration of 'abort'
   53 | #include "xalloc.h"
  +++ |+#include <stdlib.h>
   54 | 
readtokens.c:92:5: warning: incompatible implicit declaration of built-in function 'abort' [ttps://gcc.gnu.org/onlinedocs/gcc-14.2.0/gcc/Warning-Options.html#index-Wbuiltin-declaration-mismatch-Wbuiltin-declaration-mismatch]8;;]
   92 |     abort ();
      |     ^~~~~
readtokens.c:92:5: note: include '<stdlib.h>' or provide a declaration of 'abort'
readtokens.c: In function 'readtokens':
readtokens.c:216:3: error: implicit declaration of function 'free' [ttps://gcc.gnu.org/onlinedocs/gcc-14.2.0/gcc/Warning-Options.html#index-Wimplicit-function-declaration-Wimplicit-function-declaration]8;;]
  216 |   free (token->buffer);
      |   ^~~~
readtokens.c:216:3: note: include '<stdlib.h>' or provide a declaration of 'free'
readtokens.c:216:3: warning: incompatible implicit declaration of built-in function 'free' [ttps://gcc.gnu.org/onlinedocs/gcc-14.2.0/gcc/Warning-Options.html#index-Wbuiltin-declaration-mismatch-Wbuiltin-declaration-mismatch]8;;]
readtokens.c:216:3: note: include '<stdlib.h>' or provide a declaration of 'free'
make[3]: *** [Makefile:590: readtokens.o] Error 1
make[3]: Leaving directory '/home/peter/coreutils-5.0/lib'
make[2]: *** [Makefile:414: all] Error 2
make[2]: Leaving directory '/home/peter/coreutils-5.0/lib'
make[1]: *** [Makefile:244: all-recursive] Error 1
make[1]: Leaving directory '/home/peter/coreutils-5.0'
make: *** [Makefile:199: all] Error 2
68 lines
ASSISTANT
Show reasoning

Analyzing Compilation Failures

I'm currently facing issues with coreutils-5.0 compilation, specifically in readtokens.c. It seems I'm encountering implicit declarations for abort and free. This is blocking further progress. I'm focusing on identifying the missing include that defines these functions.

Resolving the Missing Include

I've pinpointed the source of the compilation failure. The problem in readtokens.c stems from missing declarations for abort and free. I'm adding the required include using sed and will re-attempt the compilation with the CFLAGS specified to ensure a clean build.

It looks like we have another compilation error, this time in readtokens.c. The compiler is complaining about implicit declarations of abort and free. I'll add the necessary #include to readtokens.c and try compiling again.

compile-bench> sed -i '54i#include <stdlib.h>' coreutils-5.0/lib/readtokens.c
[empty output]
ASSISTANT

silent
I've added the #include to coreutils-5.0/lib/readtokens.c. Now, let's try to compile the source code again with the CFLAGS="-U_FORTIFY_SOURCE" make command.I've added the necessary header to readtokens.c. I'll try to compile the source code again.

compile-bench> cd coreutils-5.0 && make CFLAGS="-U_FORTIFY_SOURCE"
make  all-recursive
make[1]: Entering directory '/home/peter/coreutils-5.0'
Making all in lib
make[2]: Entering directory '/home/peter/coreutils-5.0/lib'
make  all-am
make[3]: Entering directory '/home/peter/coreutils-5.0/lib'
if gcc -DLIBDIR=\"/home/peter/result/lib\" -DHAVE_CONFIG_H -I. -I. -I.. -I.. -I.    -U_FORTIFY_SOURCE -MT readtokens.o -MD -MP -MF ".deps/readtokens.Tpo" \
  -c -o readtokens.o `test -f 'readtokens.c' || echo './'`readtokens.c; \
then mv ".deps/readtokens.Tpo" ".deps/readtokens.Po"; \
else rm -f ".deps/readtokens.Tpo"; exit 1; \
fi
if gcc -DLIBDIR=\"/home/peter/result/lib\" -DHAVE_CONFIG_H -I. -I. -I.. -I.. -I.    -U_FORTIFY_SOURCE -MT safe-read.o -MD -MP -MF ".deps/safe-read.Tpo" \
  -c -o safe-read.o `test -f 'safe-read.c' || echo './'`safe-read.c; \
then mv ".deps/safe-read.Tpo" ".deps/safe-read.Po"; \
else rm -f ".deps/safe-read.Tpo"; exit 1; \
fi
if gcc -DLIBDIR=\"/home/peter/result/lib\" -DHAVE_CONFIG_H -I. -I. -I.. -I.. -I.    -U_FORTIFY_SOURCE -MT safe-write.o -MD -MP -MF ".deps/safe-write.Tpo" \
  -c -o safe-write.o `test -f 'safe-write.c' || echo './'`safe-write.c; \
then mv ".deps/safe-write.Tpo" ".deps/safe-write.Po"; \
else rm -f ".deps/safe-write.Tpo"; exit 1; \
fi
if gcc -DLIBDIR=\"/home/peter/result/lib\" -DHAVE_CONFIG_H -I. -I. -I.. -I.. -I.    -U_FORTIFY_SOURCE -MT same.o -MD -MP -MF ".deps/same.Tpo" \
  -c -o same.o `test -f 'same.c' || echo './'`same.c; \
then mv ".deps/same.Tpo" ".deps/same.Po"; \
else rm -f ".deps/same.Tpo"; exit 1; \
fi
if gcc -DLIBDIR=\"/home/peter/result/lib\" -DHAVE_CONFIG_H -I. -I. -I.. -I.. -I.    -U_FORTIFY_SOURCE -MT save-cwd.o -MD -MP -MF ".deps/save-cwd.Tpo" \
  -c -o save-cwd.o `test -f 'save-cwd.c' || echo './'`save-cwd.c; \
then mv ".deps/save-cwd.Tpo" ".deps/save-cwd.Po"; \
else rm -f ".deps/save-cwd.Tpo"; exit 1; \
fi
save-cwd.c: In function 'free_cwd':
save-cwd.c:145:5: error: implicit declaration of function 'free' [ttps://gcc.gnu.org/onlinedocs/gcc-14.2.0/gcc/Warning-Options.html#index-Wimplicit-function-declaration-Wimplicit-function-declaration]8;;]
  145 |     free (cwd->name);
      |     ^~~~
save-cwd.c:52:1: note: include '<stdlib.h>' or provide a declaration of 'free'
   51 | #include "xgetcwd.h"
  +++ |+#include <stdlib.h>
   52 | 
save-cwd.c:145:5: warning: incompatible implicit declaration of built-in function 'free' [ttps://gcc.gnu.org/onlinedocs/gcc-14.2.0/gcc/Warning-Options.html#index-Wbuiltin-declaration-mismatch-Wbuiltin-declaration-mismatch]8;;]
  145 |     free (cwd->name);
      |     ^~~~
save-cwd.c:145:5: note: include '<stdlib.h>' or provide a declaration of 'free'
make[3]: *** [Makefile:590: save-cwd.o] Error 1
make[3]: Leaving directory '/home/peter/coreutils-5.0/lib'
make[2]: *** [Makefile:414: all] Error 2
make[2]: Leaving directory '/home/peter/coreutils-5.0/lib'
make[1]: *** [Makefile:244: all-recursive] Error 1
make[1]: Leaving directory '/home/peter/coreutils-5.0'
make: *** [Makefile:199: all] Error 2
51 lines
ASSISTANT

It looks like we have another compilation error, this time in save-cwd.c. The compiler is complaining about an implicit declaration of free. I'll add the necessary #include to save-cwd.c and try compiling again.

compile-bench> sed -i '52i#include <stdlib.h>' coreutils-5.0/lib/save-cwd.c
[empty output]
ASSISTANT

I've added the #include to coreutils-5.0/lib/save-cwd.c. Now, let's try to compile the source code again with the CFLAGS="-U_FORTIFY_SOURCE" make command.

compile-bench> cd coreutils-5.0 && make CFLAGS="-U_FORTIFY_SOURCE"
make  all-recursive
make[1]: Entering directory '/home/peter/coreutils-5.0'
Making all in lib
make[2]: Entering directory '/home/peter/coreutils-5.0/lib'
make  all-am
make[3]: Entering directory '/home/peter/coreutils-5.0/lib'
if gcc -DLIBDIR=\"/home/peter/result/lib\" -DHAVE_CONFIG_H -I. -I. -I.. -I.. -I.    -U_FORTIFY_SOURCE -MT save-cwd.o -MD -MP -MF ".deps/save-cwd.Tpo" \
  -c -o save-cwd.o `test -f 'save-cwd.c' || echo './'`save-cwd.c; \
then mv ".deps/save-cwd.Tpo" ".deps/save-cwd.Po"; \
else rm -f ".deps/save-cwd.Tpo"; exit 1; \
fi
if gcc -DLIBDIR=\"/home/peter/result/lib\" -DHAVE_CONFIG_H -I. -I. -I.. -I.. -I.    -U_FORTIFY_SOURCE -MT savedir.o -MD -MP -MF ".deps/savedir.Tpo" \
  -c -o savedir.o `test -f 'savedir.c' || echo './'`savedir.c; \
then mv ".deps/savedir.Tpo" ".deps/savedir.Po"; \
else rm -f ".deps/savedir.Tpo"; exit 1; \
fi
savedir.c: In function 'savedir':
savedir.c:99:31: error: implicit declaration of function 'strlen' [ttps://gcc.gnu.org/onlinedocs/gcc-14.2.0/gcc/Warning-Options.html#index-Wimplicit-function-declaration-Wimplicit-function-declaration]8;;]
   99 |           size_t entry_size = strlen (entry) + 1;
      |                               ^~~~~~
savedir.c:65:1: note: include '<string.h>' or provide a declaration of 'strlen'
   64 | #include "xalloc.h"
  +++ |+#include <string.h>
   65 | 
savedir.c:99:31: warning: incompatible implicit declaration of built-in function 'strlen' [ttps://gcc.gnu.org/onlinedocs/gcc-14.2.0/gcc/Warning-Options.html#index-Wbuiltin-declaration-mismatch-Wbuiltin-declaration-mismatch]8;;]
   99 |           size_t entry_size = strlen (entry) + 1;
      |                               ^~~~~~
savedir.c:99:31: note: include '<string.h>' or provide a declaration of 'strlen'
savedir.c:114:11: error: implicit declaration of function 'memcpy' [ttps://gcc.gnu.org/onlinedocs/gcc-14.2.0/gcc/Warning-Options.html#index-Wimplicit-function-declaration-Wimplicit-function-declaration]8;;]
  114 |           memcpy (name_space + used, entry, entry_size);
      |           ^~~~~~
savedir.c:114:11: note: include '<string.h>' or provide a declaration of 'memcpy'
savedir.c:114:11: warning: incompatible implicit declaration of built-in function 'memcpy' [ttps://gcc.gnu.org/onlinedocs/gcc-14.2.0/gcc/Warning-Options.html#index-Wbuiltin-declaration-mismatch-Wbuiltin-declaration-mismatch]8;;]
savedir.c:114:11: note: include '<string.h>' or provide a declaration of 'memcpy'
savedir.c:124:7: error: implicit declaration of function 'free' [ttps://gcc.gnu.org/onlinedocs/gcc-14.2.0/gcc/Warning-Options.html#index-Wimplicit-function-declaration-Wimplicit-function-declaration]8;;]
  124 |       free (name_space);
      |       ^~~~
savedir.c:65:1: note: include '<stdlib.h>' or provide a declaration of 'free'
   64 | #include "xalloc.h"
  +++ |+#include <stdlib.h>
   65 | 
savedir.c:124:7: warning: incompatible implicit declaration of built-in function 'free' [ttps://gcc.gnu.org/onlinedocs/gcc-14.2.0/gcc/Warning-Options.html#index-Wbuiltin-declaration-mismatch-Wbuiltin-declaration-mismatch]8;;]
  124 |       free (name_space);
      |       ^~~~
savedir.c:124:7: note: include '<stdlib.h>' or provide a declaration of 'free'
make[3]: *** [Makefile:590: savedir.o] Error 1
make[3]: Leaving directory '/home/peter/coreutils-5.0/lib'
make[2]: *** [Makefile:414: all] Error 2
make[2]: Leaving directory '/home/peter/coreutils-5.0/lib'
make[1]: *** [Makefile:244: all-recursive] Error 1
make[1]: Leaving directory '/home/peter/coreutils-5.0'
make: *** [Makefile:199: all] Error 2
53 lines
ASSISTANT

It looks like savedir.c is missing some includes. I'll add #include and #include to fix the implicit declarations of strlen, memcpy and free.

compile-bench> sed -i '65i#include <string.h>' coreutils-5.0/lib/savedir.c
[empty output]
ASSISTANT
Show reasoning

Troubleshooting Coreutils Build

I'm still wrestling with the coreutils-5.0 compilation. I've just resolved the issue in savedir.c by including the header file. Now, I'm moving on to the next error, determined to get this package built and installed in the /home/peter/result directory! This build is being quite the ordeal.

Including Crucial Headers

I've added #include to savedir.c, hoping to address the lingering errors related to memory management. I'm preparing to recompile with the CFLAGS flag to address the fortify source issue. Success hinges on resolving all compilation errors before I can install to the target directory. The next step is to verify install.

compile-bench> sed -i '66i#include <stdlib.h>' coreutils-5.0/lib/savedir.c
[empty output]
ASSISTANT

I've added the #include and #include to coreutils-5.0/lib/savedir.c. Now, let's try to compile the source code again with the CFLAGS="-U_FORTIFY_SOURCE" make command.

compile-bench> cd coreutils-5.0 && make CFLAGS="-U_FORTIFY_SOURCE"
make  all-recursive
make[1]: Entering directory '/home/peter/coreutils-5.0'
Making all in lib
make[2]: Entering directory '/home/peter/coreutils-5.0/lib'
make  all-am
make[3]: Entering directory '/home/peter/coreutils-5.0/lib'
if gcc -DLIBDIR=\"/home/peter/result/lib\" -DHAVE_CONFIG_H -I. -I. -I.. -I.. -I.    -U_FORTIFY_SOURCE -MT savedir.o -MD -MP -MF ".deps/savedir.Tpo" \
  -c -o savedir.o `test -f 'savedir.c' || echo './'`savedir.c; \
then mv ".deps/savedir.Tpo" ".deps/savedir.Po"; \
else rm -f ".deps/savedir.Tpo"; exit 1; \
fi
if gcc -DLIBDIR=\"/home/peter/result/lib\" -DHAVE_CONFIG_H -I. -I. -I.. -I.. -I.    -U_FORTIFY_SOURCE -MT settime.o -MD -MP -MF ".deps/settime.Tpo" \
  -c -o settime.o `test -f 'settime.c' || echo './'`settime.c; \
then mv ".deps/settime.Tpo" ".deps/settime.Po"; \
else rm -f ".deps/settime.Tpo"; exit 1; \
fi
if gcc -DLIBDIR=\"/home/peter/result/lib\" -DHAVE_CONFIG_H -I. -I. -I.. -I.. -I.    -U_FORTIFY_SOURCE -MT sha.o -MD -MP -MF ".deps/sha.Tpo" \
  -c -o sha.o `test -f 'sha.c' || echo './'`sha.c; \
then mv ".deps/sha.Tpo" ".deps/sha.Po"; \
else rm -f ".deps/sha.Tpo"; exit 1; \
fi
sha.c: In function 'sha_finish_ctx':
sha.c:109:3: error: implicit declaration of function 'memcpy' [ttps://gcc.gnu.org/onlinedocs/gcc-14.2.0/gcc/Warning-Options.html#index-Wimplicit-function-declaration-Wimplicit-function-declaration]8;;]
  109 |   memcpy (&ctx->buffer[bytes], fillbuf, pad);
      |   ^~~~~~
sha.c:28:1: note: include '<string.h>' or provide a declaration of 'memcpy'
   27 | #include "unlocked-io.h"
  +++ |+#include <string.h>
   28 | 
sha.c:109:3: warning: incompatible implicit declaration of built-in function 'memcpy' [ttps://gcc.gnu.org/onlinedocs/gcc-14.2.0/gcc/Warning-Options.html#index-Wbuiltin-declaration-mismatch-Wbuiltin-declaration-mismatch]8;;]
  109 |   memcpy (&ctx->buffer[bytes], fillbuf, pad);
      |   ^~~~~~
sha.c:109:3: note: include '<string.h>' or provide a declaration of 'memcpy'
sha.c: In function 'sha_process_bytes':
sha.c:217:7: warning: incompatible implicit declaration of built-in function 'memcpy' [ttps://gcc.gnu.org/onlinedocs/gcc-14.2.0/gcc/Warning-Options.html#index-Wbuiltin-declaration-mismatch-Wbuiltin-declaration-mismatch]8;;]
  217 |       memcpy (&ctx->buffer[left_over], buffer, add);
      |       ^~~~~~
sha.c:217:7: note: include '<string.h>' or provide a declaration of 'memcpy'
sha.c:248:32: warning: incompatible implicit declaration of built-in function 'memcpy' [ttps://gcc.gnu.org/onlinedocs/gcc-14.2.0/gcc/Warning-Options.html#index-Wbuiltin-declaration-mismatch-Wbuiltin-declaration-mismatch]8;;]
  248 |             sha_process_block (memcpy (ctx->buffer, buffer, 64), 64, ctx);
      |                                ^~~~~~
sha.c:248:32: note: include '<string.h>' or provide a declaration of 'memcpy'
sha.c:266:7: warning: incompatible implicit declaration of built-in function 'memcpy' [ttps://gcc.gnu.org/onlinedocs/gcc-14.2.0/gcc/Warning-Options.html#index-Wbuiltin-declaration-mismatch-Wbuiltin-declaration-mismatch]8;;]
  266 |       memcpy (&ctx->buffer[left_over], buffer, len);
      |       ^~~~~~
sha.c:266:7: note: include '<string.h>' or provide a declaration of 'memcpy'
make[3]: *** [Makefile:590: sha.o] Error 1
make[3]: Leaving directory '/home/peter/coreutils-5.0/lib'
make[2]: *** [Makefile:414: all] Error 2
make[2]: Leaving directory '/home/peter/coreutils-5.0/lib'
make[1]: *** [Makefile:244: all-recursive] Error 1
make[1]: Leaving directory '/home/peter/coreutils-5.0'
make: *** [Makefile:199: all] Error 2
54 lines
ASSISTANT

It seems like sha.c is missing an include for memcpy. I'll add #include to sha.c to fix this.

compile-bench> sed -i '28i#include <string.h>' coreutils-5.0/lib/sha.c
[empty output]
ASSISTANT

I've added the #include to coreutils-5.0/lib/sha.c. Now, let's try to compile the source code again with the CFLAGS="-U_FORTIFY_SOURCE" make command.

compile-bench> cd coreutils-5.0 && make CFLAGS="-U_FORTIFY_SOURCE"
make  all-recursive
make[1]: Entering directory '/home/peter/coreutils-5.0'
Making all in lib
make[2]: Entering directory '/home/peter/coreutils-5.0/lib'
make  all-am
make[3]: Entering directory '/home/peter/coreutils-5.0/lib'
if gcc -DLIBDIR=\"/home/peter/result/lib\" -DHAVE_CONFIG_H -I. -I. -I.. -I.. -I.    -U_FORTIFY_SOURCE -MT sha.o -MD -MP -MF ".deps/sha.Tpo" \
  -c -o sha.o `test -f 'sha.c' || echo './'`sha.c; \
then mv ".deps/sha.Tpo" ".deps/sha.Po"; \
else rm -f ".deps/sha.Tpo"; exit 1; \
fi
if gcc -DLIBDIR=\"/home/peter/result/lib\" -DHAVE_CONFIG_H -I. -I. -I.. -I.. -I.    -U_FORTIFY_SOURCE -MT stripslash.o -MD -MP -MF ".deps/stripslash.Tpo" \
  -c -o stripslash.o `test -f 'stripslash.c' || echo './'`stripslash.c; \
then mv ".deps/stripslash.Tpo" ".deps/stripslash.Po"; \
else rm -f ".deps/stripslash.Tpo"; exit 1; \
fi
if gcc -DLIBDIR=\"/home/peter/result/lib\" -DHAVE_CONFIG_H -I. -I. -I.. -I.. -I.    -U_FORTIFY_SOURCE -MT umaxtostr.o -MD -MP -MF ".deps/umaxtostr.Tpo" \
  -c -o umaxtostr.o `test -f 'umaxtostr.c' || echo './'`umaxtostr.c; \
then mv ".deps/umaxtostr.Tpo" ".deps/umaxtostr.Po"; \
else rm -f ".deps/umaxtostr.Tpo"; exit 1; \
fi
if gcc -DLIBDIR=\"/home/peter/result/lib\" -DHAVE_CONFIG_H -I. -I. -I.. -I.. -I.    -U_FORTIFY_SOURCE -MT unicodeio.o -MD -MP -MF ".deps/unicodeio.Tpo" \
  -c -o unicodeio.o `test -f 'unicodeio.c' || echo './'`unicodeio.c; \
then mv ".deps/unicodeio.Tpo" ".deps/unicodeio.Po"; \
else rm -f ".deps/unicodeio.Tpo"; exit 1; \
fi
if gcc -DLIBDIR=\"/home/peter/result/lib\" -DHAVE_CONFIG_H -I. -I. -I.. -I.. -I.    -U_FORTIFY_SOURCE -MT userspec.o -MD -MP -MF ".deps/userspec.Tpo" \
  -c -o userspec.o `test -f 'userspec.c' || echo './'`userspec.c; \
then mv ".deps/userspec.Tpo" ".deps/userspec.Po"; \
else rm -f ".deps/userspec.Tpo"; exit 1; \
fi
userspec.c: In function 'parse_user_spec':
userspec.c:332:19: error: implicit declaration of function 'free' [ttps://gcc.gnu.org/onlinedocs/gcc-14.2.0/gcc/Warning-Options.html#index-Wimplicit-function-declaration-Wimplicit-function-declaration]8;;]
  332 |                   free (*username_arg);
      |                   ^~~~
userspec.c:72:1: note: include '<stdlib.h>' or provide a declaration of 'free'
   71 | #include "gettext.h"
  +++ |+#include <stdlib.h>
   72 | #define _(msgid) gettext (msgid)
userspec.c:332:19: warning: incompatible implicit declaration of built-in function 'free' [ttps://gcc.gnu.org/onlinedocs/gcc-14.2.0/gcc/Warning-Options.html#index-Wbuiltin-declaration-mismatch-Wbuiltin-declaration-mismatch]8;;]
  332 |                   free (*username_arg);
      |                   ^~~~
userspec.c:332:19: note: include '<stdlib.h>' or provide a declaration of 'free'
make[3]: *** [Makefile:590: userspec.o] Error 1
make[3]: Leaving directory '/home/peter/coreutils-5.0/lib'
make[2]: *** [Makefile:414: all] Error 2
make[2]: Leaving directory '/home/peter/coreutils-5.0/lib'
make[1]: *** [Makefile:244: all-recursive] Error 1
make[1]: Leaving directory '/home/peter/coreutils-5.0'
make: *** [Makefile:199: all] Error 2
51 lines
ASSISTANT

It seems like userspec.c is missing an include for free. I'll add #include to userspec.c to fix this.

compile-bench> sed -i '72i#include <stdlib.h>' coreutils-5.0/lib/userspec.c
[empty output]
ASSISTANT

I've added the #include to coreutils-5.0/lib/userspec.c. Now, let's try to compile the source code again with the CFLAGS="-U_FORTIFY_SOURCE" make command.

compile-bench> cd coreutils-5.0 && make CFLAGS="-U_FORTIFY_SOURCE"
make  all-recursive
make[1]: Entering directory '/home/peter/coreutils-5.0'
Making all in lib
make[2]: Entering directory '/home/peter/coreutils-5.0/lib'
make  all-am
make[3]: Entering directory '/home/peter/coreutils-5.0/lib'
if gcc -DLIBDIR=\"/home/peter/result/lib\" -DHAVE_CONFIG_H -I. -I. -I.. -I.. -I.    -U_FORTIFY_SOURCE -MT userspec.o -MD -MP -MF ".deps/userspec.Tpo" \
  -c -o userspec.o `test -f 'userspec.c' || echo './'`userspec.c; \
then mv ".deps/userspec.Tpo" ".deps/userspec.Po"; \
else rm -f ".deps/userspec.Tpo"; exit 1; \
fi
if gcc -DLIBDIR=\"/home/peter/result/lib\" -DHAVE_CONFIG_H -I. -I. -I.. -I.. -I.    -U_FORTIFY_SOURCE -MT version-etc.o -MD -MP -MF ".deps/version-etc.Tpo" \
  -c -o version-etc.o `test -f 'version-etc.c' || echo './'`version-etc.c; \
then mv ".deps/version-etc.Tpo" ".deps/version-etc.Po"; \
else rm -f ".deps/version-etc.Tpo"; exit 1; \
fi
if gcc -DLIBDIR=\"/home/peter/result/lib\" -DHAVE_CONFIG_H -I. -I. -I.. -I.. -I.    -U_FORTIFY_SOURCE -MT xgetcwd.o -MD -MP -MF ".deps/xgetcwd.Tpo" \
  -c -o xgetcwd.o `test -f 'xgetcwd.c' || echo './'`xgetcwd.c; \
then mv ".deps/xgetcwd.Tpo" ".deps/xgetcwd.Po"; \
else rm -f ".deps/xgetcwd.Tpo"; exit 1; \
fi
if gcc -DLIBDIR=\"/home/peter/result/lib\" -DHAVE_CONFIG_H -I. -I. -I.. -I.. -I.    -U_FORTIFY_SOURCE -MT xgethostname.o -MD -MP -MF ".deps/xgethostname.Tpo" \
  -c -o xgethostname.o `test -f 'xgethostname.c' || echo './'`xgethostname.c; \
then mv ".deps/xgethostname.Tpo" ".deps/xgethostname.Po"; \
else rm -f ".deps/xgethostname.Tpo"; exit 1; \
fi
if gcc -DLIBDIR=\"/home/peter/result/lib\" -DHAVE_CONFIG_H -I. -I. -I.. -I.. -I.    -U_FORTIFY_SOURCE -MT xmalloc.o -MD -MP -MF ".deps/xmalloc.Tpo" \
  -c -o xmalloc.o `test -f 'xmalloc.c' || echo './'`xmalloc.c; \
then mv ".deps/xmalloc.Tpo" ".deps/xmalloc.Po"; \
else rm -f ".deps/xmalloc.Tpo"; exit 1; \
fi
xmalloc.c: In function 'xalloc_die':
xmalloc.c:74:3: error: implicit declaration of function 'exit' [ttps://gcc.gnu.org/onlinedocs/gcc-14.2.0/gcc/Warning-Options.html#index-Wimplicit-function-declaration-Wimplicit-function-declaration]8;;]
   74 |   exit (EXIT_FAILURE);
      |   ^~~~
xmalloc.c:39:1: note: include '<stdlib.h>' or provide a declaration of 'exit'
   38 | #include "xalloc.h"
  +++ |+#include <stdlib.h>
   39 | 
xmalloc.c:74:3: warning: incompatible implicit declaration of built-in function 'exit' [ttps://gcc.gnu.org/onlinedocs/gcc-14.2.0/gcc/Warning-Options.html#index-Wbuiltin-declaration-mismatch-Wbuiltin-declaration-mismatch]8;;]
   74 |   exit (EXIT_FAILURE);
      |   ^~~~
xmalloc.c:74:3: note: include '<stdlib.h>' or provide a declaration of 'exit'
make[3]: *** [Makefile:590: xmalloc.o] Error 1
make[3]: Leaving directory '/home/peter/coreutils-5.0/lib'
make[2]: *** [Makefile:414: all] Error 2
make[2]: Leaving directory '/home/peter/coreutils-5.0/lib'
make[1]: *** [Makefile:244: all-recursive] Error 1
make[1]: Leaving directory '/home/peter/coreutils-5.0'
make: *** [Makefile:199: all] Error 2
51 lines
ASSISTANT

It seems like xmalloc.c is missing an include for exit and EXIT_FAILURE. I'll add #include to xmalloc.c to fix this.

compile-bench> sed -i '39i#include <stdlib.h>' coreutils-5.0/lib/xmalloc.c
[empty output]
ASSISTANT

I've added the #include to coreutils-5.0/lib/xmalloc.c. Now, let's try to compile the source code again with the CFLAGS="-U_FORTIFY_SOURCE" make command. I'm hoping this is the last compilation error.

compile-bench> cd coreutils-5.0 && make CFLAGS="-U_FORTIFY_SOURCE"
make  all-recursive
make[1]: Entering directory '/home/peter/coreutils-5.0'
Making all in lib
make[2]: Entering directory '/home/peter/coreutils-5.0/lib'
make  all-am
make[3]: Entering directory '/home/peter/coreutils-5.0/lib'
if gcc -DLIBDIR=\"/home/peter/result/lib\" -DHAVE_CONFIG_H -I. -I. -I.. -I.. -I.    -U_FORTIFY_SOURCE -MT xmalloc.o -MD -MP -MF ".deps/xmalloc.Tpo" \
  -c -o xmalloc.o `test -f 'xmalloc.c' || echo './'`xmalloc.c; \
then mv ".deps/xmalloc.Tpo" ".deps/xmalloc.Po"; \
else rm -f ".deps/xmalloc.Tpo"; exit 1; \
fi
if gcc -DLIBDIR=\"/home/peter/result/lib\" -DHAVE_CONFIG_H -I. -I. -I.. -I.. -I.    -U_FORTIFY_SOURCE -MT xmemcoll.o -MD -MP -MF ".deps/xmemcoll.Tpo" \
  -c -o xmemcoll.o `test -f 'xmemcoll.c' || echo './'`xmemcoll.c; \
then mv ".deps/xmemcoll.Tpo" ".deps/xmemcoll.Po"; \
else rm -f ".deps/xmemcoll.Tpo"; exit 1; \
fi
if gcc -DLIBDIR=\"/home/peter/result/lib\" -DHAVE_CONFIG_H -I. -I. -I.. -I.. -I.    -U_FORTIFY_SOURCE -MT xnanosleep.o -MD -MP -MF ".deps/xnanosleep.Tpo" \
  -c -o xnanosleep.o `test -f 'xnanosleep.c' || echo './'`xnanosleep.c; \
then mv ".deps/xnanosleep.Tpo" ".deps/xnanosleep.Po"; \
else rm -f ".deps/xnanosleep.Tpo"; exit 1; \
fi
if gcc -DLIBDIR=\"/home/peter/result/lib\" -DHAVE_CONFIG_H -I. -I. -I.. -I.. -I.    -U_FORTIFY_SOURCE -MT xreadlink.o -MD -MP -MF ".deps/xreadlink.Tpo" \
  -c -o xreadlink.o `test -f 'xreadlink.c' || echo './'`xreadlink.c; \
then mv ".deps/xreadlink.Tpo" ".deps/xreadlink.Po"; \
else rm -f ".deps/xreadlink.Tpo"; exit 1; \
fi
if gcc -DLIBDIR=\"/home/peter/result/lib\" -DHAVE_CONFIG_H -I. -I. -I.. -I.. -I.    -U_FORTIFY_SOURCE -MT xstrdup.o -MD -MP -MF ".deps/xstrdup.Tpo" \
  -c -o xstrdup.o `test -f 'xstrdup.c' || echo './'`xstrdup.c; \
then mv ".deps/xstrdup.Tpo" ".deps/xstrdup.Po"; \
else rm -f ".deps/xstrdup.Tpo"; exit 1; \
fi
if gcc -DLIBDIR=\"/home/peter/result/lib\" -DHAVE_CONFIG_H -I. -I. -I.. -I.. -I.    -U_FORTIFY_SOURCE -MT xstrtod.o -MD -MP -MF ".deps/xstrtod.Tpo" \
  -c -o xstrtod.o `test -f 'xstrtod.c' || echo './'`xstrtod.c; \
then mv ".deps/xstrtod.Tpo" ".deps/xstrtod.Po"; \
else rm -f ".deps/xstrtod.Tpo"; exit 1; \
fi
if gcc -DLIBDIR=\"/home/peter/result/lib\" -DHAVE_CONFIG_H -I. -I. -I.. -I.. -I.    -U_FORTIFY_SOURCE -MT xstrtol.o -MD -MP -MF ".deps/xstrtol.Tpo" \
  -c -o xstrtol.o `test -f 'xstrtol.c' || echo './'`xstrtol.c; \
then mv ".deps/xstrtol.Tpo" ".deps/xstrtol.Po"; \
else rm -f ".deps/xstrtol.Tpo"; exit 1; \
fi
xstrtol.c: In function 'xstrtol':
xstrtol.c:25:19: error: implicit declaration of function 'strtol'; did you mean 'xstrtol'? [ttps://gcc.gnu.org/onlinedocs/gcc-14.2.0/gcc/Warning-Options.html#index-Wimplicit-function-declaration-Wimplicit-function-declaration]8;;]
   25 | # define __strtol strtol
      |                   ^~~~~~
xstrtol.c:141:9: note: in expansion of macro '__strtol'
  141 |   tmp = __strtol (s, p, strtol_base);
      |         ^~~~~~~~
make[3]: *** [Makefile:590: xstrtol.o] Error 1
make[3]: Leaving directory '/home/peter/coreutils-5.0/lib'
make[2]: *** [Makefile:414: all] Error 2
make[2]: Leaving directory '/home/peter/coreutils-5.0/lib'
make[1]: *** [Makefile:244: all-recursive] Error 1
make[1]: Leaving directory '/home/peter/coreutils-5.0'
make: *** [Makefile:199: all] Error 2
56 lines
ASSISTANT

It seems like xstrtol.c is missing an include for strtol. I'll add #include to xstrtol.c to fix this. It seems I've been adding stdlib.h to many files. I will add it to the remaining files that need it to avoid further compilation errors.

Task failed!
Error
task failed: sha1sum binary does not exist
Checks failed:
sha1sum binary does not exist
basename missing at /home/peter/result/basename or not executable
cat missing at /home/peter/result/cat or not executable
chgrp missing at /home/peter/result/chgrp or not executable
chmod missing at /home/peter/result/chmod or not executable
chown missing at /home/peter/result/chown or not executable
chroot missing at /home/peter/result/chroot or not executable
cksum missing at /home/peter/result/cksum or not executable
comm missing at /home/peter/result/comm or not executable
cp missing at /home/peter/result/cp or not executable
csplit missing at /home/peter/result/csplit or not executable
cut missing at /home/peter/result/cut or not executable
date missing at /home/peter/result/date or not executable
dd missing at /home/peter/result/dd or not executable
df missing at /home/peter/result/df or not executable
dir missing at /home/peter/result/dir or not executable
dircolors missing at /home/peter/result/dircolors or not executable
dirname missing at /home/peter/result/dirname or not executable
du missing at /home/peter/result/du or not executable
echo missing at /home/peter/result/echo or not executable
env missing at /home/peter/result/env or not executable
expand missing at /home/peter/result/expand or not executable
expr missing at /home/peter/result/expr or not executable
factor missing at /home/peter/result/factor or not executable
false missing at /home/peter/result/false or not executable
fmt missing at /home/peter/result/fmt or not executable
fold missing at /home/peter/result/fold or not executable
groups missing at /home/peter/result/groups or not executable
head missing at /home/peter/result/head or not executable
hostid missing at /home/peter/result/hostid or not executable
id missing at /home/peter/result/id or not executable
install missing at /home/peter/result/install or not executable
join missing at /home/peter/result/join or not executable
kill missing at /home/peter/result/kill or not executable
link missing at /home/peter/result/link or not executable
ln missing at /home/peter/result/ln or not executable
logname missing at /home/peter/result/logname or not executable
ls missing at /home/peter/result/ls or not executable
md5sum missing at /home/peter/result/md5sum or not executable
mkdir missing at /home/peter/result/mkdir or not executable
mkfifo missing at /home/peter/result/mkfifo or not executable
mknod missing at /home/p
pathchk missing at /home/peter/result/pathchk or not executable
pinky missing at /home/peter/result/pinky or not executable
pr missing at /home/peter/result/pr or not executable
printenv missing at /home/peter/result/printenv or not executable
printf missing at /home/peter/result/printf or not executable
ptx missing at /home/peter/result/ptx or not executable
pwd missing at /home/peter/result/pwd or not executable
readlink missing at /home/peter/result/readlink or not executable
rm missing at /home/peter/result/rm or not executable
rmdir missing at /home/peter/result/rmdir or not executable
seq missing at /home/peter/result/seq or not executable
sha1sum missing at /home/peter/result/sha1sum or not executable
shred missing at /home/peter/result/shred or not executable
sleep missing at /home/peter/result/sleep or not executable
sort missing at /home/peter/result/sort or not executable
split missing at /home/peter/result/split or not executable
stat missing at /home/peter/result/stat or not executable
stty missing at /home/peter/result/stty or not executable
sum missing at /home/peter/result/sum or not executable
sync missing at /home/peter/result/sync or not executable
tac missing at /home/peter/result/tac or not executable
tail missing at /home/peter/result/tail or not executable
tee missing at /home/peter/result/tee or not executable
test missing at /home/peter/result/test or not executable
touch missing at /home/peter/result/touch or not executable
tr missing at /home/peter/result/tr or not executable
true missing at /home/peter/result/true or not executable
tsort missing at /home/peter/result/tsort or not executable
tty missing at /home/peter/result/tty or not executable
uname missing at /home/peter/result/uname or not executable
unexpand missing at /home/peter/result/unexpand or not executable
uniq missing at /home/peter/result/uniq or not executable
unlink missing at /home/peter/result/unlink or not executable
uptime missing at /home/peter/result/uptime or not executable
users missing at /home/peter/result/users or not executable
vdir missing at /home/peter/result/vdir or not executable
wc missing at /home/peter/result/wc or not executable
who missing at /home/peter/result/who or not executable
whoami missing at /home/peter/result/whoami or not executable
yes missing at /home/peter/result/yes or not executable
sha1sum version mismatch: expected 5.0 got
sha1sum output mismatch: expected 648a6a6ffffdaa0badb23b8baf90b6168dd16b3a got