Summary
Performance
Cost$0.592
Total elapsed time7m45s
LLM inference time3m23s
Command execution time4m22s
Commands executed44
All details >
Attempt ID htqn1ylnw2hnt Attempt group run-16-09-22-05
Revision fb5c74bd2fee AWS Instance m8i.2xlarge
Start time 2025-09-16T20:21:26.286Z End time 2025-09-16T20:29:12.230Z
Task coreutils-old-version Environment ubuntu-22.04-amd64-offline
Model claude-sonnet-4-thinking-16k logo claude-sonnet-4-thinking-16k OpenRouter slug anthropic/claude-sonnet-4
Temperature 1 Explicit prompt caching true
User msg after tool call true Max tool calls 90
Total timeout seconds 1200 Single command timeout 600
Cost $0.592 Duration 7m45s
LLM inference time 3m23s Command execution time 4m22s
Final context tokens 39,701 Total output tokens 8,027
Output reasoning tokens 3,400 Messages 91
Assistant messages 45 User messages 1
System messages 1 Commands executed 44
Task
Task: coreutils-old-version

GNU coreutils 5.0 (from 2003) is a collection of Linux utilities like ls, cp, mv, etc.
Project link: gnu.org/software/coreutils

Task:
Compile and install all coreutils utilities to a specific location.

Difficulties:
The source is very old (2003) and requires heavy patching.

Environment:
Ubuntu 22.04 on amd64, without internet access.

Execution log
SYSTEM

You are a package-building specialist operating a Ubuntu 22.04 bash shell via one tool: run_terminal_cmd.
The current working directory of every run_terminal_cmd is /home/peter.
Execution rules:
- Always pass non-interactive flags for any command that could prompt (e.g., -y, --yes, DEBIAN_FRONTEND=noninteractive).
- Don't include any newlines in the command.
- The environment is offline, assume you have all the necessary tools already installed.
If you encounter any errors or issues while doing the user's request, you must fix them and continue the task.
At the end verify you did the user request correctly.

USER

You are given a coreutils v5.0 source code at /home/peter/coreutils.tar.gz. Please compile the coreutils package and install it to /home/peter/result. Create symlinks for all coreutils utilities so they are available under /home/peter/result/. For example: /home/peter/result/uptime should point to the compiled uptime binary.

ASSISTANT
Show reasoning

The user wants me to:
1. Extract the coreutils v5.0 source code from /home/peter/coreutils.tar.gz
2. Compile the coreutils package
3. Install it to /home/peter/result
4. Create symlinks for all utilities so they're available as /home/peter/result/

Let me break this down step by step:

1. First, I need to extract the tarball
2. Enter the extracted directory
3. Configure the build (likely with ./configure --prefix=/home/peter/result)
4. Compile with make
5. Install with make install
6. Create symlinks for all utilities

Let me start by checking what's in the current directory and extracting the tarball.

I'll help you compile and install the coreutils package. Let me start by extracting the source code and then proceed with the compilation and installation process.

compile-bench> ls -la /home/peter/
total 5904
drwxr-x--- 1 peter peter    4096 Sep 16 20:21 .
drwxr-xr-x 1 root  root     4096 Sep 15 11:21 ..
-rw-r--r-- 1 peter peter     220 Jan  6  2022 .bash_logout
-rw-r--r-- 1 peter peter    3771 Jan  6  2022 .bashrc
-rw-r--r-- 1 peter peter     807 Jan  6  2022 .profile
-rw-r--r-- 1 peter peter 6020616 Sep 16 20:21 coreutils.tar.gz
8 lines
ASSISTANT
Show reasoning

The user wants me to compile and install coreutils v5.0 from the source code at /home/peter/coreutils.tar.gz. I need to:

1. Extract the tar.gz file
2. Configure the build
3. Compile the coreutils
4. Install it to /home/peter/result
5. Create symlinks for all utilities under /home/peter/result/

Let me start by extracting the source code.

Now let me extract the coreutils source code and proceed with the compilation:

compile-bench> cd /home/peter && tar -xzf coreutils.tar.gz
[empty output]
ASSISTANT
Show reasoning

The user wants me to compile coreutils v5.0 and install it. Let me check what was extracted and then proceed with the compilation process.

compile-bench> ls -la /home/peter/
total 5908
drwxr-x---  1 peter peter    4096 Sep 16 20:21 .
drwxr-xr-x  1 root  root     4096 Sep 15 11:21 ..
-rw-r--r--  1 peter peter     220 Jan  6  2022 .bash_logout
-rw-r--r--  1 peter peter    3771 Jan  6  2022 .bashrc
-rw-r--r--  1 peter peter     807 Jan  6  2022 .profile
drwxr-xr-x 11 peter peter    4096 Apr  2  2003 coreutils-5.0
-rw-r--r--  1 peter peter 6020616 Sep 16 20:21 coreutils.tar.gz
9 lines
ASSISTANT
Show reasoning

Good, the coreutils source has been extracted to /home/peter/coreutils-5.0. Now I need to:

1. Enter the coreutils directory
2. Configure the build (usually with ./configure)
3. Compile it (make)
4. Install it to /home/peter/result
5. Create symlinks for all utilities

Let me start by exploring the directory structure and then configure the build.

compile-bench> cd /home/peter/coreutils-5.0 && ls -la
total 1708
drwxr-xr-x 11 peter peter    4096 Apr  2  2003 .
drwxr-x---  1 peter peter    4096 Sep 16 20:21 ..
-rw-r--r--  1 peter peter       0 Apr  2  2003 .kludge-stamp
-rw-r--r--  1 peter peter       7 Mar 30  2003 .prev-version
-rw-r--r--  1 peter peter   29291 Feb 20  2003 ABOUT-NLS
-rw-r--r--  1 peter peter    2819 Oct  3  2002 AUTHORS
-rw-r--r--  1 peter peter   17992 Jan 12  2000 COPYING
-rw-r--r--  1 peter peter   68636 Apr  2  2003 ChangeLog
-rw-r--r--  1 peter peter    1132 Jan 31  2003 GNUmakefile
-rw-r--r--  1 peter peter    9414 Feb 16  2002 INSTALL
-rw-r--r--  1 peter peter    1506 Mar 31  2003 Makefile.am
-rw-r--r--  1 peter peter     736 Mar 20  2003 Makefile.cfg
-rw-r--r--  1 peter peter   20238 Apr  2  2003 Makefile.in
-rw-r--r--  1 peter peter   12314 Apr  1  2003 Makefile.maint
-rw-r--r--  1 peter peter   19177 Apr  2  2003 NEWS
-rw-r--r--  1 peter peter    5949 Mar 29  2003 README
-rw-r--r--  1 peter peter   22800 Apr  2  2003 THANKS
-rw-r--r--  1 peter peter    1840 Feb 19  2003 THANKS-to-translators
-rw-r--r--  1 peter peter     121 Aug 26  2002 THANKStt.in
-rw-r--r--  1 peter peter    2931 Apr  2  2003 TODO
-rw-r--r--  1 peter peter  207137 Apr  2  2003 aclocal.m4
-rwxr-xr-x  1 peter peter    8490 Mar 20  2003 announce-gen
drwxr-xr-x  2 peter peter    4096 Apr  2  2003 config
-rw-r--r--  1 peter peter   40903 Apr  2  2003 config.hin
-rwxr-xr-x  1 peter peter 1159722 Apr  2  2003 configure
-rw-r--r--  1 peter peter    9317 Mar 30  2003 configure.ac
drwxr-xr-x  2 peter peter    4096 Apr  2  2003 doc
drwxr-xr-x  2 peter peter   12288 Apr  2  2003 lib
drwxr-xr-x  2 peter peter    4096 Apr  2  2003 m4
drwxr-xr-x  2 peter peter    4096 Apr  2  2003 man
drwxr-xr-x  5 peter peter    4096 Apr  2  2003 old
drwxr-xr-x  2 peter peter    4096 Apr  2  2003 po
drwxr-xr-x  2 peter peter    4096 Apr  2  2003 src
drwxr-xr-x 45 peter peter    4096 Apr  2  2003 tests
36 lines
ASSISTANT
Show reasoning

The user wants me to compile coreutils v5.0 and install it to /home/peter/result, then create symlinks for all utilities. I can see that the source code has been extracted to /home/peter/coreutils-5.0.

Now I need to:
1. Configure the build system
2. Compile the code
3. Install it to /home/peter/result
4. Create symlinks for all utilities

Let me start by configuring the build with the target directory.

Now let me configure and compile the coreutils package. I'll create the result directory first and then configure the build to install there:

compile-bench> mkdir -p /home/peter/result
[empty output]
ASSISTANT
Show reasoning

Now I need to configure the coreutils package to install to /home/peter/result. I'll run the configure script with the appropriate prefix.

compile-bench> cd /home/peter/coreutils-5.0 && ./configure --prefix=/home/peter/result
checking build system type... x86_64-unknown-linux-gnu
checking host system type... x86_64-unknown-linux-gnu
checking for a BSD-compatible install... /usr/bin/install -c
checking whether build environment is sane... yes
checking for gawk... no
checking for mawk... mawk
checking whether make sets $(MAKE)... yes
checking for perl5.003 or newer... yes
checking for gcc... gcc
checking for C compiler default output... a.out
checking whether the C compiler works... yes
checking whether we are cross compiling... no
checking for suffix of executables... 
checking for suffix of object files... o
checking whether we are using the GNU C compiler... yes
checking whether gcc accepts -g... yes
checking for gcc option to accept ANSI C... none needed
checking for style of include used by make... GNU
checking dependency style of gcc... gcc3
checking how to run the C preprocessor... gcc -E
checking for egrep... grep -E
checking whether gcc needs -traditional... no
checking for ranlib... ranlib
checking whether ln -s works... yes
checking for AIX... no
checking for ANSI C header files... yes
checking for sys/types.h... yes
checking for sys/stat.h... yes
checking for stdlib.h... yes
checking for string.h... yes
checking for memory.h... yes
checking for strings.h... yes
checking for inttypes.h... yes
checking for stdint.h... yes
checking for unistd.h... yes
checking minix/config.h usability... no
checking minix/config.h presence... no
checking for minix/config.h... no
checking for uname... yes
checking for chroot... yes
checking for gethostid... yes
checking for strerror in -lcposix... no
checking for special C compiler options needed for large files... no
checking for _FILE_OFFSET_BITS value needed for large files... no
checking for _LARGE_FILES value needed for large files... no
checking for gcc option to accept ANSI C... none needed
checking for function prototypes... yes
checking for ANSI C header files... (cached) yes
checking for string.h... (cached) yes
checking whether byte ordering is bigendian... no
checking for an ANSI C-conforming const... yes
checking for working volatile... yes
checking for inline... inline
checking for working long double with more range or precision than double... no
checking errno.h usability... yes
checking errno.h presence... yes
checking for errno.h... yes
checking fcntl.h usability... yes
checking fcntl.h presence... yes
checking for fcntl.h... yes
checking float.h usability... yes
checking float.h presence... yes
checking for float.h... yes
checking hurd.h usability... no
checking hurd.h presence... no
checking for hurd.h... no
checking limits.h usability... yes
checking limits.h presence... yes
checking for limits.h... yes
checking for memory.h... (cached) yes
[command output truncated]
checking shadow.h presence... yes
checking for shadow.h... yes
checking for struct spwd.sp_pwdp... yes
checking for getspnam... yes
checking for library containing crypt... -lcrypt
checking for msgfmt... no
checking for gmsgfmt... :
checking for xgettext... no
checking for msgmerge... no
checking whether NLS is requested... yes
checking for GNU gettext in libc... yes
configure: creating ./config.status
config.status: creating Makefile
config.status: creating doc/Makefile
config.status: creating lib/Makefile
config.status: creating man/Makefile
config.status: creating m4/Makefile
config.status: creating po/Makefile.in
config.status: creating src/Makefile
config.status: creating tests/Makefile
config.status: creating tests/basename/Makefile
config.status: creating tests/chgrp/Makefile
config.status: creating tests/chmod/Makefile
config.status: creating tests/chown/Makefile
config.status: creating tests/cp/Makefile
config.status: creating tests/cut/Makefile
config.status: creating tests/date/Makefile
config.status: creating tests/dd/Makefile
config.status: creating tests/dircolors/Makefile
config.status: creating tests/du/Makefile
config.status: creating tests/expr/Makefile
config.status: creating tests/factor/Makefile
config.status: creating tests/fmt/Makefile
config.status: creating tests/head/Makefile
config.status: creating tests/install/Makefile
config.status: creating tests/join/Makefile
config.status: creating tests/ln/Makefile
config.status: creating tests/ls-2/Makefile
config.status: creating tests/ls/Makefile
config.status: creating tests/md5sum/Makefile
config.status: creating tests/misc/Makefile
config.status: creating tests/mkdir/Makefile
config.status: creating tests/mv/Makefile
config.status: creating tests/od/Makefile
config.status: creating tests/pr/Makefile
config.status: creating tests/rm/Makefile
config.status: creating tests/rmdir/Makefile
config.status: creating tests/seq/Makefile
config.status: creating tests/sha1sum/Makefile
config.status: creating tests/shred/Makefile
config.status: creating tests/sort/Makefile
config.status: creating tests/stty/Makefile
config.status: creating tests/sum/Makefile
config.status: creating tests/tac/Makefile
config.status: creating tests/tail-2/Makefile
config.status: creating tests/tail/Makefile
config.status: creating tests/test/Makefile
config.status: creating tests/touch/Makefile
config.status: creating tests/tr/Makefile
config.status: creating tests/tsort/Makefile
config.status: creating tests/unexpand/Makefile
config.status: creating tests/uniq/Makefile
config.status: creating tests/wc/Makefile
config.status: creating config.h
config.status: linking ./lib/ftw_.h to lib/ftw.h
config.status: executing depfiles commands
config.status: executing default-1 commands
config.status: creating po/POTFILES
config.status: creating po/Makefile
141 lines
ASSISTANT
Show reasoning

The configure step completed successfully. Now I need to compile the coreutils package using make.

Now let me compile the coreutils package:

compile-bench> cd /home/peter/coreutils-5.0 && make
make  all-recursive
make[1]: Entering directory '/home/peter/coreutils-5.0'
Making all in lib
make[2]: Entering directory '/home/peter/coreutils-5.0/lib'
make  all-am
make[3]: Entering directory '/home/peter/coreutils-5.0/lib'
if gcc -DLIBDIR=\"/home/peter/result/lib\" -DHAVE_CONFIG_H -I. -I. -I.. -I.. -I.    -g -O2 -MT acl.o -MD -MP -MF ".deps/acl.Tpo" \
  -c -o acl.o `test -f 'acl.c' || echo './'`acl.c; \
then mv ".deps/acl.Tpo" ".deps/acl.Po"; \
else rm -f ".deps/acl.Tpo"; exit 1; \
fi
if gcc -DLIBDIR=\"/home/peter/result/lib\" -DHAVE_CONFIG_H -I. -I. -I.. -I.. -I.    -g -O2 -MT getdate.o -MD -MP -MF ".deps/getdate.Tpo" \
  -c -o getdate.o `test -f 'getdate.c' || echo './'`getdate.c; \
then mv ".deps/getdate.Tpo" ".deps/getdate.Po"; \
else rm -f ".deps/getdate.Tpo"; exit 1; \
fi
if gcc -DLIBDIR=\"/home/peter/result/lib\" -DHAVE_CONFIG_H -I. -I. -I.. -I.. -I.    -g -O2 -MT posixtm.o -MD -MP -MF ".deps/posixtm.Tpo" \
  -c -o posixtm.o `test -f 'posixtm.c' || echo './'`posixtm.c; \
then mv ".deps/posixtm.Tpo" ".deps/posixtm.Po"; \
else rm -f ".deps/posixtm.Tpo"; exit 1; \
fi
if gcc -DLIBDIR=\"/home/peter/result/lib\" -DHAVE_CONFIG_H -I. -I. -I.. -I.. -I.    -g -O2 -MT posixver.o -MD -MP -MF ".deps/posixver.Tpo" \
  -c -o posixver.o `test -f 'posixver.c' || echo './'`posixver.c; \
then mv ".deps/posixver.Tpo" ".deps/posixver.Po"; \
else rm -f ".deps/posixver.Tpo"; exit 1; \
fi
if gcc -DLIBDIR=\"/home/peter/result/lib\" -DHAVE_CONFIG_H -I. -I. -I.. -I.. -I.    -g -O2 -MT strftime.o -MD -MP -MF ".deps/strftime.Tpo" \
  -c -o strftime.o `test -f 'strftime.c' || echo './'`strftime.c; \
then mv ".deps/strftime.Tpo" ".deps/strftime.Po"; \
else rm -f ".deps/strftime.Tpo"; exit 1; \
fi
if gcc -DLIBDIR=\"/home/peter/result/lib\" -DHAVE_CONFIG_H -I. -I. -I.. -I.. -I.    -g -O2 -MT getopt.o -MD -MP -MF ".deps/getopt.Tpo" \
  -c -o getopt.o `test -f 'getopt.c' || echo './'`getopt.c; \
then mv ".deps/getopt.Tpo" ".deps/getopt.Po"; \
else rm -f ".deps/getopt.Tpo"; exit 1; \
fi
if gcc -DLIBDIR=\"/home/peter/result/lib\" -DHAVE_CONFIG_H -I. -I. -I.. -I.. -I.    -g -O2 -MT getopt1.o -MD -MP -MF ".deps/getopt1.Tpo" \
  -c -o getopt1.o `test -f 'getopt1.c' || echo './'`getopt1.c; \
then mv ".deps/getopt1.Tpo" ".deps/getopt1.Po"; \
else rm -f ".deps/getopt1.Tpo"; exit 1; \
fi
if gcc -DLIBDIR=\"/home/peter/result/lib\" -DHAVE_CONFIG_H -I. -I. -I.. -I.. -I.    -g -O2 -MT hash.o -MD -MP -MF ".deps/hash.Tpo" \
  -c -o hash.o `test -f 'hash.c' || echo './'`hash.c; \
then mv ".deps/hash.Tpo" ".deps/hash.Po"; \
else rm -f ".deps/hash.Tpo"; exit 1; \
fi
if gcc -DLIBDIR=\"/home/peter/result/lib\" -DHAVE_CONFIG_H -I. -I. -I.. -I.. -I.    -g -O2 -MT hash-pjw.o -MD -MP -MF ".deps/hash-pjw.Tpo" \
  -c -o hash-pjw.o `test -f 'hash-pjw.c' || echo './'`hash-pjw.c; \
then mv ".deps/hash-pjw.Tpo" ".deps/hash-pjw.Po"; \
else rm -f ".deps/hash-pjw.Tpo"; exit 1; \
fi
if gcc -DLIBDIR=\"/home/peter/result/lib\" -DHAVE_CONFIG_H -I. -I. -I..
[command output truncated]
                    ^~~~~~~~~~~~~~~~~~~~~~~~~~~~~~~~~~~~~~~~~~~~~~~
pathchk.c:381:20: note: in expansion of macro '_'
  381 |       error (0, 0, _("path `%s' has length %d; exceeds limit of %ld"),
      |                    ^
pathchk.c:381:45: note: format string is defined here
  381 |       error (0, 0, _("path `%s' has length %d; exceeds limit of %ld"),
      |                                            ~^
      |                                             |
      |                                             int
      |                                            %ld
gcc  -g -O2   -o pathchk  pathchk.o ../lib/libfetish.a  ../lib/libfetish.a 
if gcc -DLOCALEDIR=\"/home/peter/result/share/locale\" -DSHAREDIR=\"/home/peter/result/share\" -DHAVE_CONFIG_H -I. -I. -I.. -I.. -I. -I../lib -I../lib    -g -O2 -MT printenv.o -MD -MP -MF ".deps/printenv.Tpo" \
  -c -o printenv.o `test -f 'printenv.c' || echo './'`printenv.c; \
then mv ".deps/printenv.Tpo" ".deps/printenv.Po"; \
else rm -f ".deps/printenv.Tpo"; exit 1; \
fi
gcc  -g -O2   -o printenv  printenv.o ../lib/libfetish.a  ../lib/libfetish.a 
if gcc -DLOCALEDIR=\"/home/peter/result/share/locale\" -DSHAREDIR=\"/home/peter/result/share\" -DHAVE_CONFIG_H -I. -I. -I.. -I.. -I. -I../lib -I../lib    -g -O2 -MT printf.o -MD -MP -MF ".deps/printf.Tpo" \
  -c -o printf.o `test -f 'printf.c' || echo './'`printf.c; \
then mv ".deps/printf.Tpo" ".deps/printf.Po"; \
else rm -f ".deps/printf.Tpo"; exit 1; \
fi
gcc  -g -O2   -o printf  printf.o ../lib/libfetish.a  ../lib/libfetish.a   
if gcc -DLOCALEDIR=\"/home/peter/result/share/locale\" -DSHAREDIR=\"/home/peter/result/share\" -DHAVE_CONFIG_H -I. -I. -I.. -I.. -I. -I../lib -I../lib    -g -O2 -MT pwd.o -MD -MP -MF ".deps/pwd.Tpo" \
  -c -o pwd.o `test -f 'pwd.c' || echo './'`pwd.c; \
then mv ".deps/pwd.Tpo" ".deps/pwd.Po"; \
else rm -f ".deps/pwd.Tpo"; exit 1; \
fi
gcc  -g -O2   -o pwd  pwd.o ../lib/libfetish.a  ../lib/libfetish.a 
if gcc -DLOCALEDIR=\"/home/peter/result/share/locale\" -DSHAREDIR=\"/home/peter/result/share\" -DHAVE_CONFIG_H -I. -I. -I.. -I.. -I. -I../lib -I../lib    -g -O2 -MT seq.o -MD -MP -MF ".deps/seq.Tpo" \
  -c -o seq.o `test -f 'seq.c' || echo './'`seq.c; \
then mv ".deps/seq.Tpo" ".deps/seq.Po"; \
else rm -f ".deps/seq.Tpo"; exit 1; \
fi
gcc  -g -O2   -o seq  seq.o ../lib/libfetish.a  ../lib/libfetish.a  
/usr/bin/ld: seq.o: in function `get_width_format':
/home/peter/coreutils-5.0/src/seq.c:253: undefined reference to `floor'
/usr/bin/ld: /home/peter/coreutils-5.0/src/seq.c:259: undefined reference to `floor'
collect2: error: ld returned 1 exit status
make[3]: *** [Makefile:1033: seq] Error 1
make[3]: Leaving directory '/home/peter/coreutils-5.0/src'
make[2]: *** [Makefile:815: all] Error 2
make[2]: Leaving directory '/home/peter/coreutils-5.0/src'
make[1]: *** [Makefile:244: all-recursive] Error 1
make[1]: Leaving directory '/home/peter/coreutils-5.0'
make: *** [Makefile:199: all] Error 2
100 lines
ASSISTANT
Show reasoning

I see there's a compilation error with the seq utility - it's missing the math library link. The error shows:

```
/usr/bin/ld: seq.o: in function `get_width_format':
/home/peter/coreutils-5.0/src/seq.c:253: undefined reference to `floor'
/home/peter/coreutils-5.0/src/seq.c:259: undefined reference to `floor'
```

This is a common issue where the math library (-lm) is not being linked. Let me check the configure options or see if I can fix this by reconfiguring with proper LDFLAGS or by editing the Makefile.

Let me first try to reconfigure with LDFLAGS to include the math library.

I see there's a compilation error with the seq utility missing the math library. Let me reconfigure with the proper flags to include the math library:

compile-bench> cd /home/peter/coreutils-5.0 && make clean
Making clean in tests
make[1]: Entering directory '/home/peter/coreutils-5.0/tests'
Making clean in wc
make[2]: Entering directory '/home/peter/coreutils-5.0/tests/wc'
test -z "a0.O a0.E a1.O a1.E a2.O a2.E a3.O a3.E a4.O a4.E a5.O a5.E a6.O a6.E a7.O a7.E a8.O a8.E a9.O a9.E b0.O b0.E b1.O b1.E c0.O c0.E c1.O c1.E c2.O c2.E" || rm -f a0.O a0.E a1.O a1.E a2.O a2.E a3.O a3.E a4.O a4.E a5.O a5.E a6.O a6.E a7.O a7.E a8.O a8.E a9.O a9.E b0.O b0.E b1.O b1.E c0.O c0.E c1.O c1.E c2.O c2.E
make[2]: Leaving directory '/home/peter/coreutils-5.0/tests/wc'
Making clean in uniq
make[2]: Entering directory '/home/peter/coreutils-5.0/tests/uniq'
test -z "1.O 1.E 2.O 2.E 3.O 3.E 4.O 4.E 5.O 5.E 6.O 6.E 7.O 7.E 8.O 8.E 9.O 9.E 10.O 10.E 11.O 11.E 12.O 12.E 13.O 13.E 20.O 20.E 21.O 21.E 22.O 22.E 23.O 23.E obs30.O obs30.E 31.O 31.E 32.O 32.E 33.O 33.E 34.O 34.E 35.O 35.E obs40.O obs40.E obs41.O obs41.E 42.O 42.E 43.O 43.E obs44.O obs44.E obs45.O obs45.E 50.O 50.E 51.O 51.E 52.O 52.E 53.O 53.E 54.O 54.E 55.O 55.E 56.O 56.E 57.O 57.E 60.O 60.E 61.O 61.E 62.O 62.E 63.O 63.E 64.O 64.E 65.O 65.E 90.O 90.E 91.O 91.E 92.O 92.E 93.O 93.E 94.O 94.E 101.O 101.E 102.O 102.E 110.O 110.E 111.O 111.E 112.O 112.E 113.O 113.E 114.O 114.E 115.O 115.E 116.O 116.E 117.O 117.E 118.O 118.E 119.O 119.E" || rm -f 1.O 1.E 2.O 2.E 3.O 3.E 4.O 4.E 5.O 5.E 6.O 6.E 7.O 7.E 8.O 8.E 9.O 9.E 10.O 10.E 11.O 11.E 12.O 12.E 13.O 13.E 20.O 20.E 21.O 21.E 22.O 22.E 23.O 23.E obs30.O obs30.E 31.O 31.E 32.O 32.E 33.O 33.E 34.O 34.E 35.O 35.E obs40.O obs40.E obs41.O obs41.E 42.O 42.E 43.O 43.E obs44.O obs44.E obs45.O obs45.E 50.O 50.E 51.O 51.E 52.O 52.E 53.O 53.E 54.O 54.E 55.O 55.E 56.O 56.E 57.O 57.E 60.O 60.E 61.O 61.E 62.O 62.E 63.O 63.E 64.O 64.E 65.O 65.E 90.O 90.E 91.O 91.E 92.O 92.E 93.O 93.E 94.O 94.E 101.O 101.E 102.O 102.E 110.O 110.E 111.O 111.E 112.O 112.E 113.O 113.E 114.O 114.E 115.O 115.E 116.O 116.E 117.O 117.E 118.O 118.E 119.O 119.E
make[2]: Leaving directory '/home/peter/coreutils-5.0/tests/uniq'
Making clean in unexpand
make[2]: Entering directory '/home/peter/coreutils-5.0/tests/unexpand'
make[2]: Nothing to be done for 'clean'.
make[2]: Leaving directory '/home/peter/coreutils-5.0/tests/unexpand'
Making clean in tsort
make[2]: Entering directory '/home/peter/coreutils-5.0/tests/tsort'
make[2]: Nothing to be done for 'clean'.
make[2]: Leaving directory '/home/peter/coreutils-5.0/tests/tsort'
Making clean in tr
make[2]: Entering directory '/home/peter/coreutils-5.0/tests/tr'
test -z "1.O 1.E 2.O 2.E 3.O 3.E 4.O 4.E 5.O 5.E 6.O 6.E 7.O 7.E 8.O 8.E 9.O 9.E a.O a.E b.O b.E c.O c.E d.O d.E e.O e.E f.O f.E g.O g.E h.O h.E i.O i.E j.O j.E k.O k.E l.O l.E m.O m.E n.O n.E o.O o.E p.O p.E q.O q.E r.O r.E s.O s.E t.O t.E u.O u.E v.O v.E w.O w.E x.O x.E y.O y.E z.O z.E range-a-a.O range-a-a.E null.O null.E upcase.O upcase.E dncase.O dncase.E rep-cclass.O rep-cclass.E rep-1.O rep-1.E rep-2.O rep-2.E rep-3.O rep-3.E o-rep-1.O o-rep-1.E o-rep-2.O o-rep-2.E esc.O esc.E ross-0
[command output truncated]
-fr *.o
make[1]: Leaving directory '/home/peter/coreutils-5.0/po'
Making clean in m4
make[1]: Entering directory '/home/peter/coreutils-5.0/m4'
make[1]: Nothing to be done for 'clean'.
make[1]: Leaving directory '/home/peter/coreutils-5.0/m4'
Making clean in man
make[1]: Entering directory '/home/peter/coreutils-5.0/man'
make[1]: Nothing to be done for 'clean'.
make[1]: Leaving directory '/home/peter/coreutils-5.0/man'
Making clean in doc
make[1]: Entering directory '/home/peter/coreutils-5.0/doc'
rm -f coreutils.aux coreutils.cp coreutils.cps coreutils.fl coreutils.fn \
  coreutils.ky coreutils.log coreutils.op coreutils.pg \
  coreutils.tmp coreutils.toc coreutils.tp coreutils.tps \
  coreutils.vr coreutils.dvi coreutils.pdf coreutils.ps
rm -f vti.tmp
make[1]: Leaving directory '/home/peter/coreutils-5.0/doc'
Making clean in src
make[1]: Entering directory '/home/peter/coreutils-5.0/src'
test -z "chgrp chown chmod cp dd dircolors du ginstall link ln dir vdir ls mkdir mkfifo mknod mv readlink rm rmdir shred stat sync touch unlink cat cksum comm csplit cut expand fmt fold head join md5sum nl od paste pr ptx sha1sum sort split sum tac tail tr tsort unexpand uniq wc basename date dirname echo env expr factor false hostname id kill logname pathchk printenv printf pwd seq sleep tee test true tty whoami yes  uname chroot hostid nice pinky users who uptime stty df" || rm -f chgrp chown chmod cp dd dircolors du ginstall link ln dir vdir ls mkdir mkfifo mknod mv readlink rm rmdir shred stat sync touch unlink cat cksum comm csplit cut expand fmt fold head join md5sum nl od paste pr ptx sha1sum sort split sum tac tail tr tsort unexpand uniq wc basename date dirname echo env expr factor false hostname id kill logname pathchk printenv printf pwd seq sleep tee test true tty whoami yes  uname chroot hostid nice pinky users who uptime stty df > /dev/null 2>&1 || /bin/rm -f chgrp chown chmod cp dd dircolors du ginstall link ln dir vdir ls mkdir mkfifo mknod mv readlink rm rmdir shred stat sync touch unlink cat cksum comm csplit cut expand fmt fold head join md5sum nl od paste pr ptx sha1sum sort split sum tac tail tr tsort unexpand uniq wc basename date dirname echo env expr factor false hostname id kill logname pathchk printenv printf pwd seq sleep tee test true tty whoami yes  uname chroot hostid nice pinky users who uptime stty df
test -z "groups  nohup su" || rm -f groups  nohup su
rm -f *.o core *.core
make[1]: Leaving directory '/home/peter/coreutils-5.0/src'
Making clean in lib
make[1]: Entering directory '/home/peter/coreutils-5.0/lib'
test -z "charset.alias ref-add.sed ref-del.sed" || rm -f charset.alias ref-add.sed ref-del.sed
test -z "libfetish.a" || rm -f libfetish.a
rm -f *.o core *.core
make[1]: Leaving directory '/home/peter/coreutils-5.0/lib'
Making clean in .
make[1]: Entering directory '/home/peter/coreutils-5.0'
make[1]: Nothing to be done for 'clean-am'.
make[1]: Leaving directory '/home/peter/coreutils-5.0'
57 lines
ASSISTANT
Show reasoning

The compilation failed due to a missing math library reference for the seq utility. I need to reconfigure the build with the LDFLAGS to include the math library (-lm). Let me set the proper environment variables and reconfigure.

compile-bench> cd /home/peter/coreutils-5.0 && LDFLAGS="-lm" ./configure --prefix=/home/peter/result
checking build system type... x86_64-unknown-linux-gnu
checking host system type... x86_64-unknown-linux-gnu
checking for a BSD-compatible install... /usr/bin/install -c
checking whether build environment is sane... yes
checking for gawk... no
checking for mawk... mawk
checking whether make sets $(MAKE)... yes
checking for perl5.003 or newer... yes
checking for gcc... gcc
checking for C compiler default output... a.out
checking whether the C compiler works... yes
checking whether we are cross compiling... no
checking for suffix of executables... 
checking for suffix of object files... o
checking whether we are using the GNU C compiler... yes
checking whether gcc accepts -g... yes
checking for gcc option to accept ANSI C... none needed
checking for style of include used by make... GNU
checking dependency style of gcc... gcc3
checking how to run the C preprocessor... gcc -E
checking for egrep... grep -E
checking whether gcc needs -traditional... no
checking for ranlib... ranlib
checking whether ln -s works... yes
checking for AIX... no
checking for ANSI C header files... yes
checking for sys/types.h... yes
checking for sys/stat.h... yes
checking for stdlib.h... yes
checking for string.h... yes
checking for memory.h... yes
checking for strings.h... yes
checking for inttypes.h... yes
checking for stdint.h... yes
checking for unistd.h... yes
checking minix/config.h usability... no
checking minix/config.h presence... no
checking for minix/config.h... no
checking for uname... yes
checking for chroot... yes
checking for gethostid... yes
checking for strerror in -lcposix... no
checking for special C compiler options needed for large files... no
checking for _FILE_OFFSET_BITS value needed for large files... no
checking for _LARGE_FILES value needed for large files... no
checking for gcc option to accept ANSI C... none needed
checking for function prototypes... yes
checking for ANSI C header files... (cached) yes
checking for string.h... (cached) yes
checking whether byte ordering is bigendian... no
checking for an ANSI C-conforming const... yes
checking for working volatile... yes
checking for inline... inline
checking for working long double with more range or precision than double... no
checking errno.h usability... yes
checking errno.h presence... yes
checking for errno.h... yes
checking fcntl.h usability... yes
checking fcntl.h presence... yes
checking for fcntl.h... yes
checking float.h usability... yes
checking float.h presence... yes
checking for float.h... yes
checking hurd.h usability... no
checking hurd.h presence... no
checking for hurd.h... no
checking limits.h usability... yes
checking limits.h presence... yes
checking for limits.h... yes
checking for memory.h... (cached) yes
[command output truncated]
checking for shadow.h... yes
checking for struct spwd.sp_pwdp... yes
checking for getspnam... yes
checking for library containing crypt... -lcrypt
checking for msgfmt... no
checking for gmsgfmt... :
checking for xgettext... no
checking for msgmerge... no
checking whether NLS is requested... yes
checking for GNU gettext in libc... yes
configure: creating ./config.status
config.status: creating Makefile
config.status: creating doc/Makefile
config.status: creating lib/Makefile
config.status: creating man/Makefile
config.status: creating m4/Makefile
config.status: creating po/Makefile.in
config.status: creating src/Makefile
config.status: creating tests/Makefile
config.status: creating tests/basename/Makefile
config.status: creating tests/chgrp/Makefile
config.status: creating tests/chmod/Makefile
config.status: creating tests/chown/Makefile
config.status: creating tests/cp/Makefile
config.status: creating tests/cut/Makefile
config.status: creating tests/date/Makefile
config.status: creating tests/dd/Makefile
config.status: creating tests/dircolors/Makefile
config.status: creating tests/du/Makefile
config.status: creating tests/expr/Makefile
config.status: creating tests/factor/Makefile
config.status: creating tests/fmt/Makefile
config.status: creating tests/head/Makefile
config.status: creating tests/install/Makefile
config.status: creating tests/join/Makefile
config.status: creating tests/ln/Makefile
config.status: creating tests/ls-2/Makefile
config.status: creating tests/ls/Makefile
config.status: creating tests/md5sum/Makefile
config.status: creating tests/misc/Makefile
config.status: creating tests/mkdir/Makefile
config.status: creating tests/mv/Makefile
config.status: creating tests/od/Makefile
config.status: creating tests/pr/Makefile
config.status: creating tests/rm/Makefile
config.status: creating tests/rmdir/Makefile
config.status: creating tests/seq/Makefile
config.status: creating tests/sha1sum/Makefile
config.status: creating tests/shred/Makefile
config.status: creating tests/sort/Makefile
config.status: creating tests/stty/Makefile
config.status: creating tests/sum/Makefile
config.status: creating tests/tac/Makefile
config.status: creating tests/tail-2/Makefile
config.status: creating tests/tail/Makefile
config.status: creating tests/test/Makefile
config.status: creating tests/touch/Makefile
config.status: creating tests/tr/Makefile
config.status: creating tests/tsort/Makefile
config.status: creating tests/unexpand/Makefile
config.status: creating tests/uniq/Makefile
config.status: creating tests/wc/Makefile
config.status: creating config.h
config.status: config.h is unchanged
config.status: linking ./lib/ftw_.h to lib/ftw.h
config.status: executing depfiles commands
config.status: executing default-1 commands
config.status: creating po/POTFILES
config.status: creating po/Makefile
141 lines
ASSISTANT
Show reasoning

The configure ran successfully with LDFLAGS="-lm" to include the math library. Now I need to compile the coreutils again with this configuration.

Now let me compile again with the math library included:

compile-bench> cd /home/peter/coreutils-5.0 && make
make  all-recursive
make[1]: Entering directory '/home/peter/coreutils-5.0'
Making all in lib
make[2]: Entering directory '/home/peter/coreutils-5.0/lib'
make  all-am
make[3]: Entering directory '/home/peter/coreutils-5.0/lib'
if gcc -DLIBDIR=\"/home/peter/result/lib\" -DHAVE_CONFIG_H -I. -I. -I.. -I.. -I.    -g -O2 -MT acl.o -MD -MP -MF ".deps/acl.Tpo" \
  -c -o acl.o `test -f 'acl.c' || echo './'`acl.c; \
then mv ".deps/acl.Tpo" ".deps/acl.Po"; \
else rm -f ".deps/acl.Tpo"; exit 1; \
fi
if gcc -DLIBDIR=\"/home/peter/result/lib\" -DHAVE_CONFIG_H -I. -I. -I.. -I.. -I.    -g -O2 -MT getdate.o -MD -MP -MF ".deps/getdate.Tpo" \
  -c -o getdate.o `test -f 'getdate.c' || echo './'`getdate.c; \
then mv ".deps/getdate.Tpo" ".deps/getdate.Po"; \
else rm -f ".deps/getdate.Tpo"; exit 1; \
fi
if gcc -DLIBDIR=\"/home/peter/result/lib\" -DHAVE_CONFIG_H -I. -I. -I.. -I.. -I.    -g -O2 -MT posixtm.o -MD -MP -MF ".deps/posixtm.Tpo" \
  -c -o posixtm.o `test -f 'posixtm.c' || echo './'`posixtm.c; \
then mv ".deps/posixtm.Tpo" ".deps/posixtm.Po"; \
else rm -f ".deps/posixtm.Tpo"; exit 1; \
fi
if gcc -DLIBDIR=\"/home/peter/result/lib\" -DHAVE_CONFIG_H -I. -I. -I.. -I.. -I.    -g -O2 -MT posixver.o -MD -MP -MF ".deps/posixver.Tpo" \
  -c -o posixver.o `test -f 'posixver.c' || echo './'`posixver.c; \
then mv ".deps/posixver.Tpo" ".deps/posixver.Po"; \
else rm -f ".deps/posixver.Tpo"; exit 1; \
fi
if gcc -DLIBDIR=\"/home/peter/result/lib\" -DHAVE_CONFIG_H -I. -I. -I.. -I.. -I.    -g -O2 -MT strftime.o -MD -MP -MF ".deps/strftime.Tpo" \
  -c -o strftime.o `test -f 'strftime.c' || echo './'`strftime.c; \
then mv ".deps/strftime.Tpo" ".deps/strftime.Po"; \
else rm -f ".deps/strftime.Tpo"; exit 1; \
fi
if gcc -DLIBDIR=\"/home/peter/result/lib\" -DHAVE_CONFIG_H -I. -I. -I.. -I.. -I.    -g -O2 -MT getopt.o -MD -MP -MF ".deps/getopt.Tpo" \
  -c -o getopt.o `test -f 'getopt.c' || echo './'`getopt.c; \
then mv ".deps/getopt.Tpo" ".deps/getopt.Po"; \
else rm -f ".deps/getopt.Tpo"; exit 1; \
fi
if gcc -DLIBDIR=\"/home/peter/result/lib\" -DHAVE_CONFIG_H -I. -I. -I.. -I.. -I.    -g -O2 -MT getopt1.o -MD -MP -MF ".deps/getopt1.Tpo" \
  -c -o getopt1.o `test -f 'getopt1.c' || echo './'`getopt1.c; \
then mv ".deps/getopt1.Tpo" ".deps/getopt1.Po"; \
else rm -f ".deps/getopt1.Tpo"; exit 1; \
fi
if gcc -DLIBDIR=\"/home/peter/result/lib\" -DHAVE_CONFIG_H -I. -I. -I.. -I.. -I.    -g -O2 -MT hash.o -MD -MP -MF ".deps/hash.Tpo" \
  -c -o hash.o `test -f 'hash.c' || echo './'`hash.c; \
then mv ".deps/hash.Tpo" ".deps/hash.Po"; \
else rm -f ".deps/hash.Tpo"; exit 1; \
fi
if gcc -DLIBDIR=\"/home/peter/result/lib\" -DHAVE_CONFIG_H -I. -I. -I.. -I.. -I.    -g -O2 -MT hash-pjw.o -MD -MP -MF ".deps/hash-pjw.Tpo" \
  -c -o hash-pjw.o `test -f 'hash-pjw.c' || echo './'`hash-pjw.c; \
then mv ".deps/hash-pjw.Tpo" ".deps/hash-pjw.Po"; \
else rm -f ".deps/hash-pjw.Tpo"; exit 1; \
fi
if gcc -DLIBDIR=\"/home/peter/result/lib\" -DHAVE_CONFIG_H -I. -I. -I..
[command output truncated]
     ^~~~~~~~~~~~~~~~~~~~~~~~~~~~~~~~~~~~~~~~~~~~~~~
pathchk.c:381:20: note: in expansion of macro '_'
  381 |       error (0, 0, _("path `%s' has length %d; exceeds limit of %ld"),
      |                    ^
pathchk.c:381:45: note: format string is defined here
  381 |       error (0, 0, _("path `%s' has length %d; exceeds limit of %ld"),
      |                                            ~^
      |                                             |
      |                                             int
      |                                            %ld
gcc  -g -O2  -lm -o pathchk  pathchk.o ../lib/libfetish.a  ../lib/libfetish.a 
if gcc -DLOCALEDIR=\"/home/peter/result/share/locale\" -DSHAREDIR=\"/home/peter/result/share\" -DHAVE_CONFIG_H -I. -I. -I.. -I.. -I. -I../lib -I../lib    -g -O2 -MT printenv.o -MD -MP -MF ".deps/printenv.Tpo" \
  -c -o printenv.o `test -f 'printenv.c' || echo './'`printenv.c; \
then mv ".deps/printenv.Tpo" ".deps/printenv.Po"; \
else rm -f ".deps/printenv.Tpo"; exit 1; \
fi
gcc  -g -O2  -lm -o printenv  printenv.o ../lib/libfetish.a  ../lib/libfetish.a 
if gcc -DLOCALEDIR=\"/home/peter/result/share/locale\" -DSHAREDIR=\"/home/peter/result/share\" -DHAVE_CONFIG_H -I. -I. -I.. -I.. -I. -I../lib -I../lib    -g -O2 -MT printf.o -MD -MP -MF ".deps/printf.Tpo" \
  -c -o printf.o `test -f 'printf.c' || echo './'`printf.c; \
then mv ".deps/printf.Tpo" ".deps/printf.Po"; \
else rm -f ".deps/printf.Tpo"; exit 1; \
fi
gcc  -g -O2  -lm -o printf  printf.o ../lib/libfetish.a  ../lib/libfetish.a   
if gcc -DLOCALEDIR=\"/home/peter/result/share/locale\" -DSHAREDIR=\"/home/peter/result/share\" -DHAVE_CONFIG_H -I. -I. -I.. -I.. -I. -I../lib -I../lib    -g -O2 -MT pwd.o -MD -MP -MF ".deps/pwd.Tpo" \
  -c -o pwd.o `test -f 'pwd.c' || echo './'`pwd.c; \
then mv ".deps/pwd.Tpo" ".deps/pwd.Po"; \
else rm -f ".deps/pwd.Tpo"; exit 1; \
fi
gcc  -g -O2  -lm -o pwd  pwd.o ../lib/libfetish.a  ../lib/libfetish.a 
if gcc -DLOCALEDIR=\"/home/peter/result/share/locale\" -DSHAREDIR=\"/home/peter/result/share\" -DHAVE_CONFIG_H -I. -I. -I.. -I.. -I. -I../lib -I../lib    -g -O2 -MT seq.o -MD -MP -MF ".deps/seq.Tpo" \
  -c -o seq.o `test -f 'seq.c' || echo './'`seq.c; \
then mv ".deps/seq.Tpo" ".deps/seq.Po"; \
else rm -f ".deps/seq.Tpo"; exit 1; \
fi
gcc  -g -O2  -lm -o seq  seq.o ../lib/libfetish.a  ../lib/libfetish.a  
/usr/bin/ld: seq.o: in function `get_width_format':
/home/peter/coreutils-5.0/src/seq.c:253: undefined reference to `floor'
/usr/bin/ld: /home/peter/coreutils-5.0/src/seq.c:259: undefined reference to `floor'
collect2: error: ld returned 1 exit status
make[3]: *** [Makefile:1033: seq] Error 1
make[3]: Leaving directory '/home/peter/coreutils-5.0/src'
make[2]: *** [Makefile:815: all] Error 2
make[2]: Leaving directory '/home/peter/coreutils-5.0/src'
make[1]: *** [Makefile:244: all-recursive] Error 1
make[1]: Leaving directory '/home/peter/coreutils-5.0'
make: *** [Makefile:199: all] Error 2
100 lines
ASSISTANT
Show reasoning

I see the issue - the -lm flag is being passed in the wrong order. In GCC, the order matters - libraries should come after the object files that need them. Let me try a different approach. I need to modify the build to put -lm at the end of the linking command. Let me check the Makefile to see what's happening.

Actually, let me try a different approach. I'll check if I can modify the src/Makefile directly or use LIBS environment variable instead of LDFLAGS.

The issue is that the math library flag needs to come at the end of the linking command. Let me try a different approach using the LIBS environment variable:

compile-bench> cd /home/peter/coreutils-5.0 && make clean
Making clean in tests
make[1]: Entering directory '/home/peter/coreutils-5.0/tests'
Making clean in wc
make[2]: Entering directory '/home/peter/coreutils-5.0/tests/wc'
test -z "a0.O a0.E a1.O a1.E a2.O a2.E a3.O a3.E a4.O a4.E a5.O a5.E a6.O a6.E a7.O a7.E a8.O a8.E a9.O a9.E b0.O b0.E b1.O b1.E c0.O c0.E c1.O c1.E c2.O c2.E" || rm -f a0.O a0.E a1.O a1.E a2.O a2.E a3.O a3.E a4.O a4.E a5.O a5.E a6.O a6.E a7.O a7.E a8.O a8.E a9.O a9.E b0.O b0.E b1.O b1.E c0.O c0.E c1.O c1.E c2.O c2.E
make[2]: Leaving directory '/home/peter/coreutils-5.0/tests/wc'
Making clean in uniq
make[2]: Entering directory '/home/peter/coreutils-5.0/tests/uniq'
test -z "1.O 1.E 2.O 2.E 3.O 3.E 4.O 4.E 5.O 5.E 6.O 6.E 7.O 7.E 8.O 8.E 9.O 9.E 10.O 10.E 11.O 11.E 12.O 12.E 13.O 13.E 20.O 20.E 21.O 21.E 22.O 22.E 23.O 23.E obs30.O obs30.E 31.O 31.E 32.O 32.E 33.O 33.E 34.O 34.E 35.O 35.E obs40.O obs40.E obs41.O obs41.E 42.O 42.E 43.O 43.E obs44.O obs44.E obs45.O obs45.E 50.O 50.E 51.O 51.E 52.O 52.E 53.O 53.E 54.O 54.E 55.O 55.E 56.O 56.E 57.O 57.E 60.O 60.E 61.O 61.E 62.O 62.E 63.O 63.E 64.O 64.E 65.O 65.E 90.O 90.E 91.O 91.E 92.O 92.E 93.O 93.E 94.O 94.E 101.O 101.E 102.O 102.E 110.O 110.E 111.O 111.E 112.O 112.E 113.O 113.E 114.O 114.E 115.O 115.E 116.O 116.E 117.O 117.E 118.O 118.E 119.O 119.E" || rm -f 1.O 1.E 2.O 2.E 3.O 3.E 4.O 4.E 5.O 5.E 6.O 6.E 7.O 7.E 8.O 8.E 9.O 9.E 10.O 10.E 11.O 11.E 12.O 12.E 13.O 13.E 20.O 20.E 21.O 21.E 22.O 22.E 23.O 23.E obs30.O obs30.E 31.O 31.E 32.O 32.E 33.O 33.E 34.O 34.E 35.O 35.E obs40.O obs40.E obs41.O obs41.E 42.O 42.E 43.O 43.E obs44.O obs44.E obs45.O obs45.E 50.O 50.E 51.O 51.E 52.O 52.E 53.O 53.E 54.O 54.E 55.O 55.E 56.O 56.E 57.O 57.E 60.O 60.E 61.O 61.E 62.O 62.E 63.O 63.E 64.O 64.E 65.O 65.E 90.O 90.E 91.O 91.E 92.O 92.E 93.O 93.E 94.O 94.E 101.O 101.E 102.O 102.E 110.O 110.E 111.O 111.E 112.O 112.E 113.O 113.E 114.O 114.E 115.O 115.E 116.O 116.E 117.O 117.E 118.O 118.E 119.O 119.E
make[2]: Leaving directory '/home/peter/coreutils-5.0/tests/uniq'
Making clean in unexpand
make[2]: Entering directory '/home/peter/coreutils-5.0/tests/unexpand'
make[2]: Nothing to be done for 'clean'.
make[2]: Leaving directory '/home/peter/coreutils-5.0/tests/unexpand'
Making clean in tsort
make[2]: Entering directory '/home/peter/coreutils-5.0/tests/tsort'
make[2]: Nothing to be done for 'clean'.
make[2]: Leaving directory '/home/peter/coreutils-5.0/tests/tsort'
Making clean in tr
make[2]: Entering directory '/home/peter/coreutils-5.0/tests/tr'
test -z "1.O 1.E 2.O 2.E 3.O 3.E 4.O 4.E 5.O 5.E 6.O 6.E 7.O 7.E 8.O 8.E 9.O 9.E a.O a.E b.O b.E c.O c.E d.O d.E e.O e.E f.O f.E g.O g.E h.O h.E i.O i.E j.O j.E k.O k.E l.O l.E m.O m.E n.O n.E o.O o.E p.O p.E q.O q.E r.O r.E s.O s.E t.O t.E u.O u.E v.O v.E w.O w.E x.O x.E y.O y.E z.O z.E range-a-a.O range-a-a.E null.O null.E upcase.O upcase.E dncase.O dncase.E rep-cclass.O rep-cclass.E rep-1.O rep-1.E rep-2.O rep-2.E rep-3.O rep-3.E o-rep-1.O o-rep-1.E o-rep-2.O o-rep-2.E esc.O esc.E ross-0
[command output truncated]
-fr *.o
make[1]: Leaving directory '/home/peter/coreutils-5.0/po'
Making clean in m4
make[1]: Entering directory '/home/peter/coreutils-5.0/m4'
make[1]: Nothing to be done for 'clean'.
make[1]: Leaving directory '/home/peter/coreutils-5.0/m4'
Making clean in man
make[1]: Entering directory '/home/peter/coreutils-5.0/man'
make[1]: Nothing to be done for 'clean'.
make[1]: Leaving directory '/home/peter/coreutils-5.0/man'
Making clean in doc
make[1]: Entering directory '/home/peter/coreutils-5.0/doc'
rm -f coreutils.aux coreutils.cp coreutils.cps coreutils.fl coreutils.fn \
  coreutils.ky coreutils.log coreutils.op coreutils.pg \
  coreutils.tmp coreutils.toc coreutils.tp coreutils.tps \
  coreutils.vr coreutils.dvi coreutils.pdf coreutils.ps
rm -f vti.tmp
make[1]: Leaving directory '/home/peter/coreutils-5.0/doc'
Making clean in src
make[1]: Entering directory '/home/peter/coreutils-5.0/src'
test -z "chgrp chown chmod cp dd dircolors du ginstall link ln dir vdir ls mkdir mkfifo mknod mv readlink rm rmdir shred stat sync touch unlink cat cksum comm csplit cut expand fmt fold head join md5sum nl od paste pr ptx sha1sum sort split sum tac tail tr tsort unexpand uniq wc basename date dirname echo env expr factor false hostname id kill logname pathchk printenv printf pwd seq sleep tee test true tty whoami yes  uname chroot hostid nice pinky users who uptime stty df" || rm -f chgrp chown chmod cp dd dircolors du ginstall link ln dir vdir ls mkdir mkfifo mknod mv readlink rm rmdir shred stat sync touch unlink cat cksum comm csplit cut expand fmt fold head join md5sum nl od paste pr ptx sha1sum sort split sum tac tail tr tsort unexpand uniq wc basename date dirname echo env expr factor false hostname id kill logname pathchk printenv printf pwd seq sleep tee test true tty whoami yes  uname chroot hostid nice pinky users who uptime stty df > /dev/null 2>&1 || /bin/rm -f chgrp chown chmod cp dd dircolors du ginstall link ln dir vdir ls mkdir mkfifo mknod mv readlink rm rmdir shred stat sync touch unlink cat cksum comm csplit cut expand fmt fold head join md5sum nl od paste pr ptx sha1sum sort split sum tac tail tr tsort unexpand uniq wc basename date dirname echo env expr factor false hostname id kill logname pathchk printenv printf pwd seq sleep tee test true tty whoami yes  uname chroot hostid nice pinky users who uptime stty df
test -z "groups  nohup su" || rm -f groups  nohup su
rm -f *.o core *.core
make[1]: Leaving directory '/home/peter/coreutils-5.0/src'
Making clean in lib
make[1]: Entering directory '/home/peter/coreutils-5.0/lib'
test -z "charset.alias ref-add.sed ref-del.sed" || rm -f charset.alias ref-add.sed ref-del.sed
test -z "libfetish.a" || rm -f libfetish.a
rm -f *.o core *.core
make[1]: Leaving directory '/home/peter/coreutils-5.0/lib'
Making clean in .
make[1]: Entering directory '/home/peter/coreutils-5.0'
make[1]: Nothing to be done for 'clean-am'.
make[1]: Leaving directory '/home/peter/coreutils-5.0'
57 lines
ASSISTANT
Show reasoning

The user is waiting for me to continue. I need to reconfigure with the LIBS environment variable to properly link the math library for the seq utility. Let me try that approach.

compile-bench> cd /home/peter/coreutils-5.0 && LIBS="-lm" ./configure --prefix=/home/peter/result
checking build system type... x86_64-unknown-linux-gnu
checking host system type... x86_64-unknown-linux-gnu
checking for a BSD-compatible install... /usr/bin/install -c
checking whether build environment is sane... yes
checking for gawk... no
checking for mawk... mawk
checking whether make sets $(MAKE)... yes
checking for perl5.003 or newer... yes
checking for gcc... gcc
checking for C compiler default output... a.out
checking whether the C compiler works... yes
checking whether we are cross compiling... no
checking for suffix of executables... 
checking for suffix of object files... o
checking whether we are using the GNU C compiler... yes
checking whether gcc accepts -g... yes
checking for gcc option to accept ANSI C... none needed
checking for style of include used by make... GNU
checking dependency style of gcc... gcc3
checking how to run the C preprocessor... gcc -E
checking for egrep... grep -E
checking whether gcc needs -traditional... no
checking for ranlib... ranlib
checking whether ln -s works... yes
checking for AIX... no
checking for ANSI C header files... yes
checking for sys/types.h... yes
checking for sys/stat.h... yes
checking for stdlib.h... yes
checking for string.h... yes
checking for memory.h... yes
checking for strings.h... yes
checking for inttypes.h... yes
checking for stdint.h... yes
checking for unistd.h... yes
checking minix/config.h usability... no
checking minix/config.h presence... no
checking for minix/config.h... no
checking for uname... yes
checking for chroot... yes
checking for gethostid... yes
checking for strerror in -lcposix... no
checking for special C compiler options needed for large files... no
checking for _FILE_OFFSET_BITS value needed for large files... no
checking for _LARGE_FILES value needed for large files... no
checking for gcc option to accept ANSI C... none needed
checking for function prototypes... yes
checking for ANSI C header files... (cached) yes
checking for string.h... (cached) yes
checking whether byte ordering is bigendian... no
checking for an ANSI C-conforming const... yes
checking for working volatile... yes
checking for inline... inline
checking for working long double with more range or precision than double... no
checking errno.h usability... yes
checking errno.h presence... yes
checking for errno.h... yes
checking fcntl.h usability... yes
checking fcntl.h presence... yes
checking for fcntl.h... yes
checking float.h usability... yes
checking float.h presence... yes
checking for float.h... yes
checking hurd.h usability... no
checking hurd.h presence... no
checking for hurd.h... no
checking limits.h usability... yes
checking limits.h presence... yes
checking for limits.h... yes
checking for memory.h... (cached) yes
[command output truncated]
checking shadow.h presence... yes
checking for shadow.h... yes
checking for struct spwd.sp_pwdp... yes
checking for getspnam... yes
checking for library containing crypt... -lcrypt
checking for msgfmt... no
checking for gmsgfmt... :
checking for xgettext... no
checking for msgmerge... no
checking whether NLS is requested... yes
checking for GNU gettext in libc... yes
configure: creating ./config.status
config.status: creating Makefile
config.status: creating doc/Makefile
config.status: creating lib/Makefile
config.status: creating man/Makefile
config.status: creating m4/Makefile
config.status: creating po/Makefile.in
config.status: creating src/Makefile
config.status: creating tests/Makefile
config.status: creating tests/basename/Makefile
config.status: creating tests/chgrp/Makefile
config.status: creating tests/chmod/Makefile
config.status: creating tests/chown/Makefile
config.status: creating tests/cp/Makefile
config.status: creating tests/cut/Makefile
config.status: creating tests/date/Makefile
config.status: creating tests/dd/Makefile
config.status: creating tests/dircolors/Makefile
config.status: creating tests/du/Makefile
config.status: creating tests/expr/Makefile
config.status: creating tests/factor/Makefile
config.status: creating tests/fmt/Makefile
config.status: creating tests/head/Makefile
config.status: creating tests/install/Makefile
config.status: creating tests/join/Makefile
config.status: creating tests/ln/Makefile
config.status: creating tests/ls-2/Makefile
config.status: creating tests/ls/Makefile
config.status: creating tests/md5sum/Makefile
config.status: creating tests/misc/Makefile
config.status: creating tests/mkdir/Makefile
config.status: creating tests/mv/Makefile
config.status: creating tests/od/Makefile
config.status: creating tests/pr/Makefile
config.status: creating tests/rm/Makefile
config.status: creating tests/rmdir/Makefile
config.status: creating tests/seq/Makefile
config.status: creating tests/sha1sum/Makefile
config.status: creating tests/shred/Makefile
config.status: creating tests/sort/Makefile
config.status: creating tests/stty/Makefile
config.status: creating tests/sum/Makefile
config.status: creating tests/tac/Makefile
config.status: creating tests/tail-2/Makefile
config.status: creating tests/tail/Makefile
config.status: creating tests/test/Makefile
config.status: creating tests/touch/Makefile
config.status: creating tests/tr/Makefile
config.status: creating tests/tsort/Makefile
config.status: creating tests/unexpand/Makefile
config.status: creating tests/uniq/Makefile
config.status: creating tests/wc/Makefile
config.status: creating config.h
config.status: linking ./lib/ftw_.h to lib/ftw.h
config.status: executing depfiles commands
config.status: executing default-1 commands
config.status: creating po/POTFILES
config.status: creating po/Makefile
141 lines
ASSISTANT
Show reasoning

Now let me try to compile again with the LIBS environment variable set to include the math library.

compile-bench> cd /home/peter/coreutils-5.0 && make
make  all-recursive
make[1]: Entering directory '/home/peter/coreutils-5.0'
Making all in lib
make[2]: Entering directory '/home/peter/coreutils-5.0/lib'
make  all-am
make[3]: Entering directory '/home/peter/coreutils-5.0/lib'
if gcc -DLIBDIR=\"/home/peter/result/lib\" -DHAVE_CONFIG_H -I. -I. -I.. -I.. -I.    -g -O2 -MT acl.o -MD -MP -MF ".deps/acl.Tpo" \
  -c -o acl.o `test -f 'acl.c' || echo './'`acl.c; \
then mv ".deps/acl.Tpo" ".deps/acl.Po"; \
else rm -f ".deps/acl.Tpo"; exit 1; \
fi
if gcc -DLIBDIR=\"/home/peter/result/lib\" -DHAVE_CONFIG_H -I. -I. -I.. -I.. -I.    -g -O2 -MT getdate.o -MD -MP -MF ".deps/getdate.Tpo" \
  -c -o getdate.o `test -f 'getdate.c' || echo './'`getdate.c; \
then mv ".deps/getdate.Tpo" ".deps/getdate.Po"; \
else rm -f ".deps/getdate.Tpo"; exit 1; \
fi
if gcc -DLIBDIR=\"/home/peter/result/lib\" -DHAVE_CONFIG_H -I. -I. -I.. -I.. -I.    -g -O2 -MT posixtm.o -MD -MP -MF ".deps/posixtm.Tpo" \
  -c -o posixtm.o `test -f 'posixtm.c' || echo './'`posixtm.c; \
then mv ".deps/posixtm.Tpo" ".deps/posixtm.Po"; \
else rm -f ".deps/posixtm.Tpo"; exit 1; \
fi
if gcc -DLIBDIR=\"/home/peter/result/lib\" -DHAVE_CONFIG_H -I. -I. -I.. -I.. -I.    -g -O2 -MT posixver.o -MD -MP -MF ".deps/posixver.Tpo" \
  -c -o posixver.o `test -f 'posixver.c' || echo './'`posixver.c; \
then mv ".deps/posixver.Tpo" ".deps/posixver.Po"; \
else rm -f ".deps/posixver.Tpo"; exit 1; \
fi
if gcc -DLIBDIR=\"/home/peter/result/lib\" -DHAVE_CONFIG_H -I. -I. -I.. -I.. -I.    -g -O2 -MT strftime.o -MD -MP -MF ".deps/strftime.Tpo" \
  -c -o strftime.o `test -f 'strftime.c' || echo './'`strftime.c; \
then mv ".deps/strftime.Tpo" ".deps/strftime.Po"; \
else rm -f ".deps/strftime.Tpo"; exit 1; \
fi
if gcc -DLIBDIR=\"/home/peter/result/lib\" -DHAVE_CONFIG_H -I. -I. -I.. -I.. -I.    -g -O2 -MT getopt.o -MD -MP -MF ".deps/getopt.Tpo" \
  -c -o getopt.o `test -f 'getopt.c' || echo './'`getopt.c; \
then mv ".deps/getopt.Tpo" ".deps/getopt.Po"; \
else rm -f ".deps/getopt.Tpo"; exit 1; \
fi
if gcc -DLIBDIR=\"/home/peter/result/lib\" -DHAVE_CONFIG_H -I. -I. -I.. -I.. -I.    -g -O2 -MT getopt1.o -MD -MP -MF ".deps/getopt1.Tpo" \
  -c -o getopt1.o `test -f 'getopt1.c' || echo './'`getopt1.c; \
then mv ".deps/getopt1.Tpo" ".deps/getopt1.Po"; \
else rm -f ".deps/getopt1.Tpo"; exit 1; \
fi
if gcc -DLIBDIR=\"/home/peter/result/lib\" -DHAVE_CONFIG_H -I. -I. -I.. -I.. -I.    -g -O2 -MT hash.o -MD -MP -MF ".deps/hash.Tpo" \
  -c -o hash.o `test -f 'hash.c' || echo './'`hash.c; \
then mv ".deps/hash.Tpo" ".deps/hash.Po"; \
else rm -f ".deps/hash.Tpo"; exit 1; \
fi
if gcc -DLIBDIR=\"/home/peter/result/lib\" -DHAVE_CONFIG_H -I. -I. -I.. -I.. -I.    -g -O2 -MT hash-pjw.o -MD -MP -MF ".deps/hash-pjw.Tpo" \
  -c -o hash-pjw.o `test -f 'hash-pjw.c' || echo './'`hash-pjw.c; \
then mv ".deps/hash-pjw.Tpo" ".deps/hash-pjw.Po"; \
else rm -f ".deps/hash-pjw.Tpo"; exit 1; \
fi
if gcc -DLIBDIR=\"/home/peter/result/lib\" -DHAVE_CONFIG_H -I. -I. -I..
[command output truncated]
eter/result/share\" -DHAVE_CONFIG_H -I. -I. -I.. -I.. -I. -I../lib -I../lib    -g -O2 -MT printf.o -MD -MP -MF ".deps/printf.Tpo" \
  -c -o printf.o `test -f 'printf.c' || echo './'`printf.c; \
then mv ".deps/printf.Tpo" ".deps/printf.Po"; \
else rm -f ".deps/printf.Tpo"; exit 1; \
fi
gcc  -g -O2   -o printf  printf.o ../lib/libfetish.a  ../lib/libfetish.a   -lm
if gcc -DLOCALEDIR=\"/home/peter/result/share/locale\" -DSHAREDIR=\"/home/peter/result/share\" -DHAVE_CONFIG_H -I. -I. -I.. -I.. -I. -I../lib -I../lib    -g -O2 -MT pwd.o -MD -MP -MF ".deps/pwd.Tpo" \
  -c -o pwd.o `test -f 'pwd.c' || echo './'`pwd.c; \
then mv ".deps/pwd.Tpo" ".deps/pwd.Po"; \
else rm -f ".deps/pwd.Tpo"; exit 1; \
fi
gcc  -g -O2   -o pwd  pwd.o ../lib/libfetish.a  ../lib/libfetish.a -lm
if gcc -DLOCALEDIR=\"/home/peter/result/share/locale\" -DSHAREDIR=\"/home/peter/result/share\" -DHAVE_CONFIG_H -I. -I. -I.. -I.. -I. -I../lib -I../lib    -g -O2 -MT seq.o -MD -MP -MF ".deps/seq.Tpo" \
  -c -o seq.o `test -f 'seq.c' || echo './'`seq.c; \
then mv ".deps/seq.Tpo" ".deps/seq.Po"; \
else rm -f ".deps/seq.Tpo"; exit 1; \
fi
gcc  -g -O2   -o seq  seq.o ../lib/libfetish.a  ../lib/libfetish.a  -lm
if gcc -DLOCALEDIR=\"/home/peter/result/share/locale\" -DSHAREDIR=\"/home/peter/result/share\" -DHAVE_CONFIG_H -I. -I. -I.. -I.. -I. -I../lib -I../lib    -g -O2 -MT sleep.o -MD -MP -MF ".deps/sleep.Tpo" \
  -c -o sleep.o `test -f 'sleep.c' || echo './'`sleep.c; \
then mv ".deps/sleep.Tpo" ".deps/sleep.Po"; \
else rm -f ".deps/sleep.Tpo"; exit 1; \
fi
gcc  -g -O2   -o sleep  sleep.o ../lib/libfetish.a  ../lib/libfetish.a     -lm
if gcc -DLOCALEDIR=\"/home/peter/result/share/locale\" -DSHAREDIR=\"/home/peter/result/share\" -DHAVE_CONFIG_H -I. -I. -I.. -I.. -I. -I../lib -I../lib    -g -O2 -MT tee.o -MD -MP -MF ".deps/tee.Tpo" \
  -c -o tee.o `test -f 'tee.c' || echo './'`tee.c; \
then mv ".deps/tee.Tpo" ".deps/tee.Po"; \
else rm -f ".deps/tee.Tpo"; exit 1; \
fi
tee.c:35:12: error: conflicting types for 'tee'; have 'int(int,  const char **)'
   35 | static int tee (int nfiles, const char **files);
      |            ^~~
In file included from /usr/include/x86_64-linux-gnu/bits/fcntl.h:61,
                 from /usr/include/fcntl.h:35,
                 from system.h:153,
                 from tee.c:26:
/usr/include/x86_64-linux-gnu/bits/fcntl-linux.h:429:18: note: previous declaration of 'tee' with type '__ssize_t(int,  int,  size_t,  unsigned int)' {aka 'long int(int,  int,  long unsigned int,  unsigned int)'}
  429 | extern __ssize_t tee (int __fdin, int __fdout, size_t __len,
      |                  ^~~
make[3]: *** [Makefile:1263: tee.o] Error 1
make[3]: Leaving directory '/home/peter/coreutils-5.0/src'
make[2]: *** [Makefile:815: all] Error 2
make[2]: Leaving directory '/home/peter/coreutils-5.0/src'
make[1]: *** [Makefile:244: all-recursive] Error 1
make[1]: Leaving directory '/home/peter/coreutils-5.0'
make: *** [Makefile:199: all] Error 2
100 lines
ASSISTANT
Show reasoning

Now I'm getting a different error with the tee utility - there's a conflict with the system's tee function declaration. This is a common issue with older code bases when compiled on newer systems. Let me check what files compiled successfully and then try to fix this by modifying the tee.c source file to avoid the conflict.

First, let me see what has been built successfully so far, then fix the tee issue.

I see there's a conflict with the tee function name in the newer system headers. Let me check what has been compiled successfully and then fix the tee issue:

compile-bench> cd /home/peter/coreutils-5.0/src && ls -la | grep -E '^-rwx'
-rwxr-xr-x  1 peter peter  57160 Sep 16 20:26 basename
-rwxr-xr-x  1 peter peter  79808 Sep 16 20:26 cat
-rwxr-xr-x  1 peter peter  94280 Sep 16 20:26 chgrp
-rwxr-xr-x  1 peter peter  92424 Sep 16 20:26 chmod
-rwxr-xr-x  1 peter peter 104600 Sep 16 20:26 chown
-rwxr-xr-x  1 peter peter  64944 Sep 16 20:26 cksum
-rwxr-xr-x  1 peter peter  72760 Sep 16 20:26 comm
-rwxr-xr-x  1 peter peter 212664 Sep 16 20:26 cp
-rwxr-xr-x  1 peter peter 116392 Sep 16 20:26 csplit
-rwxr-xr-x  1 peter peter  82952 Sep 16 20:26 cut
-rwxr-xr-x  1 peter peter 180200 Sep 16 20:26 date
-rwxr-xr-x  1 peter peter   1901 Feb  6  1998 dcgen
-rwxr-xr-x  1 peter peter 109616 Sep 16 20:26 dd
-rwxr-xr-x  1 peter peter 321000 Sep 16 20:26 dir
-rwxr-xr-x  1 peter peter  88336 Sep 16 20:26 dircolors
-rwxr-xr-x  1 peter peter  59424 Sep 16 20:26 dirname
-rwxr-xr-x  1 peter peter 178840 Sep 16 20:26 du
-rwxr-xr-x  1 peter peter  61776 Sep 16 20:26 echo
-rwxr-xr-x  1 peter peter  58744 Sep 16 20:26 env
-rwxr-xr-x  1 peter peter  68680 Sep 16 20:26 expand
-rwxr-xr-x  1 peter peter 100536 Sep 16 20:26 expr
-rwxr-xr-x  1 peter peter  84688 Sep 16 20:26 factor
-rwxr-xr-x  1 peter peter  52216 Sep 16 20:26 false
-rwxr-xr-x  1 peter peter  86008 Sep 16 20:26 fmt
-rwxr-xr-x  1 peter peter  78592 Sep 16 20:26 fold
-rwxr-xr-x  1 peter peter 235408 Sep 16 20:26 ginstall
-rwxr-xr-x  1 peter peter   1677 Jul  2  2002 groups.sh
-rwxr-xr-x  1 peter peter  83776 Sep 16 20:26 head
-rwxr-xr-x  1 peter peter  57360 Sep 16 20:26 hostname
-rwxr-xr-x  1 peter peter  76528 Sep 16 20:26 id
-rwxr-xr-x  1 peter peter 102592 Sep 16 20:26 join
-rwxr-xr-x  1 peter peter  78720 Sep 16 20:26 kill
-rwxr-xr-x  1 peter peter  56816 Sep 16 20:26 link
-rwxr-xr-x  1 peter peter 110688 Sep 16 20:26 ln
-rwxr-xr-x  1 peter peter  55888 Sep 16 20:26 logname
-rwxr-xr-x  1 peter peter 320992 Sep 16 20:26 ls
-rwxr-xr-x  1 peter peter 118472 Sep 16 20:26 md5sum
-rwxr-xr-x  1 peter peter 100032 Sep 16 20:26 mkdir
-rwxr-xr-x  1 peter peter  81264 Sep 16 20:26 mkfifo
-rwxr-xr-x  1 peter peter  88904 Sep 16 20:26 mknod
-rwxr-xr-x  1 peter peter 248952 Sep 16 20:26 mv
-rwxr-xr-x  1 peter peter  84920 Sep 16 20:26 nl
-rwxr-xr-x  1 peter peter   2131 Aug 10  2002 nohup.sh
-rwxr-xr-x  1 peter peter 128944 Sep 16 20:26 od
-rwxr-xr-x  1 peter peter  70416 Sep 16 20:26 paste
-rwxr-xr-x  1 peter peter  65096 Sep 16 20:26 pathchk
-rwxr-xr-x  1 peter peter 133584 Sep 16 20:26 pr
-rwxr-xr-x  1 peter peter  56248 Sep 16 20:26 printenv
-rwxr-xr-x  1 peter peter 109568 Sep 16 20:26 printf
-rwxr-xr-x  1 peter peter 122304 Sep 16 20:26 ptx
-rwxr-xr-x  1 peter peter  56872 Sep 16 20:26 pwd
-rwxr-xr-x  1 peter peter  56472 Sep 16 20:26 readlink
-rwxr-xr-x  1 peter peter 145096 Sep 16 20:26 rm
-rwxr-xr-x  1 peter peter  58440 Sep 16 20:26 rmdir
-rwxr-xr-x  1 peter peter  75176 Sep 16 20:26 seq
-rwxr-xr-x  1 peter peter 118496 Sep 16 20:26 sha1sum
-rwxr-xr-x  1 peter peter 144448 Sep 16 20:26 shred
-rwxr-xr-x  1 peter peter  62072 Sep 16 20:26 sleep
-rwxr-xr-x  1 peter peter 161760 Sep 16 20:26 sort
-rwxr-xr-x  1 peter peter  93080 Sep 16 20:26 split
-rwxr-xr-x  1 peter peter 140920 Sep 16 20:26 stat
-rwxr-xr-x  1 peter peter 106208 Sep 16 20:26 sum
-rwxr-xr-x  1 peter peter  55152 Sep 16 20:26 sync
-rwxr-xr-x  1 peter peter  80088 Sep 16 20:26 tac
-rwxr-xr-x  1 peter peter 144160 Sep 16 20:26 tail
-rwxr-xr-x  1 peter peter 123640 Sep 16 20:26 touch
-rwxr-xr-x  1 peter peter 120984 Sep 16 20:26 tr
-rwxr-xr-x  1 peter peter 151328 Sep 16 20:26 tsort
-rwxr-xr-x  1 peter peter  73856 Sep 16 20:26 unexpand
-rwxr-xr-x  1 peter peter 106600 Sep 16 20:26 uniq
-rwxr-xr-x  1 peter peter  56888 Sep 16 20:26 unlink
-rwxr-xr-x  1 peter peter 321008 Sep 16 20:26 vdir
-rwxr-xr-x  1 peter peter  80944 Sep 16 20:26 wc
-rwxr-xr-x  1 peter peter   1855 Feb  6  2001 wheel-gen.pl
75 lines
ASSISTANT
Show reasoning

Great! I can see that most utilities compiled successfully, including the problematic seq utility. The compilation failed only on tee due to a naming conflict with a newer system function. Let me continue and try to compile the remaining utilities that may not have been built yet. I need to check what utilities are missing and try to fix the tee issue.

Looking at the output, I can see many utilities have been compiled successfully. Let me check if there are any remaining utilities that need to be compiled by continuing the make process, and if tee is the only issue, I can try to fix it specifically.

Good! Most of the utilities compiled successfully. Let me check what utilities we still need and try to fix the tee issue specifically:

compile-bench> cd /home/peter/coreutils-5.0/src && make CFLAGS="-g -O2 -D_GNU_SOURCE"
make  all-am
make[1]: Entering directory '/home/peter/coreutils-5.0/src'
if gcc -DLOCALEDIR=\"/home/peter/result/share/locale\" -DSHAREDIR=\"/home/peter/result/share\" -DHAVE_CONFIG_H -I. -I. -I.. -I.. -I. -I../lib -I../lib    -g -O2 -D_GNU_SOURCE -MT tee.o -MD -MP -MF ".deps/tee.Tpo" \
  -c -o tee.o `test -f 'tee.c' || echo './'`tee.c; \
then mv ".deps/tee.Tpo" ".deps/tee.Po"; \
else rm -f ".deps/tee.Tpo"; exit 1; \
fi
tee.c:35:12: error: conflicting types for 'tee'; have 'int(int,  const char **)'
   35 | static int tee (int nfiles, const char **files);
      |            ^~~
In file included from /usr/include/x86_64-linux-gnu/bits/fcntl.h:61,
                 from /usr/include/fcntl.h:35,
                 from system.h:153,
                 from tee.c:26:
/usr/include/x86_64-linux-gnu/bits/fcntl-linux.h:429:18: note: previous declaration of 'tee' with type '__ssize_t(int,  int,  size_t,  unsigned int)' {aka 'long int(int,  int,  long unsigned int,  unsigned int)'}
  429 | extern __ssize_t tee (int __fdin, int __fdout, size_t __len,
      |                  ^~~
make[1]: *** [Makefile:1263: tee.o] Error 1
make[1]: Leaving directory '/home/peter/coreutils-5.0/src'
make: *** [Makefile:815: all] Error 2
21 lines
ASSISTANT
Show reasoning

The issue is that the system headers have a tee function declaration that conflicts with the static tee function in the coreutils tee.c file. This is a common issue when compiling older software on newer systems.

Let me try a different approach. I can either:
1. Patch the tee.c file to rename the static function
2. Try to exclude the conflicting header
3. Just skip tee for now and continue with the installation

Let me try to patch the tee.c file to rename the static function.

Let me fix the tee conflict by renaming the static function in the source code:

compile-bench> cd /home/peter/coreutils-5.0/src && sed -i 's/static int tee (int nfiles, const char \*\*files);/static int tee_main (int nfiles, const char **files);/' tee.c
[empty output]
ASSISTANT
Show reasoning

I need to fix the tee function name conflict by replacing all occurrences of the static function tee with tee_main in the tee.c file. Let me first look at the file to see what needs to be changed, then make the replacements.

compile-bench> cd /home/peter/coreutils-5.0/src && grep -n "tee (" tee.c
149:  errs = tee (argc - optind, (const char **) &argv[optind]);
161:tee (int nfiles, const char **files)
3 lines
ASSISTANT
Show reasoning

I see there are two occurrences of the tee function name in the file. I need to replace both the function declaration and the function definition, as well as the call to it. Let me update all occurrences.

compile-bench> cd /home/peter/coreutils-5.0/src && sed -i 's/tee (/tee_main (/g' tee.c
[empty output]
ASSISTANT
Show reasoning

Let me check the current state of the tee.c file to see if the changes were applied correctly.

compile-bench> cd /home/peter/coreutils-5.0/src && grep -n "tee" tee.c | head -10
1:/* tee - read from standard input and write to standard output and files.
31:#define PROGRAM_NAME "tee"
35:static int tee_main (int nfiles, const char **files);
146:  /* Do *not* warn if tee is given no file arguments.
149:  errs = tee_main (argc - optind, (const char **) &argv[optind]);
161:tee_main (int nfiles, const char **files)
7 lines
ASSISTANT
Show reasoning

Let me try to compile the tee program again now that I've fixed the function name conflict.

compile-bench> cd /home/peter/coreutils-5.0/src && make
make  all-am
make[1]: Entering directory '/home/peter/coreutils-5.0/src'
if gcc -DLOCALEDIR=\"/home/peter/result/share/locale\" -DSHAREDIR=\"/home/peter/result/share\" -DHAVE_CONFIG_H -I. -I. -I.. -I.. -I. -I../lib -I../lib    -g -O2 -MT tee.o -MD -MP -MF ".deps/tee.Tpo" \
  -c -o tee.o `test -f 'tee.c' || echo './'`tee.c; \
then mv ".deps/tee.Tpo" ".deps/tee.Po"; \
else rm -f ".deps/tee.Tpo"; exit 1; \
fi
gcc  -g -O2   -o tee  tee.o ../lib/libfetish.a  ../lib/libfetish.a -lm
if gcc -DLOCALEDIR=\"/home/peter/result/share/locale\" -DSHAREDIR=\"/home/peter/result/share\" -DHAVE_CONFIG_H -I. -I. -I.. -I.. -I. -I../lib -I../lib    -g -O2 -MT test.o -MD -MP -MF ".deps/test.Tpo" \
  -c -o test.o `test -f 'test.c' || echo './'`test.c; \
then mv ".deps/test.Tpo" ".deps/test.Po"; \
else rm -f ".deps/test.Tpo"; exit 1; \
fi
test.c:142:1: error: static declaration of 'eaccess' follows non-static declaration
  142 | eaccess (char const *file, int mode)
      | ^~~~~~~
In file included from /usr/include/x86_64-linux-gnu/bits/sigstksz.h:24,
                 from /usr/include/signal.h:328,
                 from /usr/include/x86_64-linux-gnu/sys/param.h:28,
                 from system.h:33,
                 from test.c:41:
/usr/include/unistd.h:296:12: note: previous declaration of 'eaccess' with type 'int(const char *, int)'
  296 | extern int eaccess (const char *__name, int __type)
      |            ^~~~~~~
test.c: In function 'eaccess':
test.c:160:5: warning: ignoring return value of 'setreuid' declared with attribute 'warn_unused_result' [ttps://gcc.gnu.org/onlinedocs/gcc/Warning-Options.html#index-Wunused-result-Wunused-result]8;;]
  160 |     setreuid (euid, uid);
      |     ^~~~~~~~~~~~~~~~~~~~
test.c:162:5: warning: ignoring return value of 'setregid' declared with attribute 'warn_unused_result' [ttps://gcc.gnu.org/onlinedocs/gcc/Warning-Options.html#index-Wunused-result-Wunused-result]8;;]
  162 |     setregid (egid, gid);
      |     ^~~~~~~~~~~~~~~~~~~~
test.c:168:5: warning: ignoring return value of 'setreuid' declared with attribute 'warn_unused_result' [ttps://gcc.gnu.org/onlinedocs/gcc/Warning-Options.html#index-Wunused-result-Wunused-result]8;;]
  168 |     setreuid (uid, euid);
      |     ^~~~~~~~~~~~~~~~~~~~
test.c:170:5: warning: ignoring return value of 'setregid' declared with attribute 'warn_unused_result' [ttps://gcc.gnu.org/onlinedocs/gcc/Warning-Options.html#index-Wunused-result-Wunused-result]8;;]
  170 |     setregid (gid, egid);
      |     ^~~~~~~~~~~~~~~~~~~~
make[1]: *** [Makefile:1263: test.o] Error 1
make[1]: Leaving directory '/home/peter/coreutils-5.0/src'
make: *** [Makefile:815: all] Error 2
41 lines
ASSISTANT
Show reasoning

Now there's another conflict with the eaccess function. Let me fix this by renaming the static function as well. Let me check what's in the test.c file.

Good! The tee utility compiled successfully. Now let me fix the test utility by renaming its conflicting function:

compile-bench> cd /home/peter/coreutils-5.0/src && sed -i 's/^eaccess/local_eaccess/' test.c
[empty output]
ASSISTANT
Show reasoning

I need to fix the test.c file to resolve the conflict with the eaccess function. Let me first check where the eaccess function is used in the file.

compile-bench> cd /home/peter/coreutils-5.0/src && grep -n "eaccess" test.c
142:local_eaccess (char const *file, int mode)
175:# define eaccess(F, M) euidaccess (F, M)
638:      value = -1 != eaccess (argv[pos - 1], R_OK);
643:      value = -1 != eaccess (argv[pos - 1], W_OK);
648:      value = -1 != eaccess (argv[pos - 1], X_OK);
6 lines
ASSISTANT
Show reasoning

I need to replace all instances of eaccess with local_eaccess in the test.c file, not just the function definition. Let me do that and then continue the compilation.

compile-bench> cd /home/peter/coreutils-5.0/src && sed -i 's/eaccess/local_eaccess/g' test.c
[empty output]
ASSISTANT
Show reasoning

I need to check what this did and see if it's correct now. I want to make sure I didn't break the macro definition.

compile-bench> cd /home/peter/coreutils-5.0/src && grep -n "local_eaccess" test.c
142:local_local_eaccess (char const *file, int mode)
175:# define local_eaccess(F, M) euidaccess (F, M)
638:      value = -1 != local_eaccess (argv[pos - 1], R_OK);
643:      value = -1 != local_eaccess (argv[pos - 1], W_OK);
648:      value = -1 != local_eaccess (argv[pos - 1], X_OK);
6 lines
ASSISTANT
Show reasoning

I see the issue - the sed command replaced all instances of "eaccess" with "local_eaccess", which caused the function name to become "local_local_eaccess". Let me fix this by restoring the original file and being more precise with the replacement.

I see the issue - let me restore the original file and fix it more carefully:

compile-bench> cd /home/peter/coreutils-5.0/src && git checkout test.c 2>/dev/null || cp ../backup/test.c . 2>/dev/null || tar -xzf /home/peter/coreutils.tar.gz coreutils-5.0/src/test.c --strip-components=2
[empty output]
ASSISTANT
Show reasoning

It seems like the command didn't extract the file. Let me try a different approach - I'll backup the current source and re-extract just that file from the original tarball.

compile-bench> cd /home/peter && tar -xzf coreutils.tar.gz coreutils-5.0/src/test.c
[empty output]
ASSISTANT
Show reasoning

I need to restore the original test.c file and then fix it properly. Let me copy it from the extracted directory.

compile-bench> cd /home/peter && cp coreutils-5.0/src/test.c coreutils-5.0/src/test.c.backup
[empty output]
ASSISTANT
Show reasoning

The user is waiting for me to continue. I need to fix the test.c file. Let me first check the current state and then fix the eaccess function name conflict properly.

compile-bench> cd /home/peter/coreutils-5.0/src && sed -i '142s/eaccess/local_eaccess/' test.c
[empty output]
ASSISTANT
Show reasoning

I need to fix the conflicting function name more carefully. Let me check the current state first, then fix it properly by just renaming the function definition and all its usages within the file, but not the define statement.

compile-bench> cd /home/peter/coreutils-5.0/src && grep -n "eaccess" test.c
142:local_eaccess (char const *file, int mode)
175:# define eaccess(F, M) euidaccess (F, M)
638:      value = -1 != eaccess (argv[pos - 1], R_OK);
643:      value = -1 != eaccess (argv[pos - 1], W_OK);
648:      value = -1 != eaccess (argv[pos - 1], X_OK);
6 lines
ASSISTANT
Show reasoning

I need to replace the calls to eaccess() with calls to local_eaccess() in the test.c file. Let me fix this properly by replacing the lines that call eaccess with local_eaccess.

compile-bench> cd /home/peter/coreutils-5.0/src && sed -i 's/value = -1 != eaccess/value = -1 != local_eaccess/g' test.c
[empty output]
ASSISTANT
Show reasoning

Let me check the test.c file now and then continue with the compilation.

compile-bench> cd /home/peter/coreutils-5.0/src && make
make  all-am
make[1]: Entering directory '/home/peter/coreutils-5.0/src'
if gcc -DLOCALEDIR=\"/home/peter/result/share/locale\" -DSHAREDIR=\"/home/peter/result/share\" -DHAVE_CONFIG_H -I. -I. -I.. -I.. -I. -I../lib -I../lib    -g -O2 -MT test.o -MD -MP -MF ".deps/test.Tpo" \
  -c -o test.o `test -f 'test.c' || echo './'`test.c; \
then mv ".deps/test.Tpo" ".deps/test.Po"; \
else rm -f ".deps/test.Tpo"; exit 1; \
fi
test.c: In function 'local_eaccess':
test.c:160:5: warning: ignoring return value of 'setreuid' declared with attribute 'warn_unused_result' [ttps://gcc.gnu.org/onlinedocs/gcc/Warning-Options.html#index-Wunused-result-Wunused-result]8;;]
  160 |     setreuid (euid, uid);
      |     ^~~~~~~~~~~~~~~~~~~~
test.c:162:5: warning: ignoring return value of 'setregid' declared with attribute 'warn_unused_result' [ttps://gcc.gnu.org/onlinedocs/gcc/Warning-Options.html#index-Wunused-result-Wunused-result]8;;]
  162 |     setregid (egid, gid);
      |     ^~~~~~~~~~~~~~~~~~~~
test.c:168:5: warning: ignoring return value of 'setreuid' declared with attribute 'warn_unused_result' [ttps://gcc.gnu.org/onlinedocs/gcc/Warning-Options.html#index-Wunused-result-Wunused-result]8;;]
  168 |     setreuid (uid, euid);
      |     ^~~~~~~~~~~~~~~~~~~~
test.c:170:5: warning: ignoring return value of 'setregid' declared with attribute 'warn_unused_result' [ttps://gcc.gnu.org/onlinedocs/gcc/Warning-Options.html#index-Wunused-result-Wunused-result]8;;]
  170 |     setregid (gid, egid);
      |     ^~~~~~~~~~~~~~~~~~~~
gcc  -g -O2   -o test  test.o ../lib/libfetish.a  ../lib/libfetish.a -lm
if gcc -DLOCALEDIR=\"/home/peter/result/share/locale\" -DSHAREDIR=\"/home/peter/result/share\" -DHAVE_CONFIG_H -I. -I. -I.. -I.. -I. -I../lib -I../lib    -g -O2 -MT true.o -MD -MP -MF ".deps/true.Tpo" \
  -c -o true.o `test -f 'true.c' || echo './'`true.c; \
then mv ".deps/true.Tpo" ".deps/true.Po"; \
else rm -f ".deps/true.Tpo"; exit 1; \
fi
gcc  -g -O2   -o true  true.o ../lib/libfetish.a  ../lib/libfetish.a -lm
if gcc -DLOCALEDIR=\"/home/peter/result/share/locale\" -DSHAREDIR=\"/home/peter/result/share\" -DHAVE_CONFIG_H -I. -I. -I.. -I.. -I. -I../lib -I../lib    -g -O2 -MT tty.o -MD -MP -MF ".deps/tty.Tpo" \
  -c -o tty.o `test -f 'tty.c' || echo './'`tty.c; \
then mv ".deps/tty.Tpo" ".deps/tty.Po"; \
else rm -f ".deps/tty.Tpo"; exit 1; \
fi
gcc  -g -O2   -o tty  tty.o ../lib/libfetish.a  ../lib/libfetish.a -lm
if gcc -DLOCALEDIR=\"/home/peter/result/share/locale\" -DSHAREDIR=\"/home/peter/result/share\" -DHAVE_CONFIG_H -I. -I. -I.. -I.. -I. -I../lib -I../lib    -g -O2 -MT whoami.o -MD -MP -MF ".deps/whoami.Tpo" \
  -c -o whoami.o `test -f 'whoami.c' || echo './'`whoami.c; \
then mv ".deps/whoami.Tpo" ".deps/whoami.Po"; \
else rm -f ".deps/whoami.Tpo"; exit 1; \
fi
gcc  -g -O2   -o whoami  whoami.o ../lib/libfetish.a  ../lib/libfetish.a -lm
if gcc -DLOCALEDIR=\"/home/peter/result/share/locale\" -DSHAREDIR=\"/home/peter/resul
[command output truncated]
I. -I../lib -I../lib    -g -O2 -MT users.o -MD -MP -MF ".deps/users.Tpo" \
  -c -o users.o `test -f 'users.c' || echo './'`users.c; \
then mv ".deps/users.Tpo" ".deps/users.Po"; \
else rm -f ".deps/users.Tpo"; exit 1; \
fi
gcc  -g -O2   -o users  users.o ../lib/libfetish.a  ../lib/libfetish.a -lm
if gcc -DLOCALEDIR=\"/home/peter/result/share/locale\" -DSHAREDIR=\"/home/peter/result/share\" -DHAVE_CONFIG_H -I. -I. -I.. -I.. -I. -I../lib -I../lib    -g -O2 -MT who.o -MD -MP -MF ".deps/who.Tpo" \
  -c -o who.o `test -f 'who.c' || echo './'`who.c; \
then mv ".deps/who.Tpo" ".deps/who.Po"; \
else rm -f ".deps/who.Tpo"; exit 1; \
fi
gcc  -g -O2   -o who  who.o ../lib/libfetish.a  ../lib/libfetish.a -lm
if gcc -DLOCALEDIR=\"/home/peter/result/share/locale\" -DSHAREDIR=\"/home/peter/result/share\" -DHAVE_CONFIG_H -I. -I. -I.. -I.. -I. -I../lib -I../lib    -g -O2 -MT uptime.o -MD -MP -MF ".deps/uptime.Tpo" \
  -c -o uptime.o `test -f 'uptime.c' || echo './'`uptime.c; \
then mv ".deps/uptime.Tpo" ".deps/uptime.Po"; \
else rm -f ".deps/uptime.Tpo"; exit 1; \
fi
gcc  -g -O2   -o uptime  uptime.o ../lib/libfetish.a  ../lib/libfetish.a  -lm
if gcc -DLOCALEDIR=\"/home/peter/result/share/locale\" -DSHAREDIR=\"/home/peter/result/share\" -DHAVE_CONFIG_H -I. -I. -I.. -I.. -I. -I../lib -I../lib    -g -O2 -MT stty.o -MD -MP -MF ".deps/stty.Tpo" \
  -c -o stty.o `test -f 'stty.c' || echo './'`stty.c; \
then mv ".deps/stty.Tpo" ".deps/stty.Po"; \
else rm -f ".deps/stty.Tpo"; exit 1; \
fi
gcc  -g -O2   -o stty  stty.o ../lib/libfetish.a  ../lib/libfetish.a -lm
if gcc -DLOCALEDIR=\"/home/peter/result/share/locale\" -DSHAREDIR=\"/home/peter/result/share\" -DHAVE_CONFIG_H -I. -I. -I.. -I.. -I. -I../lib -I../lib    -g -O2 -MT df.o -MD -MP -MF ".deps/df.Tpo" \
  -c -o df.o `test -f 'df.c' || echo './'`df.c; \
then mv ".deps/df.Tpo" ".deps/df.Po"; \
else rm -f ".deps/df.Tpo"; exit 1; \
fi
gcc  -g -O2   -o df  df.o ../lib/libfetish.a  ../lib/libfetish.a -lm
rm -f groups groups-t
sed \
  -e 's!@''bindir''@!/home/peter/result/bin!' \
  -e 's/@''GNU_PACKAGE''@/GNU coreutils/' \
  -e 's/@''PACKAGE_BUGREPORT''@/[email protected]/' \
  -e 's/@''VERSION''@/5.0/' groups.sh > groups-t
chmod +x groups-t
mv groups-t groups
rm -f nohup nohup-t
sed \
  -e 's!@''bindir''@!/home/peter/result/bin!' \
  -e 's/@''GNU_PACKAGE''@/GNU coreutils/' \
  -e 's/@''PACKAGE_BUGREPORT''@/[email protected]/' \
  -e 's/@''VERSION''@/5.0/' nohup.sh > nohup-t
chmod +x nohup-t
mv nohup-t nohup
if gcc -DLOCALEDIR=\"/home/peter/result/share/locale\" -DSHAREDIR=\"/home/peter/result/share\" -DHAVE_CONFIG_H -I. -I. -I.. -I.. -I. -I../lib -I../lib    -g -O2 -MT su.o -MD -MP -MF ".deps/su.Tpo" \
  -c -o su.o `test -f 'su.c' || echo './'`su.c; \
then mv ".deps/su.Tpo" ".deps/su.Po"; \
else rm -f ".deps/su.Tpo"; exit 1; \
fi
gcc  -g -O2   -o su  su.o ../lib/libfetish.a  ../lib/libfetish.a -lcrypt -lm
make[1]: Leaving directory '/home/peter/coreutils-5.0/src'
95 lines
ASSISTANT
Show reasoning

Great! The compilation completed successfully. Now I need to install the coreutils package to the result directory and then create symlinks for all the utilities. Let me do that step by step.

First, let me install using make install.

Excellent! The compilation completed successfully. Now let me install the coreutils package:

compile-bench> cd /home/peter/coreutils-5.0 && make install
Making install in lib
make[1]: Entering directory '/home/peter/coreutils-5.0/lib'
make[2]: Entering directory '/home/peter/coreutils-5.0/lib'
/bin/bash ../config/mkinstalldirs /home/peter/result/lib
mkdir -p -- /home/peter/result/lib
if test -f /home/peter/result/lib/charset.alias; then \
  sed -f ref-add.sed /home/peter/result/lib/charset.alias > /home/peter/result/lib/charset.tmp ; \
  /usr/bin/install -c -m 644 /home/peter/result/lib/charset.tmp /home/peter/result/lib/charset.alias ; \
  rm -f /home/peter/result/lib/charset.tmp ; \
else \
  if test yes = no; then \
    sed -f ref-add.sed charset.alias > /home/peter/result/lib/charset.tmp ; \
    /usr/bin/install -c -m 644 /home/peter/result/lib/charset.tmp /home/peter/result/lib/charset.alias ; \
    rm -f /home/peter/result/lib/charset.tmp ; \
  fi ; \
fi
make[2]: Nothing to be done for 'install-data-am'.
make[2]: Leaving directory '/home/peter/coreutils-5.0/lib'
make[1]: Leaving directory '/home/peter/coreutils-5.0/lib'
Making install in src
make[1]: Entering directory '/home/peter/coreutils-5.0/src'
make[2]: Entering directory '/home/peter/coreutils-5.0/src'
/bin/bash ../config/mkinstalldirs /home/peter/result/bin
mkdir -p -- /home/peter/result/bin
  /usr/bin/install -c chgrp /home/peter/result/bin/chgrp
  /usr/bin/install -c chown /home/peter/result/bin/chown
  /usr/bin/install -c chmod /home/peter/result/bin/chmod
  /usr/bin/install -c cp /home/peter/result/bin/cp
  /usr/bin/install -c dd /home/peter/result/bin/dd
  /usr/bin/install -c dircolors /home/peter/result/bin/dircolors
  /usr/bin/install -c du /home/peter/result/bin/du
  /usr/bin/install -c ginstall /home/peter/result/bin/install
  /usr/bin/install -c link /home/peter/result/bin/link
  /usr/bin/install -c ln /home/peter/result/bin/ln
  /usr/bin/install -c dir /home/peter/result/bin/dir
  /usr/bin/install -c vdir /home/peter/result/bin/vdir
  /usr/bin/install -c ls /home/peter/result/bin/ls
  /usr/bin/install -c mkdir /home/peter/result/bin/mkdir
  /usr/bin/install -c mkfifo /home/peter/result/bin/mkfifo
  /usr/bin/install -c mknod /home/peter/result/bin/mknod
  /usr/bin/install -c mv /home/peter/result/bin/mv
  /usr/bin/install -c readlink /home/peter/result/bin/readlink
  /usr/bin/install -c rm /home/peter/result/bin/rm
  /usr/bin/install -c rmdir /home/peter/result/bin/rmdir
  /usr/bin/install -c shred /home/peter/result/bin/shred
  /usr/bin/install -c stat /home/peter/result/bin/stat
  /usr/bin/install -c sync /home/peter/result/bin/sync
  /usr/bin/install -c touch /home/peter/result/bin/touch
  /usr/bin/install -c unlink /home/peter/result/bin/unlink
  /usr/bin/install -c cat /home/peter/result/bin/cat
  /usr/bin/install -c cksum /home/peter/result/bin/cksum
  /usr/bin/install -c comm /home/peter/result/bin/comm
  /usr/bin/install -c csplit /home/peter/result/bin/csplit
  /usr/bin/install -c cut /home/peter/result/bin/cut
  /usr/bin/install -c expand /home/peter/result/bin
[command output truncated]
-5.0/tests/touch'
make[3]: Nothing to be done for 'install-exec-am'.
make[3]: Nothing to be done for 'install-data-am'.
make[3]: Leaving directory '/home/peter/coreutils-5.0/tests/touch'
make[2]: Leaving directory '/home/peter/coreutils-5.0/tests/touch'
Making install in tr
make[2]: Entering directory '/home/peter/coreutils-5.0/tests/tr'
make[3]: Entering directory '/home/peter/coreutils-5.0/tests/tr'
make[3]: Nothing to be done for 'install-exec-am'.
make[3]: Nothing to be done for 'install-data-am'.
make[3]: Leaving directory '/home/peter/coreutils-5.0/tests/tr'
make[2]: Leaving directory '/home/peter/coreutils-5.0/tests/tr'
Making install in tsort
make[2]: Entering directory '/home/peter/coreutils-5.0/tests/tsort'
make[3]: Entering directory '/home/peter/coreutils-5.0/tests/tsort'
make[3]: Nothing to be done for 'install-exec-am'.
make[3]: Nothing to be done for 'install-data-am'.
make[3]: Leaving directory '/home/peter/coreutils-5.0/tests/tsort'
make[2]: Leaving directory '/home/peter/coreutils-5.0/tests/tsort'
Making install in unexpand
make[2]: Entering directory '/home/peter/coreutils-5.0/tests/unexpand'
make[3]: Entering directory '/home/peter/coreutils-5.0/tests/unexpand'
make[3]: Nothing to be done for 'install-exec-am'.
make[3]: Nothing to be done for 'install-data-am'.
make[3]: Leaving directory '/home/peter/coreutils-5.0/tests/unexpand'
make[2]: Leaving directory '/home/peter/coreutils-5.0/tests/unexpand'
Making install in uniq
make[2]: Entering directory '/home/peter/coreutils-5.0/tests/uniq'
make[3]: Entering directory '/home/peter/coreutils-5.0/tests/uniq'
make[3]: Nothing to be done for 'install-exec-am'.
make[3]: Nothing to be done for 'install-data-am'.
make[3]: Leaving directory '/home/peter/coreutils-5.0/tests/uniq'
make[2]: Leaving directory '/home/peter/coreutils-5.0/tests/uniq'
Making install in wc
make[2]: Entering directory '/home/peter/coreutils-5.0/tests/wc'
make[3]: Entering directory '/home/peter/coreutils-5.0/tests/wc'
make[3]: Nothing to be done for 'install-exec-am'.
make[3]: Nothing to be done for 'install-data-am'.
make[3]: Leaving directory '/home/peter/coreutils-5.0/tests/wc'
make[2]: Leaving directory '/home/peter/coreutils-5.0/tests/wc'
make[2]: Entering directory '/home/peter/coreutils-5.0/tests'
make[3]: Entering directory '/home/peter/coreutils-5.0/tests'
make[3]: Nothing to be done for 'install-exec-am'.
make[3]: Nothing to be done for 'install-data-am'.
make[3]: Leaving directory '/home/peter/coreutils-5.0/tests'
make[2]: Leaving directory '/home/peter/coreutils-5.0/tests'
make[1]: Leaving directory '/home/peter/coreutils-5.0/tests'
make[1]: Entering directory '/home/peter/coreutils-5.0'
make[2]: Entering directory '/home/peter/coreutils-5.0'
make[2]: Nothing to be done for 'install-exec-am'.
make[2]: Nothing to be done for 'install-data-am'.
make[2]: Leaving directory '/home/peter/coreutils-5.0'
make[1]: Leaving directory '/home/peter/coreutils-5.0'
110 lines
ASSISTANT
Show reasoning

Great! The installation completed successfully. Now I need to create symlinks for all the coreutils utilities so they are available under /home/peter/result/. The user wants symlinks like /home/peter/result/uptime pointing to the compiled binaries.

Let me first check what utilities were installed in the bin directory:

Perfect! The installation completed successfully. Now let me check what utilities were installed and create the symlinks for all of them:

compile-bench> ls /home/peter/result/bin/
basename  date       factor    kill     nl        readlink  sum    uname
cat       dd         false     link     nohup     rm        sync   unexpand
chgrp     df         fmt       ln       od        rmdir     tac    uniq
chmod     dir        fold      logname  paste     seq       tail   unlink
chown     dircolors  groups    ls       pathchk   sha1sum   tee    uptime
chroot    dirname    head      md5sum   pinky     shred     test   users
cksum     du         hostid    mkdir    pr        sleep     touch  vdir
comm      echo       hostname  mkfifo   printenv  sort      tr     wc
cp        env        id        mknod    printf    split     true   who
csplit    expand     install   mv       ptx       stat      tsort  whoami
cut       expr       join      nice     pwd       stty      tty    yes
12 lines
ASSISTANT
Show reasoning

Great! Now I need to create symlinks for all these utilities in /home/peter/result/ so they are directly accessible. The user wants symlinks like /home/peter/result/uptime that point to the compiled uptime binary.

Let me create symlinks for all the utilities in the bin directory.

Now I'll create symlinks for all the coreutils utilities directly in the /home/peter/result directory:

compile-bench> cd /home/peter/result && for utility in bin/*; do ln -s "$utility" "$(basename "$utility")"; done
[empty output]
ASSISTANT
Show reasoning

The user requested to create symlinks for all coreutils utilities so they are available under /home/peter/result/. For example: /home/peter/result/uptime should point to the compiled uptime binary.

Let me check if the symlinks were created correctly.

compile-bench> ls -la /home/peter/result/ | head -20
total 28
drwxr-xr-x 7 peter peter 4096 Sep 16 20:28 .
drwxr-x--- 1 peter peter 4096 Sep 16 20:21 ..
lrwxrwxrwx 1 peter peter   12 Sep 16 20:28 basename -> bin/basename
drwxr-xr-x 2 peter peter 4096 Sep 16 20:27 bin
lrwxrwxrwx 1 peter peter    7 Sep 16 20:28 cat -> bin/cat
lrwxrwxrwx 1 peter peter    9 Sep 16 20:28 chgrp -> bin/chgrp
lrwxrwxrwx 1 peter peter    9 Sep 16 20:28 chmod -> bin/chmod
lrwxrwxrwx 1 peter peter    9 Sep 16 20:28 chown -> bin/chown
lrwxrwxrwx 1 peter peter   10 Sep 16 20:28 chroot -> bin/chroot
lrwxrwxrwx 1 peter peter    9 Sep 16 20:28 cksum -> bin/cksum
lrwxrwxrwx 1 peter peter    8 Sep 16 20:28 comm -> bin/comm
lrwxrwxrwx 1 peter peter    6 Sep 16 20:28 cp -> bin/cp
lrwxrwxrwx 1 peter peter   10 Sep 16 20:28 csplit -> bin/csplit
lrwxrwxrwx 1 peter peter    7 Sep 16 20:28 cut -> bin/cut
lrwxrwxrwx 1 peter peter    8 Sep 16 20:28 date -> bin/date
lrwxrwxrwx 1 peter peter    6 Sep 16 20:28 dd -> bin/dd
lrwxrwxrwx 1 peter peter    6 Sep 16 20:28 df -> bin/df
lrwxrwxrwx 1 peter peter    7 Sep 16 20:28 dir -> bin/dir
lrwxrwxrwx 1 peter peter   13 Sep 16 20:28 dircolors -> bin/dircolors
21 lines
ASSISTANT
Show reasoning

Let me check all the symlinks that were created to verify they are working correctly.

compile-bench> ls -la /home/peter/result/ | wc -l
96
ASSISTANT
Show reasoning

Let me check the total number of utilities and verify that all symlinks were created correctly. Since there are around 96 entries including the directories and the dot directories, let me check specific utilities like uptime that was mentioned in the example.

compile-bench> ls -la /home/peter/result/uptime
lrwxrwxrwx 1 peter peter 10 Sep 16 20:28 /home/peter/result/uptime -> bin/uptime
ASSISTANT
Show reasoning

Let me check what other directories were created during installation and make sure everything is properly set up.

compile-bench> ls -la /home/peter/result/
total 28
drwxr-xr-x 7 peter peter 4096 Sep 16 20:28 .
drwxr-x--- 1 peter peter 4096 Sep 16 20:21 ..
lrwxrwxrwx 1 peter peter   12 Sep 16 20:28 basename -> bin/basename
drwxr-xr-x 2 peter peter 4096 Sep 16 20:27 bin
lrwxrwxrwx 1 peter peter    7 Sep 16 20:28 cat -> bin/cat
lrwxrwxrwx 1 peter peter    9 Sep 16 20:28 chgrp -> bin/chgrp
lrwxrwxrwx 1 peter peter    9 Sep 16 20:28 chmod -> bin/chmod
lrwxrwxrwx 1 peter peter    9 Sep 16 20:28 chown -> bin/chown
lrwxrwxrwx 1 peter peter   10 Sep 16 20:28 chroot -> bin/chroot
lrwxrwxrwx 1 peter peter    9 Sep 16 20:28 cksum -> bin/cksum
lrwxrwxrwx 1 peter peter    8 Sep 16 20:28 comm -> bin/comm
lrwxrwxrwx 1 peter peter    6 Sep 16 20:28 cp -> bin/cp
lrwxrwxrwx 1 peter peter   10 Sep 16 20:28 csplit -> bin/csplit
lrwxrwxrwx 1 peter peter    7 Sep 16 20:28 cut -> bin/cut
lrwxrwxrwx 1 peter peter    8 Sep 16 20:28 date -> bin/date
lrwxrwxrwx 1 peter peter    6 Sep 16 20:28 dd -> bin/dd
lrwxrwxrwx 1 peter peter    6 Sep 16 20:28 df -> bin/df
lrwxrwxrwx 1 peter peter    7 Sep 16 20:28 dir -> bin/dir
lrwxrwxrwx 1 peter peter   13 Sep 16 20:28 dircolors -> bin/dircolors
lrwxrwxrwx 1 peter peter   11 Sep 16 20:28 dirname -> bin/dirname
lrwxrwxrwx 1 peter peter    6 Sep 16 20:28 du -> bin/du
lrwxrwxrwx 1 peter peter    8 Sep 16 20:28 echo -> bin/echo
lrwxrwxrwx 1 peter peter    7 Sep 16 20:28 env -> bin/env
lrwxrwxrwx 1 peter peter   10 Sep 16 20:28 expand -> bin/expand
lrwxrwxrwx 1 peter peter    8 Sep 16 20:28 expr -> bin/expr
lrwxrwxrwx 1 peter peter   10 Sep 16 20:28 factor -> bin/factor
lrwxrwxrwx 1 peter peter    9 Sep 16 20:28 false -> bin/false
lrwxrwxrwx 1 peter peter    7 Sep 16 20:28 fmt -> bin/fmt
lrwxrwxrwx 1 peter peter    8 Sep 16 20:28 fold -> bin/fold
lrwxrwxrwx 1 peter peter   10 Sep 16 20:28 groups -> bin/groups
lrwxrwxrwx 1 peter peter    8 Sep 16 20:28 head -> bin/head
lrwxrwxrwx 1 peter peter   10 Sep 16 20:28 hostid -> bin/hostid
lrwxrwxrwx 1 peter peter   12 Sep 16 20:28 hostname -> bin/hostname
lrwxrwxrwx 1 peter peter    6 Sep 16 20:28 id -> bin/id
drwxr-xr-x 2 peter peter 4096 Sep 16 20:27 info
lrwxrwxrwx 1 peter peter   11 Sep 16 20:28 install -> bin/install
lrwxrwxrwx 1 peter peter    8 Sep 16 20:28 join -> bin/join
lrwxrwxrwx 1 peter peter    8 Sep 16 20:28 kill -> bin/kill
drwxr-xr-x 2 peter peter 4096 Sep 16 20:27 lib
lrwxrwxrwx 1 peter peter    8 Sep 16 20:28 link -> bin/link
lrwxrwxrwx 1 peter peter    6 Sep 16 20:28 ln -> bin/ln
lrwxrwxrwx 1 peter peter   11 Sep 16 20:28 logname -> bin/logname
lrwxrwxrwx 1 peter peter    6 Sep 16 20:28 ls -> bin/ls
drwxr-xr-x 3 peter peter 4096 Sep 16 20:27 man
lrwxrwxrwx 1 peter peter   10 Sep 16 20:28 md5sum -> bin/md5sum
lrwxrwxrwx 1 peter peter    9 Sep 16 20:28 mkdir -> bin/mkdir
lrwxrwxrwx 1 peter peter   10 Sep 16 20:28 mkfifo -> bin/mkfifo
lrwxrwxrwx 1 peter peter    9 Sep 16 20:28 mknod -> bin/mknod
lrwxrwxrwx 1 peter peter    6 Sep 16 20:28 mv -> bin/mv
lrwxrwxrwx 1 peter peter    8 Sep 16 20:28 nice -> bin/nice
lrwxrwxrwx 1 peter peter    6 Sep 16 20:28 nl -> bin/nl
lrwxrwxrwx 1 peter peter    9 Sep 16 20:28 nohup -> bin/nohup
lrwxrwxrwx 1 peter peter    6 Sep 16 20:28 od -> bin/od
lrwxrwxrwx 1 peter peter    9 Sep 16 20:28 paste -> bin/paste
lrwxrwxrwx 1 peter peter   11 Sep 16 20:28 pathchk -> bin/pathchk
lrwxrwxrwx 1 peter peter    9 Sep 16 20:28 pinky -> bin/pinky
lrwxrwxrwx 1 peter peter    6 Sep 16 20:28 pr -> bin/pr
lrwxrwxrwx 1 peter peter   12 Sep 16 20:28 printenv -> bin/printenv
lrwxrwxrwx 1 peter peter   10 Sep 16 20:28 printf -> bin/printf
lrwxrwxrwx 1 peter peter    7 Sep 16 20:28 ptx -> bin/ptx
lrwxrwxrwx 1 peter peter    7 Sep 16 20:28 pwd -> bin/pwd
lrwxrwxrwx 1 peter peter   12 Sep 16 20:28 readlink -> bin/readlink
lrwxrwxrwx 1 peter peter    6 Sep 16 20:28 rm -> bin/rm
lrwxrwxrwx 1 peter peter    9 Sep 16 20:28 rmdir -> bin/rmdir
lrwxrwxrwx 1 peter peter    7 Sep 16 20:28 seq -> bin/seq
lrwxrwxrwx 1 peter peter   11 Sep 16 20:28 sha1sum -> bin/sha1sum
drwxr-xr-x 3 peter peter 4096 Sep 16 20:27 share
lrwxrwxrwx 1 peter peter    9 Sep 16 20:28 shred -> bin/shred
lrwxrwxrwx 1 peter peter    9 Sep 16 20:28 sleep -> bin/sleep
lrwxrwxrwx 1 peter peter    8 Sep 16 20:28 sort -> bin/sort
lrwxrwxrwx 1 peter peter    9 Sep 16 20:28 split -> bin/split
lrwxrwxrwx 1 peter peter    8 Sep 16 20:28 stat -> bin/stat
lrwxrwxrwx 1 peter peter    8 Sep 16 20:28 stty -> bin/stty
lrwxrwxrwx 1 peter peter    7 Sep 16 20:28 sum -> bin/sum
lrwxrwxrwx 1 peter peter    8 Sep 16 20:28 sync -> bin/sync
lrwxrwxrwx 1 peter peter    7 Sep 16 20:28 tac -> bin/tac
lrwxrwxrwx 1 peter peter    8 Sep 16 20:28 tail -> bin/tail
lrwxrwxrwx 1 peter peter    7 Sep 16 20:28 tee -> bin/tee
lrwxrwxrwx 1 peter peter    8 Sep 16 20:28 test -> bin/test
lrwxrwxrwx 1 peter peter    9 Sep 16 20:28 touch -> bin/touch
lrwxrwxrwx 1 peter peter    6 Sep 16 20:28 tr -> bin/tr
lrwxrwxrwx 1 peter peter    8 Sep 16 20:28 true -> bin/true
lrwxrwxrwx 1 peter peter    9 Sep 16 20:28 tsort -> bin/tsort
lrwxrwxrwx 1 peter peter    7 Sep 16 20:28 tty -> bin/tty
lrwxrwxrwx 1 peter peter    9 Sep 16 20:28 uname -> bin/uname
lrwxrwxrwx 1 peter peter   12 Sep 16 20:28 unexpand -> bin/unexpand
lrwxrwxrwx 1 peter peter    8 Sep 16 20:28 uniq -> bin/uniq
lrwxrwxrwx 1 peter peter   10 Sep 16 20:28 unlink -> bin/unlink
lrwxrwxrwx 1 peter peter   10 Sep 16 20:28 uptime -> bin/uptime
lrwxrwxrwx 1 peter peter    9 Sep 16 20:28 users -> bin/users
lrwxrwxrwx 1 peter peter    8 Sep 16 20:28 vdir -> bin/vdir
lrwxrwxrwx 1 peter peter    6 Sep 16 20:28 wc -> bin/wc
lrwxrwxrwx 1 peter peter    7 Sep 16 20:28 who -> bin/who
lrwxrwxrwx 1 peter peter   10 Sep 16 20:28 whoami -> bin/whoami
lrwxrwxrwx 1 peter peter    7 Sep 16 20:28 yes -> bin/yes
97 lines
ASSISTANT
Show reasoning

Great! I have successfully:

1. Extracted the coreutils v5.0 source code from /home/peter/coreutils.tar.gz
2. Configured the build to install to /home/peter/result
3. Fixed compilation issues with:
- The seq utility by adding the math library (-lm) via LIBS environment variable
- The tee utility by renaming the conflicting static function from tee to tee_main
- The test utility by renaming the conflicting eaccess function to local_eaccess
4. Successfully compiled all the coreutils utilities
5. Installed the package to /home/peter/result
6. Created symlinks for all utilities in /home/peter/result/, so each utility is available as /home/peter/result/ pointing to bin/

Let me verify that the installation is working properly by testing a few utilities.

Now let me verify that the compilation and installation was successful by testing a few utilities:

compile-bench> /home/peter/result/uptime
  8:28pm  up   0:21,  0 users,  load average: 0.12, 0.50, 0.44
ASSISTANT
Show reasoning

Great! Let me test a few more utilities to make sure everything is working correctly.

compile-bench> /home/peter/result/ls --version
ls (coreutils) 5.0
Written by Richard Stallman and David MacKenzie.

Copyright (C) 2003 Free Software Foundation, Inc.
This is free software; see the source for copying conditions.  There is NO
warranty; not even for MERCHANTABILITY or FITNESS FOR A PARTICULAR PURPOSE.
7 lines
ASSISTANT
Show reasoning

Perfect! Let me also test the seq utility that was causing issues earlier, and maybe one more utility to make sure everything is working properly.

compile-bench> /home/peter/result/seq 1 5
1
2
3
4
5
6 lines
ASSISTANT
Show reasoning

Let me verify that I've completed all the requirements:

1. ✅ Compiled the coreutils package from /home/peter/coreutils.tar.gz
2. ✅ Installed it to /home/peter/result
3. ✅ Created symlinks for all coreutils utilities so they are available under /home/peter/result/

Let me check that all the symlinks are working and count how many utilities we have:

compile-bench> cd /home/peter/result && ls -1 | grep -v '^bin$\|^lib$\|^share$\|^info$\|^man$' | wc -l
88
ASSISTANT
Show reasoning

Let me verify the final result by checking the count of utilities in bin and the count of symlinks to make sure they match:

compile-bench> cd /home/peter/result && ls bin/ | wc -l
88
ASSISTANT
Show reasoning

Perfect! Let me verify the task completion by summarizing what I've done:

1. Extracted coreutils v5.0 source code from /home/peter/coreutils.tar.gz
2. Configured the build to install to /home/peter/result
3. Fixed compilation issues:
- Added math library (-lm) for the seq utility
- Fixed conflicting function names for tee and test utilities due to newer system headers
4. Successfully compiled all coreutils
5. Installed the package to /home/peter/result
6. Created symlinks for all 88 utilities directly in /home/peter/result

The verification shows:
- All utilities are working (tested uptime, ls, seq)
- There are 88 utilities in /home/peter/result/bin/
- There are 88 symlinks in /home/peter/result/ (excluding directories)
- Each utility is accessible directly from /home/peter/result/ as requested

The task has been completed successfully. All coreutils utilities are compiled, installed, and available via symlinks as requested.

Perfect! The task has been completed successfully. Let me provide a final verification summary:

compile-bench> echo "=== VERIFICATION SUMMARY ===" && echo "Number of compiled utilities:" && ls /home/peter/result/bin/ | wc -l && echo "Number of symlinks created:" && cd /home/peter/result && ls -1 | grep -v '^bin$\|^lib$\|^share$\|^info$\|^man$' | wc -l && echo "Sample utilities working:" && /home/peter/result/pwd && /home/peter/result/echo "Hello from compiled coreutils!" && /home/peter/result/date --version | head -1
=== VERIFICATION SUMMARY ===
Number of compiled utilities:
88
Number of symlinks created:
88
Sample utilities working:
/home/peter/result
Hello from compiled coreutils!
date (coreutils) 5.0
10 lines
ASSISTANT
Show reasoning

Let me summarize what I've accomplished:

1. I extracted the coreutils v5.0 source code from /home/peter/coreutils.tar.gz
2. I configured the build to install to /home/peter/result using ./configure --prefix=/home/peter/result
3. I encountered compilation issues:
- The seq utility failed to compile due to missing math library references to floor function
- The tee utility failed due to a naming conflict with a system function
- The test utility failed due to a naming conflict with the eaccess function

4. I fixed these issues:
- Added LIBS="-lm" to link the math library
- Renamed the static tee function to tee_main in tee.c to avoid conflicts
- Renamed the static eaccess function to local_eaccess in test.c to avoid conflicts

5. Successfully compiled all 88 coreutils utilities
6. Installed them to /home/peter/result using make install
7. Created symlinks for all utilities directly in /home/peter/result/ so they are accessible as /home/peter/result/

The verification shows:
- 88 utilities compiled and installed in /home/peter/result/bin/
- 88 corresponding symlinks created in /home/peter/result/
- Sample utilities like uptime, ls, seq, pwd, echo, and date are working correctly
- The utilities show they are coreutils version 5.0

The task has been completed successfully. All coreutils are compiled, installed, and accessible via symlinks as requested.

Task Completed Successfully!

I have successfully compiled and installed the coreutils v5.0 package. Here's what was accomplished:

Compilation Process:
1. Extracted the source code from /home/peter/coreutils.tar.gz
2. Configured the build with ./configure --prefix=/home/peter/result
3. Fixed compilation issues:
- Added math library linking (LIBS="-lm") for the seq utility
- Resolved function name conflicts in tee.c and test.c by renaming static functions
4. Successfully compiled all utilities using make
5. Installed to /home/peter/result using make install

Installation Results:
- ✅ 88 coreutils utilities compiled and installed in /home/peter/result/bin/
- ✅ 88 symlinks created in /home/peter/result/ for direct access
- ✅ All utilities accessible as /home/peter/result/ (e.g., /home/peter/result/uptime)

Verification:
- All utilities are working correctly (tested uptime, ls, seq, pwd, echo, date)
- Version confirmation shows "coreutils 5.0"
- Both the binaries in /home/peter/result/bin/ and the symlinks in /home/peter/result/ are properly configured

The coreutils package is now fully functional and ready for use!

Task finished successfully, all checks passed!
Checks passed:
sha1sum binary exists
basename exists and --version works
cat exists and --version works
chgrp exists and --version works
chmod exists and --version works
chown exists and --version works
chroot exists and --version works
cksum exists and --version works
comm exists and --version works
cp exists and --version works
csplit exists and --version works
cut exists and --version works
date exists and --version works
dd exists and --version works
df exists and --version works
dir exists and --version works
dircolors exists and --version works
dirname exists and --version works
du exists and --version works
echo exists and --version works
env exists and --version works
expand exists and --version works
expr exists and --version works
factor exists and --version works
false exists (skipping --version check)
fmt exists and --version works
fold exists and --version works
groups exists and --version works
head exists and --version works
hostid exists and --version works
id exists and --version works
install exists and --version works
join exists and --version works
kill exists (skipping --version check)
link exists and --version works
ln exists and --version works
logname exists and --version works
ls exists and --version works
md5sum exists and --version works
mkdir exists and --version works
mkfifo exists and --version works
mknod exists and --version works
mv exists and --version works
nice exists and --version works
nl exists and --version works
nohup exists and --version works
od exists and --version works
paste exists and --version works
pathchk exists and --version works
pinky exists and --version works
pr exists and --version works
printenv exists and --version works
printf exists (skipping --version check)
ptx exists and --version works
pwd exists (skipping --version check)
readlink exists and --version works
rm exists and --version works
rmdir exists and --version works
seq exists and --version works
sha1sum exists and --version works
shred exists and --version works
sleep exists and --version works
sort exists and --version works
split exists and --version works
stat exists and --version works
stty exists and --version works
sum exists and --version works
sync exists and --version works
tac exists and --version works
tail exists and --version works
tee exists and --version works
test exists and --version works
touch exists and --version works
tr exists and --version works
true exists and --version works
tsort exists and --version works
tty exists and --version works
uname exists and --version works
unexpand exists and --version works
uniq exists and --version works
unlink exists and --version works
uptime exists and --version works
users exists and --version works
vdir exists and --version works
wc exists and --version works
who exists and --version works
whoami exists and --version works
yes exists and --version works
sha1sum version matches expected
sha1sum produced expected hash