| Cost | $0.406 |
| Total elapsed time | 3m52s |
| LLM inference time | 2m20s |
| Command execution time | 1m32s |
| Commands executed | 31 |
All details >
| Attempt ID | 7o8tyki994695 | Attempt group | run-29-09-25-19-32 |
| Revision | 0cfc533b3f68 | AWS Instance | m8i.2xlarge |
| Start time | 2025-09-29T18:17:54.206Z | End time | 2025-09-29T18:21:46.780Z |
| Task | coreutils-old-version | Environment | ubuntu-22.04-amd64-offline |
| Model | | OpenRouter slug | anthropic/claude-sonnet-4.5 |
| Temperature | 1 | Explicit prompt caching | true |
| User msg after tool call | true | Max tool calls | 90 |
| Total timeout seconds | 1200 | Single command timeout | 600 |
| Cost | $0.406 | Duration | 3m52s |
| LLM inference time | 2m20s | Command execution time | 1m32s |
| Final context tokens | 21,266 | Total output tokens | 6,097 |
| Output reasoning tokens | 2,055 | Messages | 65 |
| Assistant messages | 32 | User messages | 1 |
| System messages | 1 | Commands executed | 31 |
GNU coreutils 5.0 (from 2003) is a collection of Linux utilities like ls, cp, mv, etc.
Project link: gnu.org/software/coreutils
Task:
Compile and install all coreutils utilities to a specific location.
Difficulties:
The source is very old (2003) and requires heavy patching.
Environment:
Ubuntu 22.04 on amd64, without internet access.
You are a package-building specialist operating a Ubuntu 22.04 bash shell via one tool: run_terminal_cmd.
The current working directory of every run_terminal_cmd is /home/peter.
Execution rules:
- Always pass non-interactive flags for any command that could prompt (e.g., -y, --yes, DEBIAN_FRONTEND=noninteractive).
- Don't include any newlines in the command.
- The environment is offline, assume you have all the necessary tools already installed.
If you encounter any errors or issues while doing the user's request, you must fix them and continue the task.
At the end verify you did the user request correctly.
You are given a coreutils v5.0 source code at /home/peter/coreutils.tar.gz. Please compile the coreutils package and install it to /home/peter/result. Create symlinks for all coreutils utilities so they are available under /home/peter/result/
Show reasoning
The user wants me to:
1. Extract the coreutils v5.0 source code from /home/peter/coreutils.tar.gz
2. Compile the coreutils package
3. Install it to /home/peter/result
4. Create symlinks for all coreutils utilities so they are available under /home/peter/result/
Let me start by extracting the tarball and exploring its contents.
I'll help you compile coreutils v5.0 and install it with the proper symlinks. Let me start by extracting and examining the source code.
[empty output]
Show reasoning
The extraction seems to have worked. Let me check what was extracted and then proceed with the compilation and installation process.
compile-bench> ls -la /home/peter/ total 5908
drwxr-x--- 1 peter peter 4096 Sep 29 18:17 .
drwxr-xr-x 1 root root 4096 Sep 15 11:21 ..
-rw-r--r-- 1 peter peter 220 Jan 6 2022 .bash_logout
-rw-r--r-- 1 peter peter 3771 Jan 6 2022 .bashrc
-rw-r--r-- 1 peter peter 807 Jan 6 2022 .profile
drwxr-xr-x 11 peter peter 4096 Apr 2 2003 coreutils-5.0
-rw-r--r-- 1 peter peter 6020616 Sep 29 18:17 coreutils.tar.gz
↓ 9 lines
total 5908 drwxr-x--- 1 peter peter 4096 Sep 29 18:17 . drwxr-xr-x 1 root root 4096 Sep 15 11:21 .. -rw-r--r-- 1 peter peter 220 Jan 6 2022 .bash_logout -rw-r--r-- 1 peter peter 3771 Jan 6 2022 .bashrc -rw-r--r-- 1 peter peter 807 Jan 6 2022 .profile drwxr-xr-x 11 peter peter 4096 Apr 2 2003 coreutils-5.0 -rw-r--r-- 1 peter peter 6020616 Sep 29 18:17 coreutils.tar.gz
Show reasoning
Good, the tar file has been extracted to /home/peter/coreutils-5.0. Now I need to:
1. Navigate to the coreutils-5.0 directory
2. Configure it with the prefix set to /home/peter/result
3. Compile it
4. Install it
5. Create symlinks for all utilities in /home/peter/result
Let me start by configuring and compiling.
compile-bench> cd /home/peter/coreutils-5.0 && ./configure --prefix=/home/peter/result checking build system type... x86_64-unknown-linux-gnu
checking host system type... x86_64-unknown-linux-gnu
checking for a BSD-compatible install... /usr/bin/install -c
checking whether build environment is sane... yes
checking for gawk... no
checking for mawk... mawk
checking whether make sets $(MAKE)... yes
checking for perl5.003 or newer... yes
checking for gcc... gcc
checking for C compiler default output... a.out
checking whether the C compiler works... yes
checking whether we are cross compiling... no
checking for suffix of executables...
checking for suffix of object files... o
checking whether we are using the GNU C compiler... yes
checking whether gcc accepts -g... yes
checking for gcc option to accept ANSI C... none needed
checking for style of include used by make... GNU
checking dependency style of gcc... gcc3
checking how to run the C preprocessor... gcc -E
checking for egrep... grep -E
checking whether gcc needs -traditional... no
checking for ranlib... ranlib
checking whether ln -s works... yes
checking for AIX... no
checking for ANSI C header files... yes
checking for sys/types.h... yes
checking for sys/stat.h... yes
checking for stdlib.h... yes
checking for string.h... yes
checking for memory.h... yes
checking for strings.h... yes
checking for inttypes.h... yes
checking for stdint.h... yes
checking for unistd.h... yes
checking minix/config.h usability... no
checking minix/config.h presence... no
checking for minix/config.h... no
checking for uname... yes
checking for chroot... yes
checking for gethostid... yes
checking for strerror in -lcposix... no
checking for special C compiler options needed for large files... no
checking for _FILE_OFFSET_BITS value needed for large files... no
checking for _LARGE_FILES value needed for large files... no
checking for gcc option to accept ANSI C... none needed
checking for function prototypes... yes
checking for ANSI C header files... (cached) yes
checking for string.h... (cached) yes
checking whether byte ordering is bigendian... no
checking for an ANSI C-conforming const... yes
checking for working volatile... yes
checking for inline... inline
checking for working long double with more range or precision than double... no
checking errno.h usability... yes
checking errno.h presence... yes
checking for errno.h... yes
checking fcntl.h usability... yes
checking fcntl.h presence... yes
checking for fcntl.h... yes
checking float.h usability... yes
checking float.h presence... yes
checking for float.h... yes
checking hurd.h usability... no
checking hurd.h presence... no
checking for hurd.h... no
checking limits.h usability... yes
checking limits.h presence... yes
checking for limits.h... yes
checking for memory.h... (cached) yes
[command output truncated]
checking shadow.h presence... yes
checking for shadow.h... yes
checking for struct spwd.sp_pwdp... yes
checking for getspnam... yes
checking for library containing crypt... -lcrypt
checking for msgfmt... no
checking for gmsgfmt... :
checking for xgettext... no
checking for msgmerge... no
checking whether NLS is requested... yes
checking for GNU gettext in libc... yes
configure: creating ./config.status
config.status: creating Makefile
config.status: creating doc/Makefile
config.status: creating lib/Makefile
config.status: creating man/Makefile
config.status: creating m4/Makefile
config.status: creating po/Makefile.in
config.status: creating src/Makefile
config.status: creating tests/Makefile
config.status: creating tests/basename/Makefile
config.status: creating tests/chgrp/Makefile
config.status: creating tests/chmod/Makefile
config.status: creating tests/chown/Makefile
config.status: creating tests/cp/Makefile
config.status: creating tests/cut/Makefile
config.status: creating tests/date/Makefile
config.status: creating tests/dd/Makefile
config.status: creating tests/dircolors/Makefile
config.status: creating tests/du/Makefile
config.status: creating tests/expr/Makefile
config.status: creating tests/factor/Makefile
config.status: creating tests/fmt/Makefile
config.status: creating tests/head/Makefile
config.status: creating tests/install/Makefile
config.status: creating tests/join/Makefile
config.status: creating tests/ln/Makefile
config.status: creating tests/ls-2/Makefile
config.status: creating tests/ls/Makefile
config.status: creating tests/md5sum/Makefile
config.status: creating tests/misc/Makefile
config.status: creating tests/mkdir/Makefile
config.status: creating tests/mv/Makefile
config.status: creating tests/od/Makefile
config.status: creating tests/pr/Makefile
config.status: creating tests/rm/Makefile
config.status: creating tests/rmdir/Makefile
config.status: creating tests/seq/Makefile
config.status: creating tests/sha1sum/Makefile
config.status: creating tests/shred/Makefile
config.status: creating tests/sort/Makefile
config.status: creating tests/stty/Makefile
config.status: creating tests/sum/Makefile
config.status: creating tests/tac/Makefile
config.status: creating tests/tail-2/Makefile
config.status: creating tests/tail/Makefile
config.status: creating tests/test/Makefile
config.status: creating tests/touch/Makefile
config.status: creating tests/tr/Makefile
config.status: creating tests/tsort/Makefile
config.status: creating tests/unexpand/Makefile
config.status: creating tests/uniq/Makefile
config.status: creating tests/wc/Makefile
config.status: creating config.h
config.status: linking ./lib/ftw_.h to lib/ftw.h
config.status: executing depfiles commands
config.status: executing default-1 commands
config.status: creating po/POTFILES
config.status: creating po/Makefile
↓ 141 lines
checking build system type... x86_64-unknown-linux-gnu checking host system type... x86_64-unknown-linux-gnu checking for a BSD-compatible install... /usr/bin/install -c checking whether build environment is sane... yes checking for gawk... no checking for mawk... mawk checking whether make sets $(MAKE)... yes checking for perl5.003 or newer... yes checking for gcc... gcc checking for C compiler default output... a.out checking whether the C compiler works... yes checking whether we are cross compiling... no checking for suffix of executables... checking for suffix of object files... o checking whether we are using the GNU C compiler... yes checking whether gcc accepts -g... yes checking for gcc option to accept ANSI C... none needed checking for style of include used by make... GNU checking dependency style of gcc... gcc3 checking how to run the C preprocessor... gcc -E checking for egrep... grep -E checking whether gcc needs -traditional... no checking for ranlib... ranlib checking whether ln -s works... yes checking for AIX... no checking for ANSI C header files... yes checking for sys/types.h... yes checking for sys/stat.h... yes checking for stdlib.h... yes checking for string.h... yes checking for memory.h... yes checking for strings.h... yes checking for inttypes.h... yes checking for stdint.h... yes checking for unistd.h... yes checking minix/config.h usability... no checking minix/config.h presence... no checking for minix/config.h... no checking for uname... yes checking for chroot... yes checking for gethostid... yes checking for strerror in -lcposix... no checking for special C compiler options needed for large files... no checking for _FILE_OFFSET_BITS value needed for large files... no checking for _LARGE_FILES value needed for large files... no checking for gcc option to accept ANSI C... none needed checking for function prototypes... yes checking for ANSI C header files... (cached) yes checking for string.h... (cached) yes checking whether byte ordering is bigendian... no checking for an ANSI C-conforming const... yes checking for working volatile... yes checking for inline... inline checking for working long double with more range or precision than double... no checking errno.h usability... yes checking errno.h presence... yes checking for errno.h... yes checking fcntl.h usability... yes checking fcntl.h presence... yes checking for fcntl.h... yes checking float.h usability... yes checking float.h presence... yes checking for float.h... yes checking hurd.h usability... no checking hurd.h presence... no checking for hurd.h... no checking limits.h usability... yes checking limits.h presence... yes checking for limits.h... yes checking for memory.h... (cached) yes [command output truncated] checking shadow.h presence... yes checking for shadow.h... yes checking for struct spwd.sp_pwdp... yes checking for getspnam... yes checking for library containing crypt... -lcrypt checking for msgfmt... no checking for gmsgfmt... : checking for xgettext... no checking for msgmerge... no checking whether NLS is requested... yes checking for GNU gettext in libc... yes configure: creating ./config.status config.status: creating Makefile config.status: creating doc/Makefile config.status: creating lib/Makefile config.status: creating man/Makefile config.status: creating m4/Makefile config.status: creating po/Makefile.in config.status: creating src/Makefile config.status: creating tests/Makefile config.status: creating tests/basename/Makefile config.status: creating tests/chgrp/Makefile config.status: creating tests/chmod/Makefile config.status: creating tests/chown/Makefile config.status: creating tests/cp/Makefile config.status: creating tests/cut/Makefile config.status: creating tests/date/Makefile config.status: creating tests/dd/Makefile config.status: creating tests/dircolors/Makefile config.status: creating tests/du/Makefile config.status: creating tests/expr/Makefile config.status: creating tests/factor/Makefile config.status: creating tests/fmt/Makefile config.status: creating tests/head/Makefile config.status: creating tests/install/Makefile config.status: creating tests/join/Makefile config.status: creating tests/ln/Makefile config.status: creating tests/ls-2/Makefile config.status: creating tests/ls/Makefile config.status: creating tests/md5sum/Makefile config.status: creating tests/misc/Makefile config.status: creating tests/mkdir/Makefile config.status: creating tests/mv/Makefile config.status: creating tests/od/Makefile config.status: creating tests/pr/Makefile config.status: creating tests/rm/Makefile config.status: creating tests/rmdir/Makefile config.status: creating tests/seq/Makefile config.status: creating tests/sha1sum/Makefile config.status: creating tests/shred/Makefile config.status: creating tests/sort/Makefile config.status: creating tests/stty/Makefile config.status: creating tests/sum/Makefile config.status: creating tests/tac/Makefile config.status: creating tests/tail-2/Makefile config.status: creating tests/tail/Makefile config.status: creating tests/test/Makefile config.status: creating tests/touch/Makefile config.status: creating tests/tr/Makefile config.status: creating tests/tsort/Makefile config.status: creating tests/unexpand/Makefile config.status: creating tests/uniq/Makefile config.status: creating tests/wc/Makefile config.status: creating config.h config.status: linking ./lib/ftw_.h to lib/ftw.h config.status: executing depfiles commands config.status: executing default-1 commands config.status: creating po/POTFILES config.status: creating po/Makefile
Show reasoning
Good! The configure step completed successfully. Now I need to:
1. Compile the coreutils with make
2. Install it to /home/peter/result with make install
3. Create symlinks for all utilities
Let me proceed with the compilation.
compile-bench> cd /home/peter/coreutils-5.0 && make make all-recursive
make[1]: Entering directory '/home/peter/coreutils-5.0'
Making all in lib
make[2]: Entering directory '/home/peter/coreutils-5.0/lib'
make all-am
make[3]: Entering directory '/home/peter/coreutils-5.0/lib'
if gcc -DLIBDIR=\"/home/peter/result/lib\" -DHAVE_CONFIG_H -I. -I. -I.. -I.. -I. -g -O2 -MT acl.o -MD -MP -MF ".deps/acl.Tpo" \
-c -o acl.o `test -f 'acl.c' || echo './'`acl.c; \
then mv ".deps/acl.Tpo" ".deps/acl.Po"; \
else rm -f ".deps/acl.Tpo"; exit 1; \
fi
if gcc -DLIBDIR=\"/home/peter/result/lib\" -DHAVE_CONFIG_H -I. -I. -I.. -I.. -I. -g -O2 -MT getdate.o -MD -MP -MF ".deps/getdate.Tpo" \
-c -o getdate.o `test -f 'getdate.c' || echo './'`getdate.c; \
then mv ".deps/getdate.Tpo" ".deps/getdate.Po"; \
else rm -f ".deps/getdate.Tpo"; exit 1; \
fi
if gcc -DLIBDIR=\"/home/peter/result/lib\" -DHAVE_CONFIG_H -I. -I. -I.. -I.. -I. -g -O2 -MT posixtm.o -MD -MP -MF ".deps/posixtm.Tpo" \
-c -o posixtm.o `test -f 'posixtm.c' || echo './'`posixtm.c; \
then mv ".deps/posixtm.Tpo" ".deps/posixtm.Po"; \
else rm -f ".deps/posixtm.Tpo"; exit 1; \
fi
if gcc -DLIBDIR=\"/home/peter/result/lib\" -DHAVE_CONFIG_H -I. -I. -I.. -I.. -I. -g -O2 -MT posixver.o -MD -MP -MF ".deps/posixver.Tpo" \
-c -o posixver.o `test -f 'posixver.c' || echo './'`posixver.c; \
then mv ".deps/posixver.Tpo" ".deps/posixver.Po"; \
else rm -f ".deps/posixver.Tpo"; exit 1; \
fi
if gcc -DLIBDIR=\"/home/peter/result/lib\" -DHAVE_CONFIG_H -I. -I. -I.. -I.. -I. -g -O2 -MT strftime.o -MD -MP -MF ".deps/strftime.Tpo" \
-c -o strftime.o `test -f 'strftime.c' || echo './'`strftime.c; \
then mv ".deps/strftime.Tpo" ".deps/strftime.Po"; \
else rm -f ".deps/strftime.Tpo"; exit 1; \
fi
if gcc -DLIBDIR=\"/home/peter/result/lib\" -DHAVE_CONFIG_H -I. -I. -I.. -I.. -I. -g -O2 -MT getopt.o -MD -MP -MF ".deps/getopt.Tpo" \
-c -o getopt.o `test -f 'getopt.c' || echo './'`getopt.c; \
then mv ".deps/getopt.Tpo" ".deps/getopt.Po"; \
else rm -f ".deps/getopt.Tpo"; exit 1; \
fi
if gcc -DLIBDIR=\"/home/peter/result/lib\" -DHAVE_CONFIG_H -I. -I. -I.. -I.. -I. -g -O2 -MT getopt1.o -MD -MP -MF ".deps/getopt1.Tpo" \
-c -o getopt1.o `test -f 'getopt1.c' || echo './'`getopt1.c; \
then mv ".deps/getopt1.Tpo" ".deps/getopt1.Po"; \
else rm -f ".deps/getopt1.Tpo"; exit 1; \
fi
if gcc -DLIBDIR=\"/home/peter/result/lib\" -DHAVE_CONFIG_H -I. -I. -I.. -I.. -I. -g -O2 -MT hash.o -MD -MP -MF ".deps/hash.Tpo" \
-c -o hash.o `test -f 'hash.c' || echo './'`hash.c; \
then mv ".deps/hash.Tpo" ".deps/hash.Po"; \
else rm -f ".deps/hash.Tpo"; exit 1; \
fi
if gcc -DLIBDIR=\"/home/peter/result/lib\" -DHAVE_CONFIG_H -I. -I. -I.. -I.. -I. -g -O2 -MT hash-pjw.o -MD -MP -MF ".deps/hash-pjw.Tpo" \
-c -o hash-pjw.o `test -f 'hash-pjw.c' || echo './'`hash-pjw.c; \
then mv ".deps/hash-pjw.Tpo" ".deps/hash-pjw.Po"; \
else rm -f ".deps/hash-pjw.Tpo"; exit 1; \
fi
if gcc -DLIBDIR=\"/home/peter/result/lib\" -DHAVE_CONFIG_H -I. -I. -I..
[command output truncated]
^~~~~~~~~~~~~~~~~~~~~~~~~~~~~~~~~~~~~~~~~~~~~~~
pathchk.c:381:20: note: in expansion of macro '_'
381 | error (0, 0, _("path `%s' has length %d; exceeds limit of %ld"),
| ^
pathchk.c:381:45: note: format string is defined here
381 | error (0, 0, _("path `%s' has length %d; exceeds limit of %ld"),
| ~^
| |
| int
| %ld
gcc -g -O2 -o pathchk pathchk.o ../lib/libfetish.a ../lib/libfetish.a
if gcc -DLOCALEDIR=\"/home/peter/result/share/locale\" -DSHAREDIR=\"/home/peter/result/share\" -DHAVE_CONFIG_H -I. -I. -I.. -I.. -I. -I../lib -I../lib -g -O2 -MT printenv.o -MD -MP -MF ".deps/printenv.Tpo" \
-c -o printenv.o `test -f 'printenv.c' || echo './'`printenv.c; \
then mv ".deps/printenv.Tpo" ".deps/printenv.Po"; \
else rm -f ".deps/printenv.Tpo"; exit 1; \
fi
gcc -g -O2 -o printenv printenv.o ../lib/libfetish.a ../lib/libfetish.a
if gcc -DLOCALEDIR=\"/home/peter/result/share/locale\" -DSHAREDIR=\"/home/peter/result/share\" -DHAVE_CONFIG_H -I. -I. -I.. -I.. -I. -I../lib -I../lib -g -O2 -MT printf.o -MD -MP -MF ".deps/printf.Tpo" \
-c -o printf.o `test -f 'printf.c' || echo './'`printf.c; \
then mv ".deps/printf.Tpo" ".deps/printf.Po"; \
else rm -f ".deps/printf.Tpo"; exit 1; \
fi
gcc -g -O2 -o printf printf.o ../lib/libfetish.a ../lib/libfetish.a
if gcc -DLOCALEDIR=\"/home/peter/result/share/locale\" -DSHAREDIR=\"/home/peter/result/share\" -DHAVE_CONFIG_H -I. -I. -I.. -I.. -I. -I../lib -I../lib -g -O2 -MT pwd.o -MD -MP -MF ".deps/pwd.Tpo" \
-c -o pwd.o `test -f 'pwd.c' || echo './'`pwd.c; \
then mv ".deps/pwd.Tpo" ".deps/pwd.Po"; \
else rm -f ".deps/pwd.Tpo"; exit 1; \
fi
gcc -g -O2 -o pwd pwd.o ../lib/libfetish.a ../lib/libfetish.a
if gcc -DLOCALEDIR=\"/home/peter/result/share/locale\" -DSHAREDIR=\"/home/peter/result/share\" -DHAVE_CONFIG_H -I. -I. -I.. -I.. -I. -I../lib -I../lib -g -O2 -MT seq.o -MD -MP -MF ".deps/seq.Tpo" \
-c -o seq.o `test -f 'seq.c' || echo './'`seq.c; \
then mv ".deps/seq.Tpo" ".deps/seq.Po"; \
else rm -f ".deps/seq.Tpo"; exit 1; \
fi
gcc -g -O2 -o seq seq.o ../lib/libfetish.a ../lib/libfetish.a
/usr/bin/ld: seq.o: in function `get_width_format':
/home/peter/coreutils-5.0/src/seq.c:253: undefined reference to `floor'
/usr/bin/ld: /home/peter/coreutils-5.0/src/seq.c:259: undefined reference to `floor'
collect2: error: ld returned 1 exit status
make[3]: *** [Makefile:1033: seq] Error 1
make[3]: Leaving directory '/home/peter/coreutils-5.0/src'
make[2]: *** [Makefile:815: all] Error 2
make[2]: Leaving directory '/home/peter/coreutils-5.0/src'
make[1]: *** [Makefile:244: all-recursive] Error 1
make[1]: Leaving directory '/home/peter/coreutils-5.0'
make: *** [Makefile:199: all] Error 2
↓ 100 lines
make all-recursive
make[1]: Entering directory '/home/peter/coreutils-5.0'
Making all in lib
make[2]: Entering directory '/home/peter/coreutils-5.0/lib'
make all-am
make[3]: Entering directory '/home/peter/coreutils-5.0/lib'
if gcc -DLIBDIR=\"/home/peter/result/lib\" -DHAVE_CONFIG_H -I. -I. -I.. -I.. -I. -g -O2 -MT acl.o -MD -MP -MF ".deps/acl.Tpo" \
-c -o acl.o `test -f 'acl.c' || echo './'`acl.c; \
then mv ".deps/acl.Tpo" ".deps/acl.Po"; \
else rm -f ".deps/acl.Tpo"; exit 1; \
fi
if gcc -DLIBDIR=\"/home/peter/result/lib\" -DHAVE_CONFIG_H -I. -I. -I.. -I.. -I. -g -O2 -MT getdate.o -MD -MP -MF ".deps/getdate.Tpo" \
-c -o getdate.o `test -f 'getdate.c' || echo './'`getdate.c; \
then mv ".deps/getdate.Tpo" ".deps/getdate.Po"; \
else rm -f ".deps/getdate.Tpo"; exit 1; \
fi
if gcc -DLIBDIR=\"/home/peter/result/lib\" -DHAVE_CONFIG_H -I. -I. -I.. -I.. -I. -g -O2 -MT posixtm.o -MD -MP -MF ".deps/posixtm.Tpo" \
-c -o posixtm.o `test -f 'posixtm.c' || echo './'`posixtm.c; \
then mv ".deps/posixtm.Tpo" ".deps/posixtm.Po"; \
else rm -f ".deps/posixtm.Tpo"; exit 1; \
fi
if gcc -DLIBDIR=\"/home/peter/result/lib\" -DHAVE_CONFIG_H -I. -I. -I.. -I.. -I. -g -O2 -MT posixver.o -MD -MP -MF ".deps/posixver.Tpo" \
-c -o posixver.o `test -f 'posixver.c' || echo './'`posixver.c; \
then mv ".deps/posixver.Tpo" ".deps/posixver.Po"; \
else rm -f ".deps/posixver.Tpo"; exit 1; \
fi
if gcc -DLIBDIR=\"/home/peter/result/lib\" -DHAVE_CONFIG_H -I. -I. -I.. -I.. -I. -g -O2 -MT strftime.o -MD -MP -MF ".deps/strftime.Tpo" \
-c -o strftime.o `test -f 'strftime.c' || echo './'`strftime.c; \
then mv ".deps/strftime.Tpo" ".deps/strftime.Po"; \
else rm -f ".deps/strftime.Tpo"; exit 1; \
fi
if gcc -DLIBDIR=\"/home/peter/result/lib\" -DHAVE_CONFIG_H -I. -I. -I.. -I.. -I. -g -O2 -MT getopt.o -MD -MP -MF ".deps/getopt.Tpo" \
-c -o getopt.o `test -f 'getopt.c' || echo './'`getopt.c; \
then mv ".deps/getopt.Tpo" ".deps/getopt.Po"; \
else rm -f ".deps/getopt.Tpo"; exit 1; \
fi
if gcc -DLIBDIR=\"/home/peter/result/lib\" -DHAVE_CONFIG_H -I. -I. -I.. -I.. -I. -g -O2 -MT getopt1.o -MD -MP -MF ".deps/getopt1.Tpo" \
-c -o getopt1.o `test -f 'getopt1.c' || echo './'`getopt1.c; \
then mv ".deps/getopt1.Tpo" ".deps/getopt1.Po"; \
else rm -f ".deps/getopt1.Tpo"; exit 1; \
fi
if gcc -DLIBDIR=\"/home/peter/result/lib\" -DHAVE_CONFIG_H -I. -I. -I.. -I.. -I. -g -O2 -MT hash.o -MD -MP -MF ".deps/hash.Tpo" \
-c -o hash.o `test -f 'hash.c' || echo './'`hash.c; \
then mv ".deps/hash.Tpo" ".deps/hash.Po"; \
else rm -f ".deps/hash.Tpo"; exit 1; \
fi
if gcc -DLIBDIR=\"/home/peter/result/lib\" -DHAVE_CONFIG_H -I. -I. -I.. -I.. -I. -g -O2 -MT hash-pjw.o -MD -MP -MF ".deps/hash-pjw.Tpo" \
-c -o hash-pjw.o `test -f 'hash-pjw.c' || echo './'`hash-pjw.c; \
then mv ".deps/hash-pjw.Tpo" ".deps/hash-pjw.Po"; \
else rm -f ".deps/hash-pjw.Tpo"; exit 1; \
fi
if gcc -DLIBDIR=\"/home/peter/result/lib\" -DHAVE_CONFIG_H -I. -I. -I..
[command output truncated]
^~~~~~~~~~~~~~~~~~~~~~~~~~~~~~~~~~~~~~~~~~~~~~~
pathchk.c:381:20: note: in expansion of macro '_'
381 | error (0, 0, _("path `%s' has length %d; exceeds limit of %ld"),
| ^
pathchk.c:381:45: note: format string is defined here
381 | error (0, 0, _("path `%s' has length %d; exceeds limit of %ld"),
| ~^
| |
| int
| %ld
gcc -g -O2 -o pathchk pathchk.o ../lib/libfetish.a ../lib/libfetish.a
if gcc -DLOCALEDIR=\"/home/peter/result/share/locale\" -DSHAREDIR=\"/home/peter/result/share\" -DHAVE_CONFIG_H -I. -I. -I.. -I.. -I. -I../lib -I../lib -g -O2 -MT printenv.o -MD -MP -MF ".deps/printenv.Tpo" \
-c -o printenv.o `test -f 'printenv.c' || echo './'`printenv.c; \
then mv ".deps/printenv.Tpo" ".deps/printenv.Po"; \
else rm -f ".deps/printenv.Tpo"; exit 1; \
fi
gcc -g -O2 -o printenv printenv.o ../lib/libfetish.a ../lib/libfetish.a
if gcc -DLOCALEDIR=\"/home/peter/result/share/locale\" -DSHAREDIR=\"/home/peter/result/share\" -DHAVE_CONFIG_H -I. -I. -I.. -I.. -I. -I../lib -I../lib -g -O2 -MT printf.o -MD -MP -MF ".deps/printf.Tpo" \
-c -o printf.o `test -f 'printf.c' || echo './'`printf.c; \
then mv ".deps/printf.Tpo" ".deps/printf.Po"; \
else rm -f ".deps/printf.Tpo"; exit 1; \
fi
gcc -g -O2 -o printf printf.o ../lib/libfetish.a ../lib/libfetish.a
if gcc -DLOCALEDIR=\"/home/peter/result/share/locale\" -DSHAREDIR=\"/home/peter/result/share\" -DHAVE_CONFIG_H -I. -I. -I.. -I.. -I. -I../lib -I../lib -g -O2 -MT pwd.o -MD -MP -MF ".deps/pwd.Tpo" \
-c -o pwd.o `test -f 'pwd.c' || echo './'`pwd.c; \
then mv ".deps/pwd.Tpo" ".deps/pwd.Po"; \
else rm -f ".deps/pwd.Tpo"; exit 1; \
fi
gcc -g -O2 -o pwd pwd.o ../lib/libfetish.a ../lib/libfetish.a
if gcc -DLOCALEDIR=\"/home/peter/result/share/locale\" -DSHAREDIR=\"/home/peter/result/share\" -DHAVE_CONFIG_H -I. -I. -I.. -I.. -I. -I../lib -I../lib -g -O2 -MT seq.o -MD -MP -MF ".deps/seq.Tpo" \
-c -o seq.o `test -f 'seq.c' || echo './'`seq.c; \
then mv ".deps/seq.Tpo" ".deps/seq.Po"; \
else rm -f ".deps/seq.Tpo"; exit 1; \
fi
gcc -g -O2 -o seq seq.o ../lib/libfetish.a ../lib/libfetish.a
/usr/bin/ld: seq.o: in function `get_width_format':
/home/peter/coreutils-5.0/src/seq.c:253: undefined reference to `floor'
/usr/bin/ld: /home/peter/coreutils-5.0/src/seq.c:259: undefined reference to `floor'
collect2: error: ld returned 1 exit status
make[3]: *** [Makefile:1033: seq] Error 1
make[3]: Leaving directory '/home/peter/coreutils-5.0/src'
make[2]: *** [Makefile:815: all] Error 2
make[2]: Leaving directory '/home/peter/coreutils-5.0/src'
make[1]: *** [Makefile:244: all-recursive] Error 1
make[1]: Leaving directory '/home/peter/coreutils-5.0'
make: *** [Makefile:199: all] Error 2
Show reasoning
There's a linking error with the seq utility - it's missing the math library (-lm) during linking. The floor function is part of the math library. I need to fix this by editing the Makefile or using LDFLAGS.
Let me check the Makefile and see if I can add the math library to the linking process.
I see there's a linking error with the seq utility - it needs the math library. Let me fix this by adding the math library to the LDFLAGS.
compile-bench> cd /home/peter/coreutils-5.0 && make LDFLAGS="-lm" make all-recursive
make[1]: Entering directory '/home/peter/coreutils-5.0'
Making all in lib
make[2]: Entering directory '/home/peter/coreutils-5.0/lib'
make all-am
make[3]: Entering directory '/home/peter/coreutils-5.0/lib'
make[3]: Nothing to be done for 'all-am'.
make[3]: Leaving directory '/home/peter/coreutils-5.0/lib'
make[2]: Leaving directory '/home/peter/coreutils-5.0/lib'
Making all in src
make[2]: Entering directory '/home/peter/coreutils-5.0/src'
make all-am
make[3]: Entering directory '/home/peter/coreutils-5.0/src'
gcc -g -O2 -lm -o seq seq.o ../lib/libfetish.a ../lib/libfetish.a
/usr/bin/ld: seq.o: in function `get_width_format':
/home/peter/coreutils-5.0/src/seq.c:253: undefined reference to `floor'
/usr/bin/ld: /home/peter/coreutils-5.0/src/seq.c:259: undefined reference to `floor'
collect2: error: ld returned 1 exit status
make[3]: *** [Makefile:1033: seq] Error 1
make[3]: Leaving directory '/home/peter/coreutils-5.0/src'
make[2]: *** [Makefile:815: all] Error 2
make[2]: Leaving directory '/home/peter/coreutils-5.0/src'
make[1]: *** [Makefile:244: all-recursive] Error 1
make[1]: Leaving directory '/home/peter/coreutils-5.0'
make: *** [Makefile:199: all] Error 2
↓ 26 lines
make all-recursive make[1]: Entering directory '/home/peter/coreutils-5.0' Making all in lib make[2]: Entering directory '/home/peter/coreutils-5.0/lib' make all-am make[3]: Entering directory '/home/peter/coreutils-5.0/lib' make[3]: Nothing to be done for 'all-am'. make[3]: Leaving directory '/home/peter/coreutils-5.0/lib' make[2]: Leaving directory '/home/peter/coreutils-5.0/lib' Making all in src make[2]: Entering directory '/home/peter/coreutils-5.0/src' make all-am make[3]: Entering directory '/home/peter/coreutils-5.0/src' gcc -g -O2 -lm -o seq seq.o ../lib/libfetish.a ../lib/libfetish.a /usr/bin/ld: seq.o: in function `get_width_format': /home/peter/coreutils-5.0/src/seq.c:253: undefined reference to `floor' /usr/bin/ld: /home/peter/coreutils-5.0/src/seq.c:259: undefined reference to `floor' collect2: error: ld returned 1 exit status make[3]: *** [Makefile:1033: seq] Error 1 make[3]: Leaving directory '/home/peter/coreutils-5.0/src' make[2]: *** [Makefile:815: all] Error 2 make[2]: Leaving directory '/home/peter/coreutils-5.0/src' make[1]: *** [Makefile:244: all-recursive] Error 1 make[1]: Leaving directory '/home/peter/coreutils-5.0' make: *** [Makefile:199: all] Error 2
Show reasoning
The issue is that the math library needs to come after the object files in the link command. Let me try a different approach - I need to modify the Makefile or configure with proper LIBS setting.
The -lm flag needs to come after the object files. Let me try using LIBS instead:
compile-bench> cd /home/peter/coreutils-5.0 && make LIBS="-lm" make all-recursive
make[1]: Entering directory '/home/peter/coreutils-5.0'
Making all in lib
make[2]: Entering directory '/home/peter/coreutils-5.0/lib'
make all-am
make[3]: Entering directory '/home/peter/coreutils-5.0/lib'
make[3]: Nothing to be done for 'all-am'.
make[3]: Leaving directory '/home/peter/coreutils-5.0/lib'
make[2]: Leaving directory '/home/peter/coreutils-5.0/lib'
Making all in src
make[2]: Entering directory '/home/peter/coreutils-5.0/src'
make all-am
make[3]: Entering directory '/home/peter/coreutils-5.0/src'
gcc -g -O2 -o seq seq.o ../lib/libfetish.a ../lib/libfetish.a -lm
if gcc -DLOCALEDIR=\"/home/peter/result/share/locale\" -DSHAREDIR=\"/home/peter/result/share\" -DHAVE_CONFIG_H -I. -I. -I.. -I.. -I. -I../lib -I../lib -g -O2 -MT sleep.o -MD -MP -MF ".deps/sleep.Tpo" \
-c -o sleep.o `test -f 'sleep.c' || echo './'`sleep.c; \
then mv ".deps/sleep.Tpo" ".deps/sleep.Po"; \
else rm -f ".deps/sleep.Tpo"; exit 1; \
fi
gcc -g -O2 -o sleep sleep.o ../lib/libfetish.a ../lib/libfetish.a -lm -lm
if gcc -DLOCALEDIR=\"/home/peter/result/share/locale\" -DSHAREDIR=\"/home/peter/result/share\" -DHAVE_CONFIG_H -I. -I. -I.. -I.. -I. -I../lib -I../lib -g -O2 -MT tee.o -MD -MP -MF ".deps/tee.Tpo" \
-c -o tee.o `test -f 'tee.c' || echo './'`tee.c; \
then mv ".deps/tee.Tpo" ".deps/tee.Po"; \
else rm -f ".deps/tee.Tpo"; exit 1; \
fi
tee.c:35:12: error: conflicting types for 'tee'; have 'int(int, const char **)'
35 | static int tee (int nfiles, const char **files);
| ^~~
In file included from /usr/include/x86_64-linux-gnu/bits/fcntl.h:61,
from /usr/include/fcntl.h:35,
from system.h:153,
from tee.c:26:
/usr/include/x86_64-linux-gnu/bits/fcntl-linux.h:429:18: note: previous declaration of 'tee' with type '__ssize_t(int, int, size_t, unsigned int)' {aka 'long int(int, int, long unsigned int, unsigned int)'}
429 | extern __ssize_t tee (int __fdin, int __fdout, size_t __len,
| ^~~
make[3]: *** [Makefile:1263: tee.o] Error 1
make[3]: Leaving directory '/home/peter/coreutils-5.0/src'
make[2]: *** [Makefile:815: all] Error 2
make[2]: Leaving directory '/home/peter/coreutils-5.0/src'
make[1]: *** [Makefile:244: all-recursive] Error 1
make[1]: Leaving directory '/home/peter/coreutils-5.0'
make: *** [Makefile:199: all] Error 2
↓ 43 lines
make all-recursive
make[1]: Entering directory '/home/peter/coreutils-5.0'
Making all in lib
make[2]: Entering directory '/home/peter/coreutils-5.0/lib'
make all-am
make[3]: Entering directory '/home/peter/coreutils-5.0/lib'
make[3]: Nothing to be done for 'all-am'.
make[3]: Leaving directory '/home/peter/coreutils-5.0/lib'
make[2]: Leaving directory '/home/peter/coreutils-5.0/lib'
Making all in src
make[2]: Entering directory '/home/peter/coreutils-5.0/src'
make all-am
make[3]: Entering directory '/home/peter/coreutils-5.0/src'
gcc -g -O2 -o seq seq.o ../lib/libfetish.a ../lib/libfetish.a -lm
if gcc -DLOCALEDIR=\"/home/peter/result/share/locale\" -DSHAREDIR=\"/home/peter/result/share\" -DHAVE_CONFIG_H -I. -I. -I.. -I.. -I. -I../lib -I../lib -g -O2 -MT sleep.o -MD -MP -MF ".deps/sleep.Tpo" \
-c -o sleep.o `test -f 'sleep.c' || echo './'`sleep.c; \
then mv ".deps/sleep.Tpo" ".deps/sleep.Po"; \
else rm -f ".deps/sleep.Tpo"; exit 1; \
fi
gcc -g -O2 -o sleep sleep.o ../lib/libfetish.a ../lib/libfetish.a -lm -lm
if gcc -DLOCALEDIR=\"/home/peter/result/share/locale\" -DSHAREDIR=\"/home/peter/result/share\" -DHAVE_CONFIG_H -I. -I. -I.. -I.. -I. -I../lib -I../lib -g -O2 -MT tee.o -MD -MP -MF ".deps/tee.Tpo" \
-c -o tee.o `test -f 'tee.c' || echo './'`tee.c; \
then mv ".deps/tee.Tpo" ".deps/tee.Po"; \
else rm -f ".deps/tee.Tpo"; exit 1; \
fi
tee.c:35:12: error: conflicting types for 'tee'; have 'int(int, const char **)'
35 | static int tee (int nfiles, const char **files);
| ^~~
In file included from /usr/include/x86_64-linux-gnu/bits/fcntl.h:61,
from /usr/include/fcntl.h:35,
from system.h:153,
from tee.c:26:
/usr/include/x86_64-linux-gnu/bits/fcntl-linux.h:429:18: note: previous declaration of 'tee' with type '__ssize_t(int, int, size_t, unsigned int)' {aka 'long int(int, int, long unsigned int, unsigned int)'}
429 | extern __ssize_t tee (int __fdin, int __fdout, size_t __len,
| ^~~
make[3]: *** [Makefile:1263: tee.o] Error 1
make[3]: Leaving directory '/home/peter/coreutils-5.0/src'
make[2]: *** [Makefile:815: all] Error 2
make[2]: Leaving directory '/home/peter/coreutils-5.0/src'
make[1]: *** [Makefile:244: all-recursive] Error 1
make[1]: Leaving directory '/home/peter/coreutils-5.0'
make: *** [Makefile:199: all] Error 2
Show reasoning
Good, the seq utility compiled successfully now! But we have a new issue with tee.c - there's a conflict with a function name. The tee function in coreutils conflicts with a newer system function tee that was added to glibc later. I need to rename the function in the source code to avoid this conflict.
Let me fix the tee.c file by renaming the static function.
Good progress! The seq utility compiled successfully. Now there's a naming conflict with tee - the function name conflicts with a system function. Let me fix this:
[empty output]
Show reasoning
The sed command has been executed to rename the conflicting function. Now let me continue building with LIBS="-lm" to ensure the math library is linked properly.
compile-bench> cd /home/peter/coreutils-5.0 && make LIBS="-lm" make all-recursive
make[1]: Entering directory '/home/peter/coreutils-5.0'
Making all in lib
make[2]: Entering directory '/home/peter/coreutils-5.0/lib'
make all-am
make[3]: Entering directory '/home/peter/coreutils-5.0/lib'
make[3]: Nothing to be done for 'all-am'.
make[3]: Leaving directory '/home/peter/coreutils-5.0/lib'
make[2]: Leaving directory '/home/peter/coreutils-5.0/lib'
Making all in src
make[2]: Entering directory '/home/peter/coreutils-5.0/src'
make all-am
make[3]: Entering directory '/home/peter/coreutils-5.0/src'
if gcc -DLOCALEDIR=\"/home/peter/result/share/locale\" -DSHAREDIR=\"/home/peter/result/share\" -DHAVE_CONFIG_H -I. -I. -I.. -I.. -I. -I../lib -I../lib -g -O2 -MT tee.o -MD -MP -MF ".deps/tee.Tpo" \
-c -o tee.o `test -f 'tee.c' || echo './'`tee.c; \
then mv ".deps/tee.Tpo" ".deps/tee.Po"; \
else rm -f ".deps/tee.Tpo"; exit 1; \
fi
tee.c: In function 'main':
tee.c:149:30: warning: passing argument 2 of 'tee' makes integer from pointer without a cast [ttps://gcc.gnu.org/onlinedocs/gcc/Warning-Options.html#index-Wint-conversion-Wint-conversion]8;;]
149 | errs = tee (argc - optind, (const char **) &argv[optind]);
| ^~~~~~~~~~~~~~~~~~~~~~~~~~~~~
| |
| const char **
In file included from /usr/include/x86_64-linux-gnu/bits/fcntl.h:61,
from /usr/include/fcntl.h:35,
from system.h:153,
from tee.c:26:
/usr/include/x86_64-linux-gnu/bits/fcntl-linux.h:429:39: note: expected 'int' but argument is of type 'const char **'
429 | extern __ssize_t tee (int __fdin, int __fdout, size_t __len,
| ~~~~^~~~~~~
tee.c:149:10: error: too few arguments to function 'tee'
149 | errs = tee (argc - optind, (const char **) &argv[optind]);
| ^~~
In file included from /usr/include/x86_64-linux-gnu/bits/fcntl.h:61,
from /usr/include/fcntl.h:35,
from system.h:153,
from tee.c:26:
/usr/include/x86_64-linux-gnu/bits/fcntl-linux.h:429:18: note: declared here
429 | extern __ssize_t tee (int __fdin, int __fdout, size_t __len,
| ^~~
make[3]: *** [Makefile:1263: tee.o] Error 1
make[3]: Leaving directory '/home/peter/coreutils-5.0/src'
make[2]: *** [Makefile:815: all] Error 2
make[2]: Leaving directory '/home/peter/coreutils-5.0/src'
make[1]: *** [Makefile:244: all-recursive] Error 1
make[1]: Leaving directory '/home/peter/coreutils-5.0'
make: *** [Makefile:199: all] Error 2
↓ 49 lines
make all-recursive
make[1]: Entering directory '/home/peter/coreutils-5.0'
Making all in lib
make[2]: Entering directory '/home/peter/coreutils-5.0/lib'
make all-am
make[3]: Entering directory '/home/peter/coreutils-5.0/lib'
make[3]: Nothing to be done for 'all-am'.
make[3]: Leaving directory '/home/peter/coreutils-5.0/lib'
make[2]: Leaving directory '/home/peter/coreutils-5.0/lib'
Making all in src
make[2]: Entering directory '/home/peter/coreutils-5.0/src'
make all-am
make[3]: Entering directory '/home/peter/coreutils-5.0/src'
if gcc -DLOCALEDIR=\"/home/peter/result/share/locale\" -DSHAREDIR=\"/home/peter/result/share\" -DHAVE_CONFIG_H -I. -I. -I.. -I.. -I. -I../lib -I../lib -g -O2 -MT tee.o -MD -MP -MF ".deps/tee.Tpo" \
-c -o tee.o `test -f 'tee.c' || echo './'`tee.c; \
then mv ".deps/tee.Tpo" ".deps/tee.Po"; \
else rm -f ".deps/tee.Tpo"; exit 1; \
fi
tee.c: In function 'main':
tee.c:149:30: warning: passing argument 2 of 'tee' makes integer from pointer without a cast [ttps://gcc.gnu.org/onlinedocs/gcc/Warning-Options.html#index-Wint-conversion-Wint-conversion]8;;]
149 | errs = tee (argc - optind, (const char **) &argv[optind]);
| ^~~~~~~~~~~~~~~~~~~~~~~~~~~~~
| |
| const char **
In file included from /usr/include/x86_64-linux-gnu/bits/fcntl.h:61,
from /usr/include/fcntl.h:35,
from system.h:153,
from tee.c:26:
/usr/include/x86_64-linux-gnu/bits/fcntl-linux.h:429:39: note: expected 'int' but argument is of type 'const char **'
429 | extern __ssize_t tee (int __fdin, int __fdout, size_t __len,
| ~~~~^~~~~~~
tee.c:149:10: error: too few arguments to function 'tee'
149 | errs = tee (argc - optind, (const char **) &argv[optind]);
| ^~~
In file included from /usr/include/x86_64-linux-gnu/bits/fcntl.h:61,
from /usr/include/fcntl.h:35,
from system.h:153,
from tee.c:26:
/usr/include/x86_64-linux-gnu/bits/fcntl-linux.h:429:18: note: declared here
429 | extern __ssize_t tee (int __fdin, int __fdout, size_t __len,
| ^~~
make[3]: *** [Makefile:1263: tee.o] Error 1
make[3]: Leaving directory '/home/peter/coreutils-5.0/src'
make[2]: *** [Makefile:815: all] Error 2
make[2]: Leaving directory '/home/peter/coreutils-5.0/src'
make[1]: *** [Makefile:244: all-recursive] Error 1
make[1]: Leaving directory '/home/peter/coreutils-5.0'
make: *** [Makefile:199: all] Error 2
Show reasoning
The sed command didn't catch all instances. Let me check the tee.c file and replace all instances of the tee function name properly.
I need to replace all instances of the tee function call. Let me check the file and fix it properly:
149: errs = tee (argc - optind, (const char **) &argv[optind]);
Show reasoning
I need to replace the call to tee() in the main function as well. Let me do that.
[empty output]
Show reasoning
Now let me continue the build:
compile-bench> cd /home/peter/coreutils-5.0 && make LIBS="-lm" make all-recursive
make[1]: Entering directory '/home/peter/coreutils-5.0'
Making all in lib
make[2]: Entering directory '/home/peter/coreutils-5.0/lib'
make all-am
make[3]: Entering directory '/home/peter/coreutils-5.0/lib'
make[3]: Nothing to be done for 'all-am'.
make[3]: Leaving directory '/home/peter/coreutils-5.0/lib'
make[2]: Leaving directory '/home/peter/coreutils-5.0/lib'
Making all in src
make[2]: Entering directory '/home/peter/coreutils-5.0/src'
make all-am
make[3]: Entering directory '/home/peter/coreutils-5.0/src'
if gcc -DLOCALEDIR=\"/home/peter/result/share/locale\" -DSHAREDIR=\"/home/peter/result/share\" -DHAVE_CONFIG_H -I. -I. -I.. -I.. -I. -I../lib -I../lib -g -O2 -MT tee.o -MD -MP -MF ".deps/tee.Tpo" \
-c -o tee.o `test -f 'tee.c' || echo './'`tee.c; \
then mv ".deps/tee.Tpo" ".deps/tee.Po"; \
else rm -f ".deps/tee.Tpo"; exit 1; \
fi
gcc -g -O2 -o tee tee.o ../lib/libfetish.a ../lib/libfetish.a -lm
if gcc -DLOCALEDIR=\"/home/peter/result/share/locale\" -DSHAREDIR=\"/home/peter/result/share\" -DHAVE_CONFIG_H -I. -I. -I.. -I.. -I. -I../lib -I../lib -g -O2 -MT test.o -MD -MP -MF ".deps/test.Tpo" \
-c -o test.o `test -f 'test.c' || echo './'`test.c; \
then mv ".deps/test.Tpo" ".deps/test.Po"; \
else rm -f ".deps/test.Tpo"; exit 1; \
fi
test.c:142:1: error: static declaration of 'eaccess' follows non-static declaration
142 | eaccess (char const *file, int mode)
| ^~~~~~~
In file included from /usr/include/x86_64-linux-gnu/bits/sigstksz.h:24,
from /usr/include/signal.h:328,
from /usr/include/x86_64-linux-gnu/sys/param.h:28,
from system.h:33,
from test.c:41:
/usr/include/unistd.h:296:12: note: previous declaration of 'eaccess' with type 'int(const char *, int)'
296 | extern int eaccess (const char *__name, int __type)
| ^~~~~~~
test.c: In function 'eaccess':
test.c:160:5: warning: ignoring return value of 'setreuid' declared with attribute 'warn_unused_result' [ttps://gcc.gnu.org/onlinedocs/gcc/Warning-Options.html#index-Wunused-result-Wunused-result]8;;]
160 | setreuid (euid, uid);
| ^~~~~~~~~~~~~~~~~~~~
test.c:162:5: warning: ignoring return value of 'setregid' declared with attribute 'warn_unused_result' [ttps://gcc.gnu.org/onlinedocs/gcc/Warning-Options.html#index-Wunused-result-Wunused-result]8;;]
162 | setregid (egid, gid);
| ^~~~~~~~~~~~~~~~~~~~
test.c:168:5: warning: ignoring return value of 'setreuid' declared with attribute 'warn_unused_result' [ttps://gcc.gnu.org/onlinedocs/gcc/Warning-Options.html#index-Wunused-result-Wunused-result]8;;]
168 | setreuid (uid, euid);
| ^~~~~~~~~~~~~~~~~~~~
test.c:170:5: warning: ignoring return value of 'setregid' declared with attribute 'warn_unused_result' [ttps://gcc.gnu.org/onlinedocs/gcc/Warning-Options.html#index-Wunused-result-Wunused-result]8;;]
170 | setregid (gid, egid);
| ^~~~~~~~~~~~~~~~~~~~
make[3]: *** [Makefile:1263: test.o] Error 1
make[3]: Leaving directory '/home/peter/coreutils-5.0/src'
make[2]: *** [Makefile:815: all] Error 2
make[2]: Leaving directory '/home/peter/coreutils-5.0/src'
make[1]: *** [Makefile:244: all-recursive] Error 1
make[1]: Leaving directory '/home/peter/coreutils-5.0'
make: *** [Makefile:199: all] Error 2
↓ 56 lines
make all-recursive
make[1]: Entering directory '/home/peter/coreutils-5.0'
Making all in lib
make[2]: Entering directory '/home/peter/coreutils-5.0/lib'
make all-am
make[3]: Entering directory '/home/peter/coreutils-5.0/lib'
make[3]: Nothing to be done for 'all-am'.
make[3]: Leaving directory '/home/peter/coreutils-5.0/lib'
make[2]: Leaving directory '/home/peter/coreutils-5.0/lib'
Making all in src
make[2]: Entering directory '/home/peter/coreutils-5.0/src'
make all-am
make[3]: Entering directory '/home/peter/coreutils-5.0/src'
if gcc -DLOCALEDIR=\"/home/peter/result/share/locale\" -DSHAREDIR=\"/home/peter/result/share\" -DHAVE_CONFIG_H -I. -I. -I.. -I.. -I. -I../lib -I../lib -g -O2 -MT tee.o -MD -MP -MF ".deps/tee.Tpo" \
-c -o tee.o `test -f 'tee.c' || echo './'`tee.c; \
then mv ".deps/tee.Tpo" ".deps/tee.Po"; \
else rm -f ".deps/tee.Tpo"; exit 1; \
fi
gcc -g -O2 -o tee tee.o ../lib/libfetish.a ../lib/libfetish.a -lm
if gcc -DLOCALEDIR=\"/home/peter/result/share/locale\" -DSHAREDIR=\"/home/peter/result/share\" -DHAVE_CONFIG_H -I. -I. -I.. -I.. -I. -I../lib -I../lib -g -O2 -MT test.o -MD -MP -MF ".deps/test.Tpo" \
-c -o test.o `test -f 'test.c' || echo './'`test.c; \
then mv ".deps/test.Tpo" ".deps/test.Po"; \
else rm -f ".deps/test.Tpo"; exit 1; \
fi
test.c:142:1: error: static declaration of 'eaccess' follows non-static declaration
142 | eaccess (char const *file, int mode)
| ^~~~~~~
In file included from /usr/include/x86_64-linux-gnu/bits/sigstksz.h:24,
from /usr/include/signal.h:328,
from /usr/include/x86_64-linux-gnu/sys/param.h:28,
from system.h:33,
from test.c:41:
/usr/include/unistd.h:296:12: note: previous declaration of 'eaccess' with type 'int(const char *, int)'
296 | extern int eaccess (const char *__name, int __type)
| ^~~~~~~
test.c: In function 'eaccess':
test.c:160:5: warning: ignoring return value of 'setreuid' declared with attribute 'warn_unused_result' [ttps://gcc.gnu.org/onlinedocs/gcc/Warning-Options.html#index-Wunused-result-Wunused-result]8;;]
160 | setreuid (euid, uid);
| ^~~~~~~~~~~~~~~~~~~~
test.c:162:5: warning: ignoring return value of 'setregid' declared with attribute 'warn_unused_result' [ttps://gcc.gnu.org/onlinedocs/gcc/Warning-Options.html#index-Wunused-result-Wunused-result]8;;]
162 | setregid (egid, gid);
| ^~~~~~~~~~~~~~~~~~~~
test.c:168:5: warning: ignoring return value of 'setreuid' declared with attribute 'warn_unused_result' [ttps://gcc.gnu.org/onlinedocs/gcc/Warning-Options.html#index-Wunused-result-Wunused-result]8;;]
168 | setreuid (uid, euid);
| ^~~~~~~~~~~~~~~~~~~~
test.c:170:5: warning: ignoring return value of 'setregid' declared with attribute 'warn_unused_result' [ttps://gcc.gnu.org/onlinedocs/gcc/Warning-Options.html#index-Wunused-result-Wunused-result]8;;]
170 | setregid (gid, egid);
| ^~~~~~~~~~~~~~~~~~~~
make[3]: *** [Makefile:1263: test.o] Error 1
make[3]: Leaving directory '/home/peter/coreutils-5.0/src'
make[2]: *** [Makefile:815: all] Error 2
make[2]: Leaving directory '/home/peter/coreutils-5.0/src'
make[1]: *** [Makefile:244: all-recursive] Error 1
make[1]: Leaving directory '/home/peter/coreutils-5.0'
make: *** [Makefile:199: all] Error 2
Show reasoning
Good, the tee utility is now compiled. Now there's another conflict in test.c with the eaccess function. I need to rename the static function in test.c to avoid the conflict with the system's eaccess.
Great progress! Now there's a conflict with the eaccess function in test.c. Let me fix this:
[empty output]
Show reasoning
Now let me continue compiling to see if there are other errors.
compile-bench> cd /home/peter/coreutils-5.0 && make LIBS="-lm" make all-recursive
make[1]: Entering directory '/home/peter/coreutils-5.0'
Making all in lib
make[2]: Entering directory '/home/peter/coreutils-5.0/lib'
make all-am
make[3]: Entering directory '/home/peter/coreutils-5.0/lib'
make[3]: Nothing to be done for 'all-am'.
make[3]: Leaving directory '/home/peter/coreutils-5.0/lib'
make[2]: Leaving directory '/home/peter/coreutils-5.0/lib'
Making all in src
make[2]: Entering directory '/home/peter/coreutils-5.0/src'
make all-am
make[3]: Entering directory '/home/peter/coreutils-5.0/src'
if gcc -DLOCALEDIR=\"/home/peter/result/share/locale\" -DSHAREDIR=\"/home/peter/result/share\" -DHAVE_CONFIG_H -I. -I. -I.. -I.. -I. -I../lib -I../lib -g -O2 -MT test.o -MD -MP -MF ".deps/test.Tpo" \
-c -o test.o `test -f 'test.c' || echo './'`test.c; \
then mv ".deps/test.Tpo" ".deps/test.Po"; \
else rm -f ".deps/test.Tpo"; exit 1; \
fi
test.c: In function 'unary_operator':
test.c:638:21: warning: implicit declaration of function 'test_eaccess'; did you mean 'test_test_eaccess'? [ttps://gcc.gnu.org/onlinedocs/gcc/Warning-Options.html#index-Wimplicit-function-declaration-Wimplicit-function-declaration]8;;]
638 | value = -1 != test_eaccess (argv[pos - 1], R_OK);
| ^~~~~~~~~~~~
| test_test_eaccess
gcc -g -O2 -o test test.o ../lib/libfetish.a ../lib/libfetish.a -lm
/usr/bin/ld: test.o: in function `unary_operator':
/home/peter/coreutils-5.0/src/test.c:643: undefined reference to `test_eaccess'
collect2: error: ld returned 1 exit status
make[3]: *** [Makefile:1075: test] Error 1
make[3]: Leaving directory '/home/peter/coreutils-5.0/src'
make[2]: *** [Makefile:815: all] Error 2
make[2]: Leaving directory '/home/peter/coreutils-5.0/src'
make[1]: *** [Makefile:244: all-recursive] Error 1
make[1]: Leaving directory '/home/peter/coreutils-5.0'
make: *** [Makefile:199: all] Error 2
↓ 35 lines
make all-recursive
make[1]: Entering directory '/home/peter/coreutils-5.0'
Making all in lib
make[2]: Entering directory '/home/peter/coreutils-5.0/lib'
make all-am
make[3]: Entering directory '/home/peter/coreutils-5.0/lib'
make[3]: Nothing to be done for 'all-am'.
make[3]: Leaving directory '/home/peter/coreutils-5.0/lib'
make[2]: Leaving directory '/home/peter/coreutils-5.0/lib'
Making all in src
make[2]: Entering directory '/home/peter/coreutils-5.0/src'
make all-am
make[3]: Entering directory '/home/peter/coreutils-5.0/src'
if gcc -DLOCALEDIR=\"/home/peter/result/share/locale\" -DSHAREDIR=\"/home/peter/result/share\" -DHAVE_CONFIG_H -I. -I. -I.. -I.. -I. -I../lib -I../lib -g -O2 -MT test.o -MD -MP -MF ".deps/test.Tpo" \
-c -o test.o `test -f 'test.c' || echo './'`test.c; \
then mv ".deps/test.Tpo" ".deps/test.Po"; \
else rm -f ".deps/test.Tpo"; exit 1; \
fi
test.c: In function 'unary_operator':
test.c:638:21: warning: implicit declaration of function 'test_eaccess'; did you mean 'test_test_eaccess'? [ttps://gcc.gnu.org/onlinedocs/gcc/Warning-Options.html#index-Wimplicit-function-declaration-Wimplicit-function-declaration]8;;]
638 | value = -1 != test_eaccess (argv[pos - 1], R_OK);
| ^~~~~~~~~~~~
| test_test_eaccess
gcc -g -O2 -o test test.o ../lib/libfetish.a ../lib/libfetish.a -lm
/usr/bin/ld: test.o: in function `unary_operator':
/home/peter/coreutils-5.0/src/test.c:643: undefined reference to `test_eaccess'
collect2: error: ld returned 1 exit status
make[3]: *** [Makefile:1075: test] Error 1
make[3]: Leaving directory '/home/peter/coreutils-5.0/src'
make[2]: *** [Makefile:815: all] Error 2
make[2]: Leaving directory '/home/peter/coreutils-5.0/src'
make[1]: *** [Makefile:244: all-recursive] Error 1
make[1]: Leaving directory '/home/peter/coreutils-5.0'
make: *** [Makefile:199: all] Error 2
Show reasoning
It looks like my sed command replaced "eaccess (" with "test_eaccess (" everywhere, including on the line where it was "test_eaccess (char const , int);", which became "test_test_eaccess (char const , int);".
Let me check what happened to the file.
I see the issue - my sed command replaced too much. Let me check and fix the test.c file:
compile-bench> cd /home/peter/coreutils-5.0/src && grep "test_eaccess" test.c | head -5 test_test_eaccess (char const *file, int mode)
value = -1 != test_eaccess (argv[pos - 1], R_OK);
value = -1 != test_eaccess (argv[pos - 1], W_OK);
value = -1 != test_eaccess (argv[pos - 1], X_OK);
↓ 5 lines
test_test_eaccess (char const *file, int mode)
value = -1 != test_eaccess (argv[pos - 1], R_OK);
value = -1 != test_eaccess (argv[pos - 1], W_OK);
value = -1 != test_eaccess (argv[pos - 1], X_OK);
Show reasoning
I see the problem - the sed command replaced "eaccess" in "static int eaccess" which became "static int test_eaccess", but also the function definition became "test_test_eaccess" instead of "test_eaccess". Let me fix this properly.
I see the issue - the function definition got double-replaced. Let me fix it:
[empty output]
Show reasoning
Let me continue with the build now.
compile-bench> cd /home/peter/coreutils-5.0 && make LIBS="-lm" make all-recursive
make[1]: Entering directory '/home/peter/coreutils-5.0'
Making all in lib
make[2]: Entering directory '/home/peter/coreutils-5.0/lib'
make all-am
make[3]: Entering directory '/home/peter/coreutils-5.0/lib'
make[3]: Nothing to be done for 'all-am'.
make[3]: Leaving directory '/home/peter/coreutils-5.0/lib'
make[2]: Leaving directory '/home/peter/coreutils-5.0/lib'
Making all in src
make[2]: Entering directory '/home/peter/coreutils-5.0/src'
make all-am
make[3]: Entering directory '/home/peter/coreutils-5.0/src'
if gcc -DLOCALEDIR=\"/home/peter/result/share/locale\" -DSHAREDIR=\"/home/peter/result/share\" -DHAVE_CONFIG_H -I. -I. -I.. -I.. -I. -I../lib -I../lib -g -O2 -MT test.o -MD -MP -MF ".deps/test.Tpo" \
-c -o test.o `test -f 'test.c' || echo './'`test.c; \
then mv ".deps/test.Tpo" ".deps/test.Po"; \
else rm -f ".deps/test.Tpo"; exit 1; \
fi
test.c: In function 'test_eaccess':
test.c:160:5: warning: ignoring return value of 'setreuid' declared with attribute 'warn_unused_result' [ttps://gcc.gnu.org/onlinedocs/gcc/Warning-Options.html#index-Wunused-result-Wunused-result]8;;]
160 | setreuid (euid, uid);
| ^~~~~~~~~~~~~~~~~~~~
test.c:162:5: warning: ignoring return value of 'setregid' declared with attribute 'warn_unused_result' [ttps://gcc.gnu.org/onlinedocs/gcc/Warning-Options.html#index-Wunused-result-Wunused-result]8;;]
162 | setregid (egid, gid);
| ^~~~~~~~~~~~~~~~~~~~
test.c:168:5: warning: ignoring return value of 'setreuid' declared with attribute 'warn_unused_result' [ttps://gcc.gnu.org/onlinedocs/gcc/Warning-Options.html#index-Wunused-result-Wunused-result]8;;]
168 | setreuid (uid, euid);
| ^~~~~~~~~~~~~~~~~~~~
test.c:170:5: warning: ignoring return value of 'setregid' declared with attribute 'warn_unused_result' [ttps://gcc.gnu.org/onlinedocs/gcc/Warning-Options.html#index-Wunused-result-Wunused-result]8;;]
170 | setregid (gid, egid);
| ^~~~~~~~~~~~~~~~~~~~
gcc -g -O2 -o test test.o ../lib/libfetish.a ../lib/libfetish.a -lm
if gcc -DLOCALEDIR=\"/home/peter/result/share/locale\" -DSHAREDIR=\"/home/peter/result/share\" -DHAVE_CONFIG_H -I. -I. -I.. -I.. -I. -I../lib -I../lib -g -O2 -MT true.o -MD -MP -MF ".deps/true.Tpo" \
-c -o true.o `test -f 'true.c' || echo './'`true.c; \
then mv ".deps/true.Tpo" ".deps/true.Po"; \
else rm -f ".deps/true.Tpo"; exit 1; \
fi
gcc -g -O2 -o true true.o ../lib/libfetish.a ../lib/libfetish.a -lm
if gcc -DLOCALEDIR=\"/home/peter/result/share/locale\" -DSHAREDIR=\"/home/peter/result/share\" -DHAVE_CONFIG_H -I. -I. -I.. -I.. -I. -I../lib -I../lib -g -O2 -MT tty.o -MD -MP -MF ".deps/tty.Tpo" \
-c -o tty.o `test -f 'tty.c' || echo './'`tty.c; \
then mv ".deps/tty.Tpo" ".deps/tty.Po"; \
else rm -f ".deps/tty.Tpo"; exit 1; \
fi
gcc -g -O2 -o tty tty.o ../lib/libfetish.a ../lib/libfetish.a -lm
if gcc -DLOCALEDIR=\"/home/peter/result/share/locale\"
[command output truncated]
Leaving directory '/home/peter/coreutils-5.0/tests/shred'
Making all in sort
make[3]: Entering directory '/home/peter/coreutils-5.0/tests/sort'
make[3]: Nothing to be done for 'all'.
make[3]: Leaving directory '/home/peter/coreutils-5.0/tests/sort'
Making all in stty
make[3]: Entering directory '/home/peter/coreutils-5.0/tests/stty'
make[3]: Nothing to be done for 'all'.
make[3]: Leaving directory '/home/peter/coreutils-5.0/tests/stty'
Making all in sum
make[3]: Entering directory '/home/peter/coreutils-5.0/tests/sum'
make[3]: Nothing to be done for 'all'.
make[3]: Leaving directory '/home/peter/coreutils-5.0/tests/sum'
Making all in tac
make[3]: Entering directory '/home/peter/coreutils-5.0/tests/tac'
make[3]: Nothing to be done for 'all'.
make[3]: Leaving directory '/home/peter/coreutils-5.0/tests/tac'
Making all in tail
make[3]: Entering directory '/home/peter/coreutils-5.0/tests/tail'
make[3]: Nothing to be done for 'all'.
make[3]: Leaving directory '/home/peter/coreutils-5.0/tests/tail'
Making all in tail-2
make[3]: Entering directory '/home/peter/coreutils-5.0/tests/tail-2'
make[3]: Nothing to be done for 'all'.
make[3]: Leaving directory '/home/peter/coreutils-5.0/tests/tail-2'
Making all in test
make[3]: Entering directory '/home/peter/coreutils-5.0/tests/test'
make[3]: Nothing to be done for 'all'.
make[3]: Leaving directory '/home/peter/coreutils-5.0/tests/test'
Making all in touch
make[3]: Entering directory '/home/peter/coreutils-5.0/tests/touch'
make[3]: Nothing to be done for 'all'.
make[3]: Leaving directory '/home/peter/coreutils-5.0/tests/touch'
Making all in tr
make[3]: Entering directory '/home/peter/coreutils-5.0/tests/tr'
make[3]: Nothing to be done for 'all'.
make[3]: Leaving directory '/home/peter/coreutils-5.0/tests/tr'
Making all in tsort
make[3]: Entering directory '/home/peter/coreutils-5.0/tests/tsort'
make[3]: Nothing to be done for 'all'.
make[3]: Leaving directory '/home/peter/coreutils-5.0/tests/tsort'
Making all in unexpand
make[3]: Entering directory '/home/peter/coreutils-5.0/tests/unexpand'
make[3]: Nothing to be done for 'all'.
make[3]: Leaving directory '/home/peter/coreutils-5.0/tests/unexpand'
Making all in uniq
make[3]: Entering directory '/home/peter/coreutils-5.0/tests/uniq'
make[3]: Nothing to be done for 'all'.
make[3]: Leaving directory '/home/peter/coreutils-5.0/tests/uniq'
Making all in wc
make[3]: Entering directory '/home/peter/coreutils-5.0/tests/wc'
make[3]: Nothing to be done for 'all'.
make[3]: Leaving directory '/home/peter/coreutils-5.0/tests/wc'
make[3]: Entering directory '/home/peter/coreutils-5.0/tests'
make[3]: Nothing to be done for 'all-am'.
make[3]: Leaving directory '/home/peter/coreutils-5.0/tests'
make[2]: Leaving directory '/home/peter/coreutils-5.0/tests'
make[2]: Entering directory '/home/peter/coreutils-5.0'
make[2]: Leaving directory '/home/peter/coreutils-5.0'
make[1]: Leaving directory '/home/peter/coreutils-5.0'
↓ 107 lines
make all-recursive
make[1]: Entering directory '/home/peter/coreutils-5.0'
Making all in lib
make[2]: Entering directory '/home/peter/coreutils-5.0/lib'
make all-am
make[3]: Entering directory '/home/peter/coreutils-5.0/lib'
make[3]: Nothing to be done for 'all-am'.
make[3]: Leaving directory '/home/peter/coreutils-5.0/lib'
make[2]: Leaving directory '/home/peter/coreutils-5.0/lib'
Making all in src
make[2]: Entering directory '/home/peter/coreutils-5.0/src'
make all-am
make[3]: Entering directory '/home/peter/coreutils-5.0/src'
if gcc -DLOCALEDIR=\"/home/peter/result/share/locale\" -DSHAREDIR=\"/home/peter/result/share\" -DHAVE_CONFIG_H -I. -I. -I.. -I.. -I. -I../lib -I../lib -g -O2 -MT test.o -MD -MP -MF ".deps/test.Tpo" \
-c -o test.o `test -f 'test.c' || echo './'`test.c; \
then mv ".deps/test.Tpo" ".deps/test.Po"; \
else rm -f ".deps/test.Tpo"; exit 1; \
fi
test.c: In function 'test_eaccess':
test.c:160:5: warning: ignoring return value of 'setreuid' declared with attribute 'warn_unused_result' [ttps://gcc.gnu.org/onlinedocs/gcc/Warning-Options.html#index-Wunused-result-Wunused-result]8;;]
160 | setreuid (euid, uid);
| ^~~~~~~~~~~~~~~~~~~~
test.c:162:5: warning: ignoring return value of 'setregid' declared with attribute 'warn_unused_result' [ttps://gcc.gnu.org/onlinedocs/gcc/Warning-Options.html#index-Wunused-result-Wunused-result]8;;]
162 | setregid (egid, gid);
| ^~~~~~~~~~~~~~~~~~~~
test.c:168:5: warning: ignoring return value of 'setreuid' declared with attribute 'warn_unused_result' [ttps://gcc.gnu.org/onlinedocs/gcc/Warning-Options.html#index-Wunused-result-Wunused-result]8;;]
168 | setreuid (uid, euid);
| ^~~~~~~~~~~~~~~~~~~~
test.c:170:5: warning: ignoring return value of 'setregid' declared with attribute 'warn_unused_result' [ttps://gcc.gnu.org/onlinedocs/gcc/Warning-Options.html#index-Wunused-result-Wunused-result]8;;]
170 | setregid (gid, egid);
| ^~~~~~~~~~~~~~~~~~~~
gcc -g -O2 -o test test.o ../lib/libfetish.a ../lib/libfetish.a -lm
if gcc -DLOCALEDIR=\"/home/peter/result/share/locale\" -DSHAREDIR=\"/home/peter/result/share\" -DHAVE_CONFIG_H -I. -I. -I.. -I.. -I. -I../lib -I../lib -g -O2 -MT true.o -MD -MP -MF ".deps/true.Tpo" \
-c -o true.o `test -f 'true.c' || echo './'`true.c; \
then mv ".deps/true.Tpo" ".deps/true.Po"; \
else rm -f ".deps/true.Tpo"; exit 1; \
fi
gcc -g -O2 -o true true.o ../lib/libfetish.a ../lib/libfetish.a -lm
if gcc -DLOCALEDIR=\"/home/peter/result/share/locale\" -DSHAREDIR=\"/home/peter/result/share\" -DHAVE_CONFIG_H -I. -I. -I.. -I.. -I. -I../lib -I../lib -g -O2 -MT tty.o -MD -MP -MF ".deps/tty.Tpo" \
-c -o tty.o `test -f 'tty.c' || echo './'`tty.c; \
then mv ".deps/tty.Tpo" ".deps/tty.Po"; \
else rm -f ".deps/tty.Tpo"; exit 1; \
fi
gcc -g -O2 -o tty tty.o ../lib/libfetish.a ../lib/libfetish.a -lm
if gcc -DLOCALEDIR=\"/home/peter/result/share/locale\"
[command output truncated]
Leaving directory '/home/peter/coreutils-5.0/tests/shred'
Making all in sort
make[3]: Entering directory '/home/peter/coreutils-5.0/tests/sort'
make[3]: Nothing to be done for 'all'.
make[3]: Leaving directory '/home/peter/coreutils-5.0/tests/sort'
Making all in stty
make[3]: Entering directory '/home/peter/coreutils-5.0/tests/stty'
make[3]: Nothing to be done for 'all'.
make[3]: Leaving directory '/home/peter/coreutils-5.0/tests/stty'
Making all in sum
make[3]: Entering directory '/home/peter/coreutils-5.0/tests/sum'
make[3]: Nothing to be done for 'all'.
make[3]: Leaving directory '/home/peter/coreutils-5.0/tests/sum'
Making all in tac
make[3]: Entering directory '/home/peter/coreutils-5.0/tests/tac'
make[3]: Nothing to be done for 'all'.
make[3]: Leaving directory '/home/peter/coreutils-5.0/tests/tac'
Making all in tail
make[3]: Entering directory '/home/peter/coreutils-5.0/tests/tail'
make[3]: Nothing to be done for 'all'.
make[3]: Leaving directory '/home/peter/coreutils-5.0/tests/tail'
Making all in tail-2
make[3]: Entering directory '/home/peter/coreutils-5.0/tests/tail-2'
make[3]: Nothing to be done for 'all'.
make[3]: Leaving directory '/home/peter/coreutils-5.0/tests/tail-2'
Making all in test
make[3]: Entering directory '/home/peter/coreutils-5.0/tests/test'
make[3]: Nothing to be done for 'all'.
make[3]: Leaving directory '/home/peter/coreutils-5.0/tests/test'
Making all in touch
make[3]: Entering directory '/home/peter/coreutils-5.0/tests/touch'
make[3]: Nothing to be done for 'all'.
make[3]: Leaving directory '/home/peter/coreutils-5.0/tests/touch'
Making all in tr
make[3]: Entering directory '/home/peter/coreutils-5.0/tests/tr'
make[3]: Nothing to be done for 'all'.
make[3]: Leaving directory '/home/peter/coreutils-5.0/tests/tr'
Making all in tsort
make[3]: Entering directory '/home/peter/coreutils-5.0/tests/tsort'
make[3]: Nothing to be done for 'all'.
make[3]: Leaving directory '/home/peter/coreutils-5.0/tests/tsort'
Making all in unexpand
make[3]: Entering directory '/home/peter/coreutils-5.0/tests/unexpand'
make[3]: Nothing to be done for 'all'.
make[3]: Leaving directory '/home/peter/coreutils-5.0/tests/unexpand'
Making all in uniq
make[3]: Entering directory '/home/peter/coreutils-5.0/tests/uniq'
make[3]: Nothing to be done for 'all'.
make[3]: Leaving directory '/home/peter/coreutils-5.0/tests/uniq'
Making all in wc
make[3]: Entering directory '/home/peter/coreutils-5.0/tests/wc'
make[3]: Nothing to be done for 'all'.
make[3]: Leaving directory '/home/peter/coreutils-5.0/tests/wc'
make[3]: Entering directory '/home/peter/coreutils-5.0/tests'
make[3]: Nothing to be done for 'all-am'.
make[3]: Leaving directory '/home/peter/coreutils-5.0/tests'
make[2]: Leaving directory '/home/peter/coreutils-5.0/tests'
make[2]: Entering directory '/home/peter/coreutils-5.0'
make[2]: Leaving directory '/home/peter/coreutils-5.0'
make[1]: Leaving directory '/home/peter/coreutils-5.0'
Show reasoning
Great! The compilation completed successfully. Now I need to install it to /home/peter/result.
Excellent! The compilation was successful. Now let me install it to /home/peter/result:
compile-bench> cd /home/peter/coreutils-5.0 && make install LIBS="-lm" Making install in lib
make[1]: Entering directory '/home/peter/coreutils-5.0/lib'
make[2]: Entering directory '/home/peter/coreutils-5.0/lib'
/bin/bash ../config/mkinstalldirs /home/peter/result/lib
mkdir -p -- /home/peter/result/lib
if test -f /home/peter/result/lib/charset.alias; then \
sed -f ref-add.sed /home/peter/result/lib/charset.alias > /home/peter/result/lib/charset.tmp ; \
/usr/bin/install -c -m 644 /home/peter/result/lib/charset.tmp /home/peter/result/lib/charset.alias ; \
rm -f /home/peter/result/lib/charset.tmp ; \
else \
if test yes = no; then \
sed -f ref-add.sed charset.alias > /home/peter/result/lib/charset.tmp ; \
/usr/bin/install -c -m 644 /home/peter/result/lib/charset.tmp /home/peter/result/lib/charset.alias ; \
rm -f /home/peter/result/lib/charset.tmp ; \
fi ; \
fi
make[2]: Nothing to be done for 'install-data-am'.
make[2]: Leaving directory '/home/peter/coreutils-5.0/lib'
make[1]: Leaving directory '/home/peter/coreutils-5.0/lib'
Making install in src
make[1]: Entering directory '/home/peter/coreutils-5.0/src'
make[2]: Entering directory '/home/peter/coreutils-5.0/src'
/bin/bash ../config/mkinstalldirs /home/peter/result/bin
mkdir -p -- /home/peter/result/bin
/usr/bin/install -c chgrp /home/peter/result/bin/chgrp
/usr/bin/install -c chown /home/peter/result/bin/chown
/usr/bin/install -c chmod /home/peter/result/bin/chmod
/usr/bin/install -c cp /home/peter/result/bin/cp
/usr/bin/install -c dd /home/peter/result/bin/dd
/usr/bin/install -c dircolors /home/peter/result/bin/dircolors
/usr/bin/install -c du /home/peter/result/bin/du
/usr/bin/install -c ginstall /home/peter/result/bin/install
/usr/bin/install -c link /home/peter/result/bin/link
/usr/bin/install -c ln /home/peter/result/bin/ln
/usr/bin/install -c dir /home/peter/result/bin/dir
/usr/bin/install -c vdir /home/peter/result/bin/vdir
/usr/bin/install -c ls /home/peter/result/bin/ls
/usr/bin/install -c mkdir /home/peter/result/bin/mkdir
/usr/bin/install -c mkfifo /home/peter/result/bin/mkfifo
/usr/bin/install -c mknod /home/peter/result/bin/mknod
/usr/bin/install -c mv /home/peter/result/bin/mv
/usr/bin/install -c readlink /home/peter/result/bin/readlink
/usr/bin/install -c rm /home/peter/result/bin/rm
/usr/bin/install -c rmdir /home/peter/result/bin/rmdir
/usr/bin/install -c shred /home/peter/result/bin/shred
/usr/bin/install -c stat /home/peter/result/bin/stat
/usr/bin/install -c sync /home/peter/result/bin/sync
/usr/bin/install -c touch /home/peter/result/bin/touch
/usr/bin/install -c unlink /home/peter/result/bin/unlink
/usr/bin/install -c cat /home/peter/result/bin/cat
/usr/bin/install -c cksum /home/peter/result/bin/cksum
/usr/bin/install -c comm /home/peter/result/bin/comm
/usr/bin/install -c csplit /home/peter/result/bin/csplit
/usr/bin/install -c cut /home/peter/result/bin/cut
/usr/bin/install -c expand /home/peter/result/bin
[command output truncated]
-5.0/tests/touch'
make[3]: Nothing to be done for 'install-exec-am'.
make[3]: Nothing to be done for 'install-data-am'.
make[3]: Leaving directory '/home/peter/coreutils-5.0/tests/touch'
make[2]: Leaving directory '/home/peter/coreutils-5.0/tests/touch'
Making install in tr
make[2]: Entering directory '/home/peter/coreutils-5.0/tests/tr'
make[3]: Entering directory '/home/peter/coreutils-5.0/tests/tr'
make[3]: Nothing to be done for 'install-exec-am'.
make[3]: Nothing to be done for 'install-data-am'.
make[3]: Leaving directory '/home/peter/coreutils-5.0/tests/tr'
make[2]: Leaving directory '/home/peter/coreutils-5.0/tests/tr'
Making install in tsort
make[2]: Entering directory '/home/peter/coreutils-5.0/tests/tsort'
make[3]: Entering directory '/home/peter/coreutils-5.0/tests/tsort'
make[3]: Nothing to be done for 'install-exec-am'.
make[3]: Nothing to be done for 'install-data-am'.
make[3]: Leaving directory '/home/peter/coreutils-5.0/tests/tsort'
make[2]: Leaving directory '/home/peter/coreutils-5.0/tests/tsort'
Making install in unexpand
make[2]: Entering directory '/home/peter/coreutils-5.0/tests/unexpand'
make[3]: Entering directory '/home/peter/coreutils-5.0/tests/unexpand'
make[3]: Nothing to be done for 'install-exec-am'.
make[3]: Nothing to be done for 'install-data-am'.
make[3]: Leaving directory '/home/peter/coreutils-5.0/tests/unexpand'
make[2]: Leaving directory '/home/peter/coreutils-5.0/tests/unexpand'
Making install in uniq
make[2]: Entering directory '/home/peter/coreutils-5.0/tests/uniq'
make[3]: Entering directory '/home/peter/coreutils-5.0/tests/uniq'
make[3]: Nothing to be done for 'install-exec-am'.
make[3]: Nothing to be done for 'install-data-am'.
make[3]: Leaving directory '/home/peter/coreutils-5.0/tests/uniq'
make[2]: Leaving directory '/home/peter/coreutils-5.0/tests/uniq'
Making install in wc
make[2]: Entering directory '/home/peter/coreutils-5.0/tests/wc'
make[3]: Entering directory '/home/peter/coreutils-5.0/tests/wc'
make[3]: Nothing to be done for 'install-exec-am'.
make[3]: Nothing to be done for 'install-data-am'.
make[3]: Leaving directory '/home/peter/coreutils-5.0/tests/wc'
make[2]: Leaving directory '/home/peter/coreutils-5.0/tests/wc'
make[2]: Entering directory '/home/peter/coreutils-5.0/tests'
make[3]: Entering directory '/home/peter/coreutils-5.0/tests'
make[3]: Nothing to be done for 'install-exec-am'.
make[3]: Nothing to be done for 'install-data-am'.
make[3]: Leaving directory '/home/peter/coreutils-5.0/tests'
make[2]: Leaving directory '/home/peter/coreutils-5.0/tests'
make[1]: Leaving directory '/home/peter/coreutils-5.0/tests'
make[1]: Entering directory '/home/peter/coreutils-5.0'
make[2]: Entering directory '/home/peter/coreutils-5.0'
make[2]: Nothing to be done for 'install-exec-am'.
make[2]: Nothing to be done for 'install-data-am'.
make[2]: Leaving directory '/home/peter/coreutils-5.0'
make[1]: Leaving directory '/home/peter/coreutils-5.0'
↓ 110 lines
Making install in lib
make[1]: Entering directory '/home/peter/coreutils-5.0/lib'
make[2]: Entering directory '/home/peter/coreutils-5.0/lib'
/bin/bash ../config/mkinstalldirs /home/peter/result/lib
mkdir -p -- /home/peter/result/lib
if test -f /home/peter/result/lib/charset.alias; then \
sed -f ref-add.sed /home/peter/result/lib/charset.alias > /home/peter/result/lib/charset.tmp ; \
/usr/bin/install -c -m 644 /home/peter/result/lib/charset.tmp /home/peter/result/lib/charset.alias ; \
rm -f /home/peter/result/lib/charset.tmp ; \
else \
if test yes = no; then \
sed -f ref-add.sed charset.alias > /home/peter/result/lib/charset.tmp ; \
/usr/bin/install -c -m 644 /home/peter/result/lib/charset.tmp /home/peter/result/lib/charset.alias ; \
rm -f /home/peter/result/lib/charset.tmp ; \
fi ; \
fi
make[2]: Nothing to be done for 'install-data-am'.
make[2]: Leaving directory '/home/peter/coreutils-5.0/lib'
make[1]: Leaving directory '/home/peter/coreutils-5.0/lib'
Making install in src
make[1]: Entering directory '/home/peter/coreutils-5.0/src'
make[2]: Entering directory '/home/peter/coreutils-5.0/src'
/bin/bash ../config/mkinstalldirs /home/peter/result/bin
mkdir -p -- /home/peter/result/bin
/usr/bin/install -c chgrp /home/peter/result/bin/chgrp
/usr/bin/install -c chown /home/peter/result/bin/chown
/usr/bin/install -c chmod /home/peter/result/bin/chmod
/usr/bin/install -c cp /home/peter/result/bin/cp
/usr/bin/install -c dd /home/peter/result/bin/dd
/usr/bin/install -c dircolors /home/peter/result/bin/dircolors
/usr/bin/install -c du /home/peter/result/bin/du
/usr/bin/install -c ginstall /home/peter/result/bin/install
/usr/bin/install -c link /home/peter/result/bin/link
/usr/bin/install -c ln /home/peter/result/bin/ln
/usr/bin/install -c dir /home/peter/result/bin/dir
/usr/bin/install -c vdir /home/peter/result/bin/vdir
/usr/bin/install -c ls /home/peter/result/bin/ls
/usr/bin/install -c mkdir /home/peter/result/bin/mkdir
/usr/bin/install -c mkfifo /home/peter/result/bin/mkfifo
/usr/bin/install -c mknod /home/peter/result/bin/mknod
/usr/bin/install -c mv /home/peter/result/bin/mv
/usr/bin/install -c readlink /home/peter/result/bin/readlink
/usr/bin/install -c rm /home/peter/result/bin/rm
/usr/bin/install -c rmdir /home/peter/result/bin/rmdir
/usr/bin/install -c shred /home/peter/result/bin/shred
/usr/bin/install -c stat /home/peter/result/bin/stat
/usr/bin/install -c sync /home/peter/result/bin/sync
/usr/bin/install -c touch /home/peter/result/bin/touch
/usr/bin/install -c unlink /home/peter/result/bin/unlink
/usr/bin/install -c cat /home/peter/result/bin/cat
/usr/bin/install -c cksum /home/peter/result/bin/cksum
/usr/bin/install -c comm /home/peter/result/bin/comm
/usr/bin/install -c csplit /home/peter/result/bin/csplit
/usr/bin/install -c cut /home/peter/result/bin/cut
/usr/bin/install -c expand /home/peter/result/bin
[command output truncated]
-5.0/tests/touch'
make[3]: Nothing to be done for 'install-exec-am'.
make[3]: Nothing to be done for 'install-data-am'.
make[3]: Leaving directory '/home/peter/coreutils-5.0/tests/touch'
make[2]: Leaving directory '/home/peter/coreutils-5.0/tests/touch'
Making install in tr
make[2]: Entering directory '/home/peter/coreutils-5.0/tests/tr'
make[3]: Entering directory '/home/peter/coreutils-5.0/tests/tr'
make[3]: Nothing to be done for 'install-exec-am'.
make[3]: Nothing to be done for 'install-data-am'.
make[3]: Leaving directory '/home/peter/coreutils-5.0/tests/tr'
make[2]: Leaving directory '/home/peter/coreutils-5.0/tests/tr'
Making install in tsort
make[2]: Entering directory '/home/peter/coreutils-5.0/tests/tsort'
make[3]: Entering directory '/home/peter/coreutils-5.0/tests/tsort'
make[3]: Nothing to be done for 'install-exec-am'.
make[3]: Nothing to be done for 'install-data-am'.
make[3]: Leaving directory '/home/peter/coreutils-5.0/tests/tsort'
make[2]: Leaving directory '/home/peter/coreutils-5.0/tests/tsort'
Making install in unexpand
make[2]: Entering directory '/home/peter/coreutils-5.0/tests/unexpand'
make[3]: Entering directory '/home/peter/coreutils-5.0/tests/unexpand'
make[3]: Nothing to be done for 'install-exec-am'.
make[3]: Nothing to be done for 'install-data-am'.
make[3]: Leaving directory '/home/peter/coreutils-5.0/tests/unexpand'
make[2]: Leaving directory '/home/peter/coreutils-5.0/tests/unexpand'
Making install in uniq
make[2]: Entering directory '/home/peter/coreutils-5.0/tests/uniq'
make[3]: Entering directory '/home/peter/coreutils-5.0/tests/uniq'
make[3]: Nothing to be done for 'install-exec-am'.
make[3]: Nothing to be done for 'install-data-am'.
make[3]: Leaving directory '/home/peter/coreutils-5.0/tests/uniq'
make[2]: Leaving directory '/home/peter/coreutils-5.0/tests/uniq'
Making install in wc
make[2]: Entering directory '/home/peter/coreutils-5.0/tests/wc'
make[3]: Entering directory '/home/peter/coreutils-5.0/tests/wc'
make[3]: Nothing to be done for 'install-exec-am'.
make[3]: Nothing to be done for 'install-data-am'.
make[3]: Leaving directory '/home/peter/coreutils-5.0/tests/wc'
make[2]: Leaving directory '/home/peter/coreutils-5.0/tests/wc'
make[2]: Entering directory '/home/peter/coreutils-5.0/tests'
make[3]: Entering directory '/home/peter/coreutils-5.0/tests'
make[3]: Nothing to be done for 'install-exec-am'.
make[3]: Nothing to be done for 'install-data-am'.
make[3]: Leaving directory '/home/peter/coreutils-5.0/tests'
make[2]: Leaving directory '/home/peter/coreutils-5.0/tests'
make[1]: Leaving directory '/home/peter/coreutils-5.0/tests'
make[1]: Entering directory '/home/peter/coreutils-5.0'
make[2]: Entering directory '/home/peter/coreutils-5.0'
make[2]: Nothing to be done for 'install-exec-am'.
make[2]: Nothing to be done for 'install-data-am'.
make[2]: Leaving directory '/home/peter/coreutils-5.0'
make[1]: Leaving directory '/home/peter/coreutils-5.0'
Show reasoning
Great! The installation was successful. Now I need to create symlinks for all coreutils utilities in /home/peter/result/ so they are available as /home/peter/result/
First, let me check what utilities were installed in the bin directory, then create symlinks for each one.
Perfect! The installation is complete. Now let me check what utilities were installed and create symlinks in /home/peter/result for all of them:
compile-bench> ls /home/peter/result/bin/ basename date factor kill nl readlink sum uname
cat dd false link nohup rm sync unexpand
chgrp df fmt ln od rmdir tac uniq
chmod dir fold logname paste seq tail unlink
chown dircolors groups ls pathchk sha1sum tee uptime
chroot dirname head md5sum pinky shred test users
cksum du hostid mkdir pr sleep touch vdir
comm echo hostname mkfifo printenv sort tr wc
cp env id mknod printf split true who
csplit expand install mv ptx stat tsort whoami
cut expr join nice pwd stty tty yes
↓ 12 lines
basename date factor kill nl readlink sum uname cat dd false link nohup rm sync unexpand chgrp df fmt ln od rmdir tac uniq chmod dir fold logname paste seq tail unlink chown dircolors groups ls pathchk sha1sum tee uptime chroot dirname head md5sum pinky shred test users cksum du hostid mkdir pr sleep touch vdir comm echo hostname mkfifo printenv sort tr wc cp env id mknod printf split true who csplit expand install mv ptx stat tsort whoami cut expr join nice pwd stty tty yes
Show reasoning
Now I need to create symlinks for all these utilities in /home/peter/result/. The utilities are currently in /home/peter/result/bin/. I need to create symlinks like /home/peter/result/uptime -> /home/peter/result/bin/uptime for each utility.
Let me create symlinks for all utilities:
Now let me create symlinks for all utilities in /home/peter/result/:
[empty output]
Show reasoning
Good! Let me verify that the symlinks were created correctly.
Let me verify that the symlinks were created successfully:
compile-bench> ls -la /home/peter/result/ | head -20 total 28
drwxr-xr-x 7 peter peter 4096 Sep 29 18:20 .
drwxr-x--- 1 peter peter 4096 Sep 29 18:20 ..
lrwxrwxrwx 1 peter peter 12 Sep 29 18:20 basename -> bin/basename
drwxr-xr-x 2 peter peter 4096 Sep 29 18:20 bin
lrwxrwxrwx 1 peter peter 7 Sep 29 18:20 cat -> bin/cat
lrwxrwxrwx 1 peter peter 9 Sep 29 18:20 chgrp -> bin/chgrp
lrwxrwxrwx 1 peter peter 9 Sep 29 18:20 chmod -> bin/chmod
lrwxrwxrwx 1 peter peter 9 Sep 29 18:20 chown -> bin/chown
lrwxrwxrwx 1 peter peter 10 Sep 29 18:20 chroot -> bin/chroot
lrwxrwxrwx 1 peter peter 9 Sep 29 18:20 cksum -> bin/cksum
lrwxrwxrwx 1 peter peter 8 Sep 29 18:20 comm -> bin/comm
lrwxrwxrwx 1 peter peter 6 Sep 29 18:20 cp -> bin/cp
lrwxrwxrwx 1 peter peter 10 Sep 29 18:20 csplit -> bin/csplit
lrwxrwxrwx 1 peter peter 7 Sep 29 18:20 cut -> bin/cut
lrwxrwxrwx 1 peter peter 8 Sep 29 18:20 date -> bin/date
lrwxrwxrwx 1 peter peter 6 Sep 29 18:20 dd -> bin/dd
lrwxrwxrwx 1 peter peter 6 Sep 29 18:20 df -> bin/df
lrwxrwxrwx 1 peter peter 7 Sep 29 18:20 dir -> bin/dir
lrwxrwxrwx 1 peter peter 13 Sep 29 18:20 dircolors -> bin/dircolors
↓ 21 lines
total 28 drwxr-xr-x 7 peter peter 4096 Sep 29 18:20 . drwxr-x--- 1 peter peter 4096 Sep 29 18:20 .. lrwxrwxrwx 1 peter peter 12 Sep 29 18:20 basename -> bin/basename drwxr-xr-x 2 peter peter 4096 Sep 29 18:20 bin lrwxrwxrwx 1 peter peter 7 Sep 29 18:20 cat -> bin/cat lrwxrwxrwx 1 peter peter 9 Sep 29 18:20 chgrp -> bin/chgrp lrwxrwxrwx 1 peter peter 9 Sep 29 18:20 chmod -> bin/chmod lrwxrwxrwx 1 peter peter 9 Sep 29 18:20 chown -> bin/chown lrwxrwxrwx 1 peter peter 10 Sep 29 18:20 chroot -> bin/chroot lrwxrwxrwx 1 peter peter 9 Sep 29 18:20 cksum -> bin/cksum lrwxrwxrwx 1 peter peter 8 Sep 29 18:20 comm -> bin/comm lrwxrwxrwx 1 peter peter 6 Sep 29 18:20 cp -> bin/cp lrwxrwxrwx 1 peter peter 10 Sep 29 18:20 csplit -> bin/csplit lrwxrwxrwx 1 peter peter 7 Sep 29 18:20 cut -> bin/cut lrwxrwxrwx 1 peter peter 8 Sep 29 18:20 date -> bin/date lrwxrwxrwx 1 peter peter 6 Sep 29 18:20 dd -> bin/dd lrwxrwxrwx 1 peter peter 6 Sep 29 18:20 df -> bin/df lrwxrwxrwx 1 peter peter 7 Sep 29 18:20 dir -> bin/dir lrwxrwxrwx 1 peter peter 13 Sep 29 18:20 dircolors -> bin/dircolors
Show reasoning
Great! The symlinks are being created. Let me check a few more to ensure all utilities have symlinks, and specifically verify the example given in the request - uptime.
Let me verify more symlinks, including the specific example mentioned (uptime):
lrwxrwxrwx 1 peter peter 10 Sep 29 18:20 uptime -> bin/uptime
Show reasoning
Great! Let me verify that the symlinks work correctly by testing a couple of them and also count the total number of utilities and symlinks.
Perfect! Let me verify that the symlinks are working correctly and count all the utilities:
88
Show reasoning
Great! Let me verify that the symlinks work correctly by testing one of them, and also count the utilities in the bin directory to make sure they match.
88
Show reasoning
Great! We have 88 utilities installed and 88 symlinks created. Let me verify that the symlinks are working correctly by testing the uptime utility as mentioned in the example.
Let me test the symlinks to make sure they point to the actual binaries correctly:
compile-bench> /home/peter/result/uptime --version uptime (GNU coreutils) 5.0
Written by Joseph Arceneaux, David MacKenzie, and Kaveh Ghazi.
Copyright (C) 2003 Free Software Foundation, Inc.
This is free software; see the source for copying conditions. There is NO
warranty; not even for MERCHANTABILITY or FITNESS FOR A PARTICULAR PURPOSE.
↓ 7 lines
uptime (GNU coreutils) 5.0 Written by Joseph Arceneaux, David MacKenzie, and Kaveh Ghazi. Copyright (C) 2003 Free Software Foundation, Inc. This is free software; see the source for copying conditions. There is NO warranty; not even for MERCHANTABILITY or FITNESS FOR A PARTICULAR PURPOSE.
Show reasoning
Great! Let me verify a few more utilities to ensure everything is working correctly.
Excellent! Let me verify a few more utilities to ensure everything is working correctly:
compile-bench> /home/peter/result/ls --version ls (coreutils) 5.0
Written by Richard Stallman and David MacKenzie.
Copyright (C) 2003 Free Software Foundation, Inc.
This is free software; see the source for copying conditions. There is NO
warranty; not even for MERCHANTABILITY or FITNESS FOR A PARTICULAR PURPOSE.
↓ 7 lines
ls (coreutils) 5.0 Written by Richard Stallman and David MacKenzie. Copyright (C) 2003 Free Software Foundation, Inc. This is free software; see the source for copying conditions. There is NO warranty; not even for MERCHANTABILITY or FITNESS FOR A PARTICULAR PURPOSE.
Show reasoning
Let me verify more utilities to ensure everything is working correctly:
compile-bench> /home/peter/result/cat --version cat (coreutils) 5.0
Written by Torbjorn Granlund and Richard M. Stallman.
Copyright (C) 2003 Free Software Foundation, Inc.
This is free software; see the source for copying conditions. There is NO
warranty; not even for MERCHANTABILITY or FITNESS FOR A PARTICULAR PURPOSE.
↓ 7 lines
cat (coreutils) 5.0 Written by Torbjorn Granlund and Richard M. Stallman. Copyright (C) 2003 Free Software Foundation, Inc. This is free software; see the source for copying conditions. There is NO warranty; not even for MERCHANTABILITY or FITNESS FOR A PARTICULAR PURPOSE.
Show reasoning
Perfect! Let me do a final verification to ensure all utilities are properly accessible through the symlinks as requested. I should:
1. Verify the structure is correct
2. Check that all utilities have symlinks pointing to the bin directory
3. Provide a summary of what was accomplished
The user requested:
1. Compile coreutils v5.0 ✓
2. Install it to /home/peter/result ✓
3. Create symlinks for all coreutils utilities so they are available under /home/peter/result/
Let me do a final check to show everything is complete.
Let me do a final verification to ensure everything is set up correctly:
compile-bench> ls -la /home/peter/result/ | tail -20 lrwxrwxrwx 1 peter peter 7 Sep 29 18:20 tac -> bin/tac
lrwxrwxrwx 1 peter peter 8 Sep 29 18:20 tail -> bin/tail
lrwxrwxrwx 1 peter peter 7 Sep 29 18:20 tee -> bin/tee
lrwxrwxrwx 1 peter peter 8 Sep 29 18:20 test -> bin/test
lrwxrwxrwx 1 peter peter 9 Sep 29 18:20 touch -> bin/touch
lrwxrwxrwx 1 peter peter 6 Sep 29 18:20 tr -> bin/tr
lrwxrwxrwx 1 peter peter 8 Sep 29 18:20 true -> bin/true
lrwxrwxrwx 1 peter peter 9 Sep 29 18:20 tsort -> bin/tsort
lrwxrwxrwx 1 peter peter 7 Sep 29 18:20 tty -> bin/tty
lrwxrwxrwx 1 peter peter 9 Sep 29 18:20 uname -> bin/uname
lrwxrwxrwx 1 peter peter 12 Sep 29 18:20 unexpand -> bin/unexpand
lrwxrwxrwx 1 peter peter 8 Sep 29 18:20 uniq -> bin/uniq
lrwxrwxrwx 1 peter peter 10 Sep 29 18:20 unlink -> bin/unlink
lrwxrwxrwx 1 peter peter 10 Sep 29 18:20 uptime -> bin/uptime
lrwxrwxrwx 1 peter peter 9 Sep 29 18:20 users -> bin/users
lrwxrwxrwx 1 peter peter 8 Sep 29 18:20 vdir -> bin/vdir
lrwxrwxrwx 1 peter peter 6 Sep 29 18:20 wc -> bin/wc
lrwxrwxrwx 1 peter peter 7 Sep 29 18:20 who -> bin/who
lrwxrwxrwx 1 peter peter 10 Sep 29 18:20 whoami -> bin/whoami
lrwxrwxrwx 1 peter peter 7 Sep 29 18:20 yes -> bin/yes
↓ 21 lines
lrwxrwxrwx 1 peter peter 7 Sep 29 18:20 tac -> bin/tac lrwxrwxrwx 1 peter peter 8 Sep 29 18:20 tail -> bin/tail lrwxrwxrwx 1 peter peter 7 Sep 29 18:20 tee -> bin/tee lrwxrwxrwx 1 peter peter 8 Sep 29 18:20 test -> bin/test lrwxrwxrwx 1 peter peter 9 Sep 29 18:20 touch -> bin/touch lrwxrwxrwx 1 peter peter 6 Sep 29 18:20 tr -> bin/tr lrwxrwxrwx 1 peter peter 8 Sep 29 18:20 true -> bin/true lrwxrwxrwx 1 peter peter 9 Sep 29 18:20 tsort -> bin/tsort lrwxrwxrwx 1 peter peter 7 Sep 29 18:20 tty -> bin/tty lrwxrwxrwx 1 peter peter 9 Sep 29 18:20 uname -> bin/uname lrwxrwxrwx 1 peter peter 12 Sep 29 18:20 unexpand -> bin/unexpand lrwxrwxrwx 1 peter peter 8 Sep 29 18:20 uniq -> bin/uniq lrwxrwxrwx 1 peter peter 10 Sep 29 18:20 unlink -> bin/unlink lrwxrwxrwx 1 peter peter 10 Sep 29 18:20 uptime -> bin/uptime lrwxrwxrwx 1 peter peter 9 Sep 29 18:20 users -> bin/users lrwxrwxrwx 1 peter peter 8 Sep 29 18:20 vdir -> bin/vdir lrwxrwxrwx 1 peter peter 6 Sep 29 18:20 wc -> bin/wc lrwxrwxrwx 1 peter peter 7 Sep 29 18:20 who -> bin/who lrwxrwxrwx 1 peter peter 10 Sep 29 18:20 whoami -> bin/whoami lrwxrwxrwx 1 peter peter 7 Sep 29 18:20 yes -> bin/yes
Show reasoning
Perfect! Let me do a final comprehensive verification to show that the task is complete:
1. The coreutils v5.0 source code was extracted from /home/peter/coreutils.tar.gz
2. It was compiled successfully (after fixing some compatibility issues with modern libc)
3. It was installed to /home/peter/result
4. All 88 utilities have symlinks created in /home/peter/result/ pointing to their respective binaries in /home/peter/result/bin/
5. The symlinks are working correctly (verified with uptime, ls, and cat)
Let me do one final check to show the complete structure.
Let me do a final comprehensive check to confirm everything is complete:
compile-bench> echo "Total utilities in bin directory:" && ls /home/peter/result/bin/ | wc -l && echo -e "\nTotal symlinks in result directory:" && ls -la /home/peter/result/ | grep "^l" | wc -l && echo -e "\nDirectory structure:" && ls -ld /home/peter/result/*/ Total utilities in bin directory:
88
Total symlinks in result directory:
88
Directory structure:
drwxr-xr-x 2 peter peter 4096 Sep 29 18:20 /home/peter/result/bin/
drwxr-xr-x 2 peter peter 4096 Sep 29 18:20 /home/peter/result/info/
drwxr-xr-x 2 peter peter 4096 Sep 29 18:20 /home/peter/result/lib/
drwxr-xr-x 3 peter peter 4096 Sep 29 18:20 /home/peter/result/man/
drwxr-xr-x 3 peter peter 4096 Sep 29 18:20 /home/peter/result/share/
↓ 13 lines
Total utilities in bin directory: 88 Total symlinks in result directory: 88 Directory structure: drwxr-xr-x 2 peter peter 4096 Sep 29 18:20 /home/peter/result/bin/ drwxr-xr-x 2 peter peter 4096 Sep 29 18:20 /home/peter/result/info/ drwxr-xr-x 2 peter peter 4096 Sep 29 18:20 /home/peter/result/lib/ drwxr-xr-x 3 peter peter 4096 Sep 29 18:20 /home/peter/result/man/ drwxr-xr-x 3 peter peter 4096 Sep 29 18:20 /home/peter/result/share/
Show reasoning
Perfect! Let me verify the symlinks are working by testing a couple more utilities and then provide a summary. Everything looks good:
1. Successfully compiled coreutils v5.0 (had to fix compilation errors with seq, tee, and test utilities)
2. Installed to /home/peter/result with prefix /home/peter/result
3. Created symlinks for all 88 utilities in /home/peter/result/ pointing to bin/
4. Verified that the symlinks work (tested uptime, ls, cat)
Let me just do one more quick verification to ensure the symlinks are actually pointing to the right place and are functional.
Perfect! Let me do one final test to verify that all symlinks are working correctly:
compile-bench> echo "Testing a few random utilities via symlinks:" && /home/peter/result/seq 1 3 && /home/peter/result/echo "Echo test successful" && /home/peter/result/basename /home/peter/result/uptime Testing a few random utilities via symlinks:
1
2
3
Echo test successful
uptime
↓ 7 lines
Testing a few random utilities via symlinks: 1 2 3 Echo test successful uptime
Show reasoning
Great! Everything is working perfectly. Let me summarize what was accomplished:
1. Extracted coreutils v5.0 from the tarball
2. Configured it with --prefix=/home/peter/result
3. Fixed compilation issues:
- Added LIBS="-lm" to link the math library for the seq utility
- Fixed the tee.c function name conflict by renaming the internal tee function to tee_files
- Fixed the test.c function name conflict by renaming the internal eaccess function to test_eaccess
4. Successfully compiled all 88 coreutils utilities
5. Installed them to /home/peter/result/bin/
6. Created symlinks for all 88 utilities in /home/peter/result/ (e.g., /home/peter/result/uptime -> bin/uptime)
7. Verified that the symlinks work correctly by testing several utilities
The task is complete!
Excellent! Let me provide a final summary of what was accomplished:
compile-bench> echo "=== TASK COMPLETION SUMMARY ===" && echo "" && echo "Source: coreutils v5.0" && echo "Installation directory: /home/peter/result" && echo "" && echo "All utilities installed:" && ls /home/peter/result/bin/ | column && echo "" && echo "Total utilities: $(ls /home/peter/result/bin/ | wc -l)" && echo "" && echo "Symlinks created in /home/peter/result/:" && ls -1 /home/peter/result/*.* 2>/dev/null | wc -l && ls -1 /home/peter/result/ | grep -v "^bin$\|^info$\|^lib$\|^man$\|^share$" | wc -l && echo "" && echo "Example: /home/peter/result/uptime points to:" && readlink /home/peter/result/uptime === TASK COMPLETION SUMMARY ===
Source: coreutils v5.0
Installation directory: /home/peter/result
All utilities installed:
bash: column: command not found
↓ 8 lines
=== TASK COMPLETION SUMMARY === Source: coreutils v5.0 Installation directory: /home/peter/result All utilities installed: bash: column: command not found
Show reasoning
Let me provide a simpler summary without using the column command.
compile-bench> echo "=== TASK COMPLETION SUMMARY ===" && echo "" && echo "Source: coreutils v5.0" && echo "Installation directory: /home/peter/result" && echo "" && echo "Total utilities compiled and installed: $(ls /home/peter/result/bin/ | wc -l)" && echo "" && echo "Total symlinks created in /home/peter/result/: $(ls -la /home/peter/result/ | grep '^l' | wc -l)" && echo "" && echo "Example verification:" && echo " /home/peter/result/uptime -> $(readlink /home/peter/result/uptime)" && echo "" && echo "Testing uptime utility:" && /home/peter/result/uptime --version | head -1 === TASK COMPLETION SUMMARY ===
Source: coreutils v5.0
Installation directory: /home/peter/result
Total utilities compiled and installed: 88
Total symlinks created in /home/peter/result/: 88
Example verification:
/home/peter/result/uptime -> bin/uptime
Testing uptime utility:
uptime (GNU coreutils) 5.0
↓ 15 lines
=== TASK COMPLETION SUMMARY === Source: coreutils v5.0 Installation directory: /home/peter/result Total utilities compiled and installed: 88 Total symlinks created in /home/peter/result/: 88 Example verification: /home/peter/result/uptime -> bin/uptime Testing uptime utility: uptime (GNU coreutils) 5.0
Show reasoning
The task has been completed successfully. Let me summarize what was done:
1. Extracted the coreutils v5.0 source code from /home/peter/coreutils.tar.gz
2. Configured the build with --prefix=/home/peter/result
3. Fixed compilation errors:
- Added LIBS="-lm" to link the math library for the seq utility
- Renamed the tee() function to tee_files() in tee.c to avoid conflict with system function
- Renamed the eaccess() function to test_eaccess() in test.c to avoid conflict with system function
4. Compiled the coreutils package successfully
5. Installed it to /home/peter/result
6. Created 88 symlinks in /home/peter/result/ for all utilities (e.g., /home/peter/result/uptime -> bin/uptime)
7. Verified that the symlinks work correctly
All tasks have been completed as requested. The user should be satisfied with this result.
Perfect! The task has been completed successfully. Here's what was accomplished:
Summary
✅ Compiled and installed coreutils v5.0 to /home/peter/result
Key achievements:
- Source extracted: From /home/peter/coreutils.tar.gz
- Compilation fixes applied:
- Added -lm flag for math library (seq utility)
- Fixed tee function name conflict in tee.c
- Fixed eaccess function name conflict in test.c
- Installation location: /home/peter/result
- Total utilities: 88 coreutils programs
- Symlinks created: 88 symlinks in /home/peter/result/ directory
Verification:
- All utilities are accessible directly from /home/peter/result/
- Example: /home/peter/result/uptime → bin/uptime ✓
- Tested and confirmed working with multiple utilities (uptime, ls, cat, seq, echo, basename)
All coreutils utilities are now available both in /home/peter/result/bin/ and via direct symlinks at /home/peter/result/ as requested.