| Cost | $0.165 |
| Total elapsed time | 3m8s |
| LLM inference time | 2m47s |
| Command execution time | 21s |
| Commands executed | 66 |
All details >
| Attempt ID | 38us456gg97t1 | Attempt group | run-16-09-22-05 |
| Revision | fb5c74bd2fee | AWS Instance | m8i.2xlarge |
| Start time | 2025-09-16T20:24:19.655Z | End time | 2025-09-16T20:27:28.469Z |
| Task | coreutils-old-version-alpine | Environment | alpine-3.22.1-amd64-offline |
| Model | | OpenRouter slug | google/gemini-2.5-flash |
| Temperature | 1 | Explicit prompt caching | false |
| User msg after tool call | false | Max tool calls | 200 |
| Total timeout seconds | 2400 | Single command timeout | 900 |
| Cost | $0.165 | Duration | 3m8s |
| LLM inference time | 2m47s | Command execution time | 21s |
| Final context tokens | 32,104 | Total output tokens | 13,795 |
| Output reasoning tokens | 11,424 | Messages | 135 |
| Assistant messages | 67 | User messages | 1 |
| System messages | 1 | Commands executed | 66 |
GNU coreutils 5.0 (from 2003) is a collection of Linux utilities like ls, cp, mv, etc.
Project link: gnu.org/software/coreutils
Task:
Compile and install all coreutils utilities to a specific location.
Difficulties:
The source is very old (2003) and requires heavy patching. On Alpine Linux (with musl) the code requires even more patching.
Environment:
Alpine Linux 3.22.1 on amd64, without internet access.
You are a package-building specialist operating a Alpine Linux 3.22.1 bash shell via one tool: run_terminal_cmd.
The current working directory of every run_terminal_cmd is /home/peter.
Execution rules:
- Always pass non-interactive flags for any command that could prompt (e.g., -y, --yes).
- Don't include any newlines in the command.
- The environment is offline, assume you have all the necessary tools already installed.
If you encounter any errors or issues while doing the user's request, you must fix them and continue the task.
At the end verify you did the user request correctly.
You are given a coreutils v5.0 source code at /home/peter/coreutils.tar.gz. Please compile the coreutils package and install it to /home/peter/result. Create symlinks for all coreutils utilities so they are available under /home/peter/result/
Show reasoning
Defining the Process
I've got a handle on the core actions: extract, configure, compile, install, and link. My focus now is refining each step. The user's specific install path (/home/peter/result) is top of mind. I'm starting to think about the exact commands I'll need for each stage to ensure it's seamless.
Beginning Extraction Now
I'm ready to kick things off. Extraction is the initial move. I envision a simple tar command to unpack the tarball. Next comes configuration, but first, the user's desired directory /home/peter/result needs integration to ensure it will function correctly.
[empty output]
Show reasoning
Examining Package Extraction
I've extracted the tarball, and now my focus is on the installation. My next step is to locate the directory created during the extraction process. I plan to then navigate into it, prepare the package for compilation, and finally, install the coreutils.
/home/peter/coreutils-5.0 /home/peter/coreutils.tar.gz
Show reasoning
Initiating Coreutils Installation
I've confirmed the ls output, revealing the extracted directory's name. My next step involves navigating into coreutils-5.0, followed by configuration. After this, compilation and installation will commence, with the final destination set at /home/peter/result. I'm on the cusp of executing the commands.
compile-bench> cd /home/peter/coreutils-5.0 && ./configure --prefix=/home/peter/result checking build system type... x86_64-unknown-linux-gnu
checking host system type... x86_64-unknown-linux-gnu
checking for a BSD-compatible install... /usr/bin/install -c
checking whether build environment is sane... yes
checking for gawk... no
checking for mawk... no
checking for nawk... no
checking for awk... awk
checking whether make sets $(MAKE)... yes
checking for perl5.003 or newer... no
configure: WARNING:
WARNING: You don't seem to have perl5.003 or newer installed, or you lack
a usable version of the Perl File::Compare module. As a result,
you may be unable to run a few tests or to regenerate certain
files if you modify the sources from which they are derived.
checking for gcc... gcc
checking for C compiler default output... a.out
checking whether the C compiler works... yes
checking whether we are cross compiling... no
checking for suffix of executables...
checking for suffix of object files... o
checking whether we are using the GNU C compiler... yes
checking whether gcc accepts -g... yes
checking for gcc option to accept ANSI C... none needed
checking for style of include used by make... GNU
checking dependency style of gcc... gcc3
checking how to run the C preprocessor... gcc -E
checking for egrep... grep -E
checking whether gcc needs -traditional... no
checking for ranlib... ranlib
checking whether ln -s works... yes
checking for AIX... no
checking for ANSI C header files... no
checking for sys/types.h... yes
checking for sys/stat.h... yes
checking for stdlib.h... yes
checking for string.h... yes
checking for memory.h... yes
checking for strings.h... yes
checking for inttypes.h... yes
checking for stdint.h... yes
checking for unistd.h... yes
checking minix/config.h usability... no
checking minix/config.h presence... no
checking for minix/config.h... no
checking for uname... yes
checking for chroot... yes
checking for gethostid... yes
checking for strerror in -lcposix... no
checking for special C compiler options needed for large files... no
checking for _FILE_OFFSET_BITS value needed for large files... no
checking for _LARGE_FILES value needed for large files... no
checking for gcc option to accept ANSI C... none needed
checking for function prototypes... yes
checking for ANSI C header files... (cached) no
checking for string.h... (cached) yes
checking whether byte ordering is bigendian... no
checking for an ANSI C-conforming const... yes
checking for working volatile... yes
checking for inline... inline
checking for working long double with more range or precision than double... no
checking errno.h usability... yes
checking errno.h presence... yes
checking for errno.h... yes
checking fcntl.h usability... yes
checking fcntl.h presence... yes
checking for fcntl.h... yes
checking float.h usability... yes
checking float.h presence... yes
[command output truncated]
checking for getspnam... yes
checking for library containing crypt... none required
checking for msgfmt... no
checking for gmsgfmt... :
checking for xgettext... no
checking for msgmerge... no
checking whether NLS is requested... yes
checking for GNU gettext in libc... no
checking for iconv... (cached) yes
checking for GNU gettext in libintl... no
configure: creating ./config.status
config.status: creating Makefile
config.status: creating doc/Makefile
config.status: creating lib/Makefile
config.status: creating man/Makefile
config.status: creating m4/Makefile
config.status: creating po/Makefile.in
config.status: creating src/Makefile
config.status: creating tests/Makefile
config.status: creating tests/basename/Makefile
config.status: creating tests/chgrp/Makefile
config.status: creating tests/chmod/Makefile
config.status: creating tests/chown/Makefile
config.status: creating tests/cp/Makefile
config.status: creating tests/cut/Makefile
config.status: creating tests/date/Makefile
config.status: creating tests/dd/Makefile
config.status: creating tests/dircolors/Makefile
config.status: creating tests/du/Makefile
config.status: creating tests/expr/Makefile
config.status: creating tests/factor/Makefile
config.status: creating tests/fmt/Makefile
config.status: creating tests/head/Makefile
config.status: creating tests/install/Makefile
config.status: creating tests/join/Makefile
config.status: creating tests/ln/Makefile
config.status: creating tests/ls-2/Makefile
config.status: creating tests/ls/Makefile
config.status: creating tests/md5sum/Makefile
config.status: creating tests/misc/Makefile
config.status: creating tests/mkdir/Makefile
config.status: creating tests/mv/Makefile
config.status: creating tests/od/Makefile
config.status: creating tests/pr/Makefile
config.status: creating tests/rm/Makefile
config.status: creating tests/rmdir/Makefile
config.status: creating tests/seq/Makefile
config.status: creating tests/sha1sum/Makefile
config.status: creating tests/shred/Makefile
config.status: creating tests/sort/Makefile
config.status: creating tests/stty/Makefile
config.status: creating tests/sum/Makefile
config.status: creating tests/tac/Makefile
config.status: creating tests/tail-2/Makefile
config.status: creating tests/tail/Makefile
config.status: creating tests/test/Makefile
config.status: creating tests/touch/Makefile
config.status: creating tests/tr/Makefile
config.status: creating tests/tsort/Makefile
config.status: creating tests/unexpand/Makefile
config.status: creating tests/uniq/Makefile
config.status: creating tests/wc/Makefile
config.status: creating config.h
config.status: linking ./lib/fnmatch_.h to lib/fnmatch.h
config.status: linking ./lib/ftw_.h to lib/ftw.h
config.status: executing depfiles commands
config.status: executing default-1 commands
config.status: creating po/POTFILES
config.status: creating po/Makefile
↓ 141 lines
checking build system type... x86_64-unknown-linux-gnu
checking host system type... x86_64-unknown-linux-gnu
checking for a BSD-compatible install... /usr/bin/install -c
checking whether build environment is sane... yes
checking for gawk... no
checking for mawk... no
checking for nawk... no
checking for awk... awk
checking whether make sets $(MAKE)... yes
checking for perl5.003 or newer... no
configure: WARNING:
WARNING: You don't seem to have perl5.003 or newer installed, or you lack
a usable version of the Perl File::Compare module. As a result,
you may be unable to run a few tests or to regenerate certain
files if you modify the sources from which they are derived.
checking for gcc... gcc
checking for C compiler default output... a.out
checking whether the C compiler works... yes
checking whether we are cross compiling... no
checking for suffix of executables...
checking for suffix of object files... o
checking whether we are using the GNU C compiler... yes
checking whether gcc accepts -g... yes
checking for gcc option to accept ANSI C... none needed
checking for style of include used by make... GNU
checking dependency style of gcc... gcc3
checking how to run the C preprocessor... gcc -E
checking for egrep... grep -E
checking whether gcc needs -traditional... no
checking for ranlib... ranlib
checking whether ln -s works... yes
checking for AIX... no
checking for ANSI C header files... no
checking for sys/types.h... yes
checking for sys/stat.h... yes
checking for stdlib.h... yes
checking for string.h... yes
checking for memory.h... yes
checking for strings.h... yes
checking for inttypes.h... yes
checking for stdint.h... yes
checking for unistd.h... yes
checking minix/config.h usability... no
checking minix/config.h presence... no
checking for minix/config.h... no
checking for uname... yes
checking for chroot... yes
checking for gethostid... yes
checking for strerror in -lcposix... no
checking for special C compiler options needed for large files... no
checking for _FILE_OFFSET_BITS value needed for large files... no
checking for _LARGE_FILES value needed for large files... no
checking for gcc option to accept ANSI C... none needed
checking for function prototypes... yes
checking for ANSI C header files... (cached) no
checking for string.h... (cached) yes
checking whether byte ordering is bigendian... no
checking for an ANSI C-conforming const... yes
checking for working volatile... yes
checking for inline... inline
checking for working long double with more range or precision than double... no
checking errno.h usability... yes
checking errno.h presence... yes
checking for errno.h... yes
checking fcntl.h usability... yes
checking fcntl.h presence... yes
checking for fcntl.h... yes
checking float.h usability... yes
checking float.h presence... yes
[command output truncated]
checking for getspnam... yes
checking for library containing crypt... none required
checking for msgfmt... no
checking for gmsgfmt... :
checking for xgettext... no
checking for msgmerge... no
checking whether NLS is requested... yes
checking for GNU gettext in libc... no
checking for iconv... (cached) yes
checking for GNU gettext in libintl... no
configure: creating ./config.status
config.status: creating Makefile
config.status: creating doc/Makefile
config.status: creating lib/Makefile
config.status: creating man/Makefile
config.status: creating m4/Makefile
config.status: creating po/Makefile.in
config.status: creating src/Makefile
config.status: creating tests/Makefile
config.status: creating tests/basename/Makefile
config.status: creating tests/chgrp/Makefile
config.status: creating tests/chmod/Makefile
config.status: creating tests/chown/Makefile
config.status: creating tests/cp/Makefile
config.status: creating tests/cut/Makefile
config.status: creating tests/date/Makefile
config.status: creating tests/dd/Makefile
config.status: creating tests/dircolors/Makefile
config.status: creating tests/du/Makefile
config.status: creating tests/expr/Makefile
config.status: creating tests/factor/Makefile
config.status: creating tests/fmt/Makefile
config.status: creating tests/head/Makefile
config.status: creating tests/install/Makefile
config.status: creating tests/join/Makefile
config.status: creating tests/ln/Makefile
config.status: creating tests/ls-2/Makefile
config.status: creating tests/ls/Makefile
config.status: creating tests/md5sum/Makefile
config.status: creating tests/misc/Makefile
config.status: creating tests/mkdir/Makefile
config.status: creating tests/mv/Makefile
config.status: creating tests/od/Makefile
config.status: creating tests/pr/Makefile
config.status: creating tests/rm/Makefile
config.status: creating tests/rmdir/Makefile
config.status: creating tests/seq/Makefile
config.status: creating tests/sha1sum/Makefile
config.status: creating tests/shred/Makefile
config.status: creating tests/sort/Makefile
config.status: creating tests/stty/Makefile
config.status: creating tests/sum/Makefile
config.status: creating tests/tac/Makefile
config.status: creating tests/tail-2/Makefile
config.status: creating tests/tail/Makefile
config.status: creating tests/test/Makefile
config.status: creating tests/touch/Makefile
config.status: creating tests/tr/Makefile
config.status: creating tests/tsort/Makefile
config.status: creating tests/unexpand/Makefile
config.status: creating tests/uniq/Makefile
config.status: creating tests/wc/Makefile
config.status: creating config.h
config.status: linking ./lib/fnmatch_.h to lib/fnmatch.h
config.status: linking ./lib/ftw_.h to lib/ftw.h
config.status: executing depfiles commands
config.status: executing default-1 commands
config.status: creating po/POTFILES
config.status: creating po/Makefile
Show reasoning
Processing Compilation Steps
I've successfully configured the package. Moving forward, the next steps involve invoking make within the coreutils-5.0 directory, followed by installing the compiled package. It is critical I am in the correct directory for these commands to work.
compile-bench> cd /home/peter/coreutils-5.0 && make make all-recursive
make[1]: Entering directory '/home/peter/coreutils-5.0'
Making all in lib
make[2]: Entering directory '/home/peter/coreutils-5.0/lib'
make all-am
make[3]: Entering directory '/home/peter/coreutils-5.0/lib'
if gcc -DLIBDIR=\"/home/peter/result/lib\" -DHAVE_CONFIG_H -I. -I. -I.. -I.. -I. -g -O2 -MT acl.o -MD -MP -MF ".deps/acl.Tpo" \
-c -o acl.o `test -f 'acl.c' || echo './'`acl.c; \
then mv ".deps/acl.Tpo" ".deps/acl.Po"; \
else rm -f ".deps/acl.Tpo"; exit 1; \
fi
In file included from acl.c:22:
../config.h:1359:15: error: duplicate 'unsigned'
1359 | #define ino_t unsigned long
| ^~~~~~~~
make[3]: *** [Makefile:590: acl.o] Error 1
make[3]: Leaving directory '/home/peter/coreutils-5.0/lib'
make[2]: *** [Makefile:414: all] Error 2
make[2]: Leaving directory '/home/peter/coreutils-5.0/lib'
make[1]: *** [Makefile:244: all-recursive] Error 1
make[1]: Leaving directory '/home/peter/coreutils-5.0'
make: *** [Makefile:199: all] Error 2
↓ 23 lines
make all-recursive
make[1]: Entering directory '/home/peter/coreutils-5.0'
Making all in lib
make[2]: Entering directory '/home/peter/coreutils-5.0/lib'
make all-am
make[3]: Entering directory '/home/peter/coreutils-5.0/lib'
if gcc -DLIBDIR=\"/home/peter/result/lib\" -DHAVE_CONFIG_H -I. -I. -I.. -I.. -I. -g -O2 -MT acl.o -MD -MP -MF ".deps/acl.Tpo" \
-c -o acl.o `test -f 'acl.c' || echo './'`acl.c; \
then mv ".deps/acl.Tpo" ".deps/acl.Po"; \
else rm -f ".deps/acl.Tpo"; exit 1; \
fi
In file included from acl.c:22:
../config.h:1359:15: error: duplicate 'unsigned'
1359 | #define ino_t unsigned long
| ^~~~~~~~
make[3]: *** [Makefile:590: acl.o] Error 1
make[3]: Leaving directory '/home/peter/coreutils-5.0/lib'
make[2]: *** [Makefile:414: all] Error 2
make[2]: Leaving directory '/home/peter/coreutils-5.0/lib'
make[1]: *** [Makefile:244: all-recursive] Error 1
make[1]: Leaving directory '/home/peter/coreutils-5.0'
make: *** [Makefile:199: all] Error 2
Show reasoning
Diagnosing the Build Failure
I'm focusing on the compilation error now. It looks like the build is failing because of a duplicate unsigned keyword. The error originates from acl.c and pinpoints the conflict in ../config.h:1359:15. It seems ino_t is already defined as unsigned long in this context, and the system is trying to redefine it.
Resolving the Configuration Issue
I'm currently refining the approach. My plan is to use sed to comment out the offending line in config.h and then attempt another build. I’ve confirmed the location of the conflicting definition. I'm expecting this to solve the immediate compilation error.
[empty output]
Show reasoning
Trying the build process again
I've addressed the duplicate 'unsigned' error in config.h by removing the problematic line. Now, the next step is to attempt a fresh make command to see if the build proceeds without further issues. I'm cautiously optimistic this fix will resolve the problem.
compile-bench> cd /home/peter/coreutils-5.0 && make make all-recursive
make[1]: Entering directory '/home/peter/coreutils-5.0'
Making all in lib
make[2]: Entering directory '/home/peter/coreutils-5.0/lib'
make all-am
make[3]: Entering directory '/home/peter/coreutils-5.0/lib'
if gcc -DLIBDIR=\"/home/peter/result/lib\" -DHAVE_CONFIG_H -I. -I. -I.. -I.. -I. -g -O2 -MT acl.o -MD -MP -MF ".deps/acl.Tpo" \
-c -o acl.o `test -f 'acl.c' || echo './'`acl.c; \
then mv ".deps/acl.Tpo" ".deps/acl.Po"; \
else rm -f ".deps/acl.Tpo"; exit 1; \
fi
if gcc -DLIBDIR=\"/home/peter/result/lib\" -DHAVE_CONFIG_H -I. -I. -I.. -I.. -I. -g -O2 -MT getdate.o -MD -MP -MF ".deps/getdate.Tpo" \
-c -o getdate.o `test -f 'getdate.c' || echo './'`getdate.c; \
then mv ".deps/getdate.Tpo" ".deps/getdate.Po"; \
else rm -f ".deps/getdate.Tpo"; exit 1; \
fi
if gcc -DLIBDIR=\"/home/peter/result/lib\" -DHAVE_CONFIG_H -I. -I. -I.. -I.. -I. -g -O2 -MT posixtm.o -MD -MP -MF ".deps/posixtm.Tpo" \
-c -o posixtm.o `test -f 'posixtm.c' || echo './'`posixtm.c; \
then mv ".deps/posixtm.Tpo" ".deps/posixtm.Po"; \
else rm -f ".deps/posixtm.Tpo"; exit 1; \
fi
if gcc -DLIBDIR=\"/home/peter/result/lib\" -DHAVE_CONFIG_H -I. -I. -I.. -I.. -I. -g -O2 -MT posixver.o -MD -MP -MF ".deps/posixver.Tpo" \
-c -o posixver.o `test -f 'posixver.c' || echo './'`posixver.c; \
then mv ".deps/posixver.Tpo" ".deps/posixver.Po"; \
else rm -f ".deps/posixver.Tpo"; exit 1; \
fi
In file included from /usr/include/fortify/stdlib.h:33,
from posixver.c:28:
/usr/include/fortify/unistd.h:75:1: error: 'getgroups' undeclared here (not in a function); did you mean 'setgroups'?
75 | _FORTIFY_FN(getgroups) int getgroups(int __l, gid_t * _FORTIFY_POS0 __s)
| ^~~~~~~~~~~
In file included from posixver.c:34:
/usr/include/fortify/unistd.h: In function 'getgroups':
/usr/include/fortify/unistd.h:81:16: error: called object '__orig_getgroups' is not a function or function pointer
81 | return __orig_getgroups(__l, __s);
| ^~~~~~~~~~~~~~~~
/usr/include/fortify/unistd.h:75:1: note: declared here
75 | _FORTIFY_FN(getgroups) int getgroups(int __l, gid_t * _FORTIFY_POS0 __s)
| ^~~~~~~~~~~
make[3]: *** [Makefile:590: posixver.o] Error 1
make[3]: Leaving directory '/home/peter/coreutils-5.0/lib'
make[2]: *** [Makefile:414: all] Error 2
make[2]: Leaving directory '/home/peter/coreutils-5.0/lib'
make[1]: *** [Makefile:244: all-recursive] Error 1
make[1]: Leaving directory '/home/peter/coreutils-5.0'
make: *** [Makefile:199: all] Error 2
↓ 47 lines
make all-recursive
make[1]: Entering directory '/home/peter/coreutils-5.0'
Making all in lib
make[2]: Entering directory '/home/peter/coreutils-5.0/lib'
make all-am
make[3]: Entering directory '/home/peter/coreutils-5.0/lib'
if gcc -DLIBDIR=\"/home/peter/result/lib\" -DHAVE_CONFIG_H -I. -I. -I.. -I.. -I. -g -O2 -MT acl.o -MD -MP -MF ".deps/acl.Tpo" \
-c -o acl.o `test -f 'acl.c' || echo './'`acl.c; \
then mv ".deps/acl.Tpo" ".deps/acl.Po"; \
else rm -f ".deps/acl.Tpo"; exit 1; \
fi
if gcc -DLIBDIR=\"/home/peter/result/lib\" -DHAVE_CONFIG_H -I. -I. -I.. -I.. -I. -g -O2 -MT getdate.o -MD -MP -MF ".deps/getdate.Tpo" \
-c -o getdate.o `test -f 'getdate.c' || echo './'`getdate.c; \
then mv ".deps/getdate.Tpo" ".deps/getdate.Po"; \
else rm -f ".deps/getdate.Tpo"; exit 1; \
fi
if gcc -DLIBDIR=\"/home/peter/result/lib\" -DHAVE_CONFIG_H -I. -I. -I.. -I.. -I. -g -O2 -MT posixtm.o -MD -MP -MF ".deps/posixtm.Tpo" \
-c -o posixtm.o `test -f 'posixtm.c' || echo './'`posixtm.c; \
then mv ".deps/posixtm.Tpo" ".deps/posixtm.Po"; \
else rm -f ".deps/posixtm.Tpo"; exit 1; \
fi
if gcc -DLIBDIR=\"/home/peter/result/lib\" -DHAVE_CONFIG_H -I. -I. -I.. -I.. -I. -g -O2 -MT posixver.o -MD -MP -MF ".deps/posixver.Tpo" \
-c -o posixver.o `test -f 'posixver.c' || echo './'`posixver.c; \
then mv ".deps/posixver.Tpo" ".deps/posixver.Po"; \
else rm -f ".deps/posixver.Tpo"; exit 1; \
fi
In file included from /usr/include/fortify/stdlib.h:33,
from posixver.c:28:
/usr/include/fortify/unistd.h:75:1: error: 'getgroups' undeclared here (not in a function); did you mean 'setgroups'?
75 | _FORTIFY_FN(getgroups) int getgroups(int __l, gid_t * _FORTIFY_POS0 __s)
| ^~~~~~~~~~~
In file included from posixver.c:34:
/usr/include/fortify/unistd.h: In function 'getgroups':
/usr/include/fortify/unistd.h:81:16: error: called object '__orig_getgroups' is not a function or function pointer
81 | return __orig_getgroups(__l, __s);
| ^~~~~~~~~~~~~~~~
/usr/include/fortify/unistd.h:75:1: note: declared here
75 | _FORTIFY_FN(getgroups) int getgroups(int __l, gid_t * _FORTIFY_POS0 __s)
| ^~~~~~~~~~~
make[3]: *** [Makefile:590: posixver.o] Error 1
make[3]: Leaving directory '/home/peter/coreutils-5.0/lib'
make[2]: *** [Makefile:414: all] Error 2
make[2]: Leaving directory '/home/peter/coreutils-5.0/lib'
make[1]: *** [Makefile:244: all-recursive] Error 1
make[1]: Leaving directory '/home/peter/coreutils-5.0'
make: *** [Makefile:199: all] Error 2
Show reasoning
Addressing Compilation Issues
I'm zeroing in on the make failure, and the fortified headers are the likely culprit. Time to test the waters and see if I can successfully disable fortification during compilation. The -D_FORTIFY_SOURCE=2 flag has got to go!
Diagnosing Header Interference
I've pinpointed the issue. The getgroups error in posixver.c stems from fortified headers, and I will try to directly edit the file to comment or remove problematic includes. This approach bypasses the need to alter the compilation flags and any related configure options directly, as suggested. First, I will inspect the content of posixver.c.
[empty output]
Show reasoning
Debugging the Compilation
I'm troubleshooting a compilation error. The 'make' command stumbled on getgroups and _FORTIFY_FN. It seems a potential issue with the interaction between fortify and coreutils, though the cat command did not show the relevant lines in posixver.c itself. The investigation continues.
Pinpointing the Conflict
I've been analyzing the error more closely. It appears fortify might be conflicting with getgroups, a system call. Given the Alpine Linux environment and the nature of coreutils, directly disabling fortify is undesirable. I'm focusing on finding and removing any conflicting definitions of getgroups within the posixver.c file, or possibly in any included headers. The previous attempts with sed proved useful, so I will refine my search, focusing on the getgroups function calls or declarations which may cause the issues.
Investigating Header Inclusion
I'm now focused on the header files included by posixver.c, since the direct cat inspection of posixver.c didn't show anything relevant. My thought is that a fortify header, maybe /usr/include/fortify/unistd.h, is causing the conflict. I'll refine the compilation flags to either avoid that include or correctly handle _FORTIFY_FN within it.
Examining the Include Path
I'm now concentrating on the specific include path and declarations. The errors pinpoint /usr/include/fortify/unistd.h, and the declaration issues. It seems the fortify header either doesn't see getgroups or redefines it in a way that's causing conflicts with coreutils. I am going to try to determine where getgroups gets declared or defined within the source directory and how the fortify header path interacts. Then, I'll look at potential solutions, such as adjusting include order or, as a last resort, tweaking the compilation flags.
Refining Compilation Flags
I'm now trying to directly address the getgroups issue by experimenting with compilation flags. The error messages are very specific. I've tried -U_FORTIFY_SOURCE, as suggested, but I'm also considering other flags to control header inclusion or preprocessor definitions. The goal is to either prevent the fortify header from interfering, or to ensure getgroups is declared correctly before fortify's wrapping attempts.
Determining the Root Cause
I'm now working on why the configure script might be missing the HAVE_DECL_GETGROUPS definition. It seems the environment, Alpine Linux, could have subtle incompatibilities with coreutils's autoconf scripts. I plan to examine the config.log from a previous build, looking for clues about getgroups detection and whether any of the checks failed, which might give hints. The issue seems to be how coreutils tries to detect getgroups.
Examining config.h
I'm now investigating the config.h file to check whether the configure script correctly detected the presence of getgroups. Based on the errors, it appears that HAVE_DECL_GETGROUPS is not defined, causing a declaration conflict with the fortify header, specifically when the posixver.c file includes unistd.h. I'm looking to verify that configure correctly identified getgroups.
compile-bench> cd /home/peter/coreutils-5.0 && make CFLAGS="-U_FORTIFY_SOURCE" make all-recursive
make[1]: Entering directory '/home/peter/coreutils-5.0'
Making all in lib
make[2]: Entering directory '/home/peter/coreutils-5.0/lib'
make all-am
make[3]: Entering directory '/home/peter/coreutils-5.0/lib'
if gcc -DLIBDIR=\"/home/peter/result/lib\" -DHAVE_CONFIG_H -I. -I. -I.. -I.. -I. -U_FORTIFY_SOURCE -MT posixver.o -MD -MP -MF ".deps/posixver.Tpo" \
-c -o posixver.o `test -f 'posixver.c' || echo './'`posixver.c; \
then mv ".deps/posixver.Tpo" ".deps/posixver.Po"; \
else rm -f ".deps/posixver.Tpo"; exit 1; \
fi
if gcc -DLIBDIR=\"/home/peter/result/lib\" -DHAVE_CONFIG_H -I. -I. -I.. -I.. -I. -U_FORTIFY_SOURCE -MT strftime.o -MD -MP -MF ".deps/strftime.Tpo" \
-c -o strftime.o `test -f 'strftime.c' || echo './'`strftime.c; \
then mv ".deps/strftime.Tpo" ".deps/strftime.Po"; \
else rm -f ".deps/strftime.Tpo"; exit 1; \
fi
strftime.c: In function 'nstrftime':
strftime.c:258:32: warning: 'memset' specified size 18446744073709551614 exceeds maximum object size 9223372036854775807 [ttps://gcc.gnu.org/onlinedocs/gcc-14.2.0/gcc/Warning-Options.html#index-Wno-stringop-overflow-Wstringop-overflow=]8;;]
258 | # define memset_zero(P, Len) (memset ((P), '0', (Len)), (P) += (Len))
| ^~~~~~~~~~~~~~~~~~~~~~~~
strftime.c:275:17: note: in expansion of macro 'memset_zero'
275 | memset_zero (p, _delta); \
| ^~~~~~~~~~~
strftime.c:662:11: note: in expansion of macro 'add'
662 | add (1, *p = *f);
| ^~~
strftime.c:257:33: warning: 'memset' specified size 18446744073709551614 exceeds maximum object size 9223372036854775807 [ttps://gcc.gnu.org/onlinedocs/gcc-14.2.0/gcc/Warning-Options.html#index-Wno-stringop-overflow-Wstringop-overflow=]8;;]
257 | # define memset_space(P, Len) (memset ((P), ' ', (Len)), (P) += (Len))
| ^~~~~~~~~~~~~~~~~~~~~~~~
strftime.c:277:17: note: in expansion of macro 'memset_space'
277 | memset_space (p, _delta); \
| ^~~~~~~~~~~~
strftime.c:662:11: note: in expansion of macro 'add'
662 | add (1, *p = *f);
| ^~~
if gcc -DLIBDIR=\"/home/peter/result/lib\" -DHAVE_CONFIG_H -I. -I. -I.. -I.. -I. -U_FORTIFY_SOURCE -MT getopt.o -MD -MP -MF ".deps/getopt.Tpo" \
-c -o getopt.o `test -f 'getopt.c' || echo './'`getopt.c; \
then mv ".deps/getopt.Tpo" ".deps/getopt.Po"; \
else rm -f ".deps/getopt.Tpo"; exit 1; \
fi
if gcc -DLIBDIR=\"/home/peter/result/lib\" -DHAVE_CONFIG_H -I. -I. -I.. -I.. -I. -U_FORTIFY_SOURCE -MT getopt1.o -MD -MP -MF ".deps/getopt1.Tpo" \
-c -o getopt1.o `test -f 'getopt1.c' || echo './'`getopt1.c; \
then mv ".deps/getopt1.Tpo" ".deps/getopt1.Po"; \
else rm -f ".deps/getopt1.Tpo"; exit 1; \
fi
if gcc -DLIBDIR=\"/home/peter/result/lib\" -DHAVE_CONFIG_H -I. -I. -I.. -
[command output truncated]
. -I.. -I.. -I. -U_FORTIFY_SOURCE -MT mbswidth.o -MD -MP -MF ".deps/mbswidth.Tpo" \
-c -o mbswidth.o `test -f 'mbswidth.c' || echo './'`mbswidth.c; \
then mv ".deps/mbswidth.Tpo" ".deps/mbswidth.Po"; \
else rm -f ".deps/mbswidth.Tpo"; exit 1; \
fi
if gcc -DLIBDIR=\"/home/peter/result/lib\" -DHAVE_CONFIG_H -I. -I. -I.. -I.. -I. -U_FORTIFY_SOURCE -MT md5.o -MD -MP -MF ".deps/md5.Tpo" \
-c -o md5.o `test -f 'md5.c' || echo './'`md5.c; \
then mv ".deps/md5.Tpo" ".deps/md5.Po"; \
else rm -f ".deps/md5.Tpo"; exit 1; \
fi
md5.c: In function 'md5_finish_ctx':
md5.c:129:3: error: implicit declaration of function 'memcpy' [ttps://gcc.gnu.org/onlinedocs/gcc-14.2.0/gcc/Warning-Options.html#index-Wimplicit-function-declaration-Wimplicit-function-declaration]8;;]
129 | memcpy (&ctx->buffer[bytes], fillbuf, pad);
| ^~~~~~
md5.c:40:1: note: include '<string.h>' or provide a declaration of 'memcpy'
39 | #include "unlocked-io.h"
+++ |+#include <string.h>
40 |
md5.c:129:3: warning: incompatible implicit declaration of built-in function 'memcpy' [ttps://gcc.gnu.org/onlinedocs/gcc-14.2.0/gcc/Warning-Options.html#index-Wbuiltin-declaration-mismatch-Wbuiltin-declaration-mismatch]8;;]
129 | memcpy (&ctx->buffer[bytes], fillbuf, pad);
| ^~~~~~
md5.c:129:3: note: include '<string.h>' or provide a declaration of 'memcpy'
md5.c: In function 'md5_process_bytes':
md5.c:246:7: warning: incompatible implicit declaration of built-in function 'memcpy' [ttps://gcc.gnu.org/onlinedocs/gcc-14.2.0/gcc/Warning-Options.html#index-Wbuiltin-declaration-mismatch-Wbuiltin-declaration-mismatch]8;;]
246 | memcpy (&ctx->buffer[left_over], buffer, add);
| ^~~~~~
md5.c:246:7: note: include '<string.h>' or provide a declaration of 'memcpy'
md5.c:277:32: warning: incompatible implicit declaration of built-in function 'memcpy' [ttps://gcc.gnu.org/onlinedocs/gcc-14.2.0/gcc/Warning-Options.html#index-Wbuiltin-declaration-mismatch-Wbuiltin-declaration-mismatch]8;;]
277 | md5_process_block (memcpy (ctx->buffer, buffer, 64), 64, ctx);
| ^~~~~~
md5.c:277:32: note: include '<string.h>' or provide a declaration of 'memcpy'
md5.c:295:7: warning: incompatible implicit declaration of built-in function 'memcpy' [ttps://gcc.gnu.org/onlinedocs/gcc-14.2.0/gcc/Warning-Options.html#index-Wbuiltin-declaration-mismatch-Wbuiltin-declaration-mismatch]8;;]
295 | memcpy (&ctx->buffer[left_over], buffer, len);
| ^~~~~~
md5.c:295:7: note: include '<string.h>' or provide a declaration of 'memcpy'
make[3]: *** [Makefile:590: md5.o] Error 1
make[3]: Leaving directory '/home/peter/coreutils-5.0/lib'
make[2]: *** [Makefile:414: all] Error 2
make[2]: Leaving directory '/home/peter/coreutils-5.0/lib'
make[1]: *** [Makefile:244: all-recursive] Error 1
make[1]: Leaving directory '/home/peter/coreutils-5.0'
make: *** [Makefile:199: all] Error 2
↓ 90 lines
make all-recursive
make[1]: Entering directory '/home/peter/coreutils-5.0'
Making all in lib
make[2]: Entering directory '/home/peter/coreutils-5.0/lib'
make all-am
make[3]: Entering directory '/home/peter/coreutils-5.0/lib'
if gcc -DLIBDIR=\"/home/peter/result/lib\" -DHAVE_CONFIG_H -I. -I. -I.. -I.. -I. -U_FORTIFY_SOURCE -MT posixver.o -MD -MP -MF ".deps/posixver.Tpo" \
-c -o posixver.o `test -f 'posixver.c' || echo './'`posixver.c; \
then mv ".deps/posixver.Tpo" ".deps/posixver.Po"; \
else rm -f ".deps/posixver.Tpo"; exit 1; \
fi
if gcc -DLIBDIR=\"/home/peter/result/lib\" -DHAVE_CONFIG_H -I. -I. -I.. -I.. -I. -U_FORTIFY_SOURCE -MT strftime.o -MD -MP -MF ".deps/strftime.Tpo" \
-c -o strftime.o `test -f 'strftime.c' || echo './'`strftime.c; \
then mv ".deps/strftime.Tpo" ".deps/strftime.Po"; \
else rm -f ".deps/strftime.Tpo"; exit 1; \
fi
strftime.c: In function 'nstrftime':
strftime.c:258:32: warning: 'memset' specified size 18446744073709551614 exceeds maximum object size 9223372036854775807 [ttps://gcc.gnu.org/onlinedocs/gcc-14.2.0/gcc/Warning-Options.html#index-Wno-stringop-overflow-Wstringop-overflow=]8;;]
258 | # define memset_zero(P, Len) (memset ((P), '0', (Len)), (P) += (Len))
| ^~~~~~~~~~~~~~~~~~~~~~~~
strftime.c:275:17: note: in expansion of macro 'memset_zero'
275 | memset_zero (p, _delta); \
| ^~~~~~~~~~~
strftime.c:662:11: note: in expansion of macro 'add'
662 | add (1, *p = *f);
| ^~~
strftime.c:257:33: warning: 'memset' specified size 18446744073709551614 exceeds maximum object size 9223372036854775807 [ttps://gcc.gnu.org/onlinedocs/gcc-14.2.0/gcc/Warning-Options.html#index-Wno-stringop-overflow-Wstringop-overflow=]8;;]
257 | # define memset_space(P, Len) (memset ((P), ' ', (Len)), (P) += (Len))
| ^~~~~~~~~~~~~~~~~~~~~~~~
strftime.c:277:17: note: in expansion of macro 'memset_space'
277 | memset_space (p, _delta); \
| ^~~~~~~~~~~~
strftime.c:662:11: note: in expansion of macro 'add'
662 | add (1, *p = *f);
| ^~~
if gcc -DLIBDIR=\"/home/peter/result/lib\" -DHAVE_CONFIG_H -I. -I. -I.. -I.. -I. -U_FORTIFY_SOURCE -MT getopt.o -MD -MP -MF ".deps/getopt.Tpo" \
-c -o getopt.o `test -f 'getopt.c' || echo './'`getopt.c; \
then mv ".deps/getopt.Tpo" ".deps/getopt.Po"; \
else rm -f ".deps/getopt.Tpo"; exit 1; \
fi
if gcc -DLIBDIR=\"/home/peter/result/lib\" -DHAVE_CONFIG_H -I. -I. -I.. -I.. -I. -U_FORTIFY_SOURCE -MT getopt1.o -MD -MP -MF ".deps/getopt1.Tpo" \
-c -o getopt1.o `test -f 'getopt1.c' || echo './'`getopt1.c; \
then mv ".deps/getopt1.Tpo" ".deps/getopt1.Po"; \
else rm -f ".deps/getopt1.Tpo"; exit 1; \
fi
if gcc -DLIBDIR=\"/home/peter/result/lib\" -DHAVE_CONFIG_H -I. -I. -I.. -
[command output truncated]
. -I.. -I.. -I. -U_FORTIFY_SOURCE -MT mbswidth.o -MD -MP -MF ".deps/mbswidth.Tpo" \
-c -o mbswidth.o `test -f 'mbswidth.c' || echo './'`mbswidth.c; \
then mv ".deps/mbswidth.Tpo" ".deps/mbswidth.Po"; \
else rm -f ".deps/mbswidth.Tpo"; exit 1; \
fi
if gcc -DLIBDIR=\"/home/peter/result/lib\" -DHAVE_CONFIG_H -I. -I. -I.. -I.. -I. -U_FORTIFY_SOURCE -MT md5.o -MD -MP -MF ".deps/md5.Tpo" \
-c -o md5.o `test -f 'md5.c' || echo './'`md5.c; \
then mv ".deps/md5.Tpo" ".deps/md5.Po"; \
else rm -f ".deps/md5.Tpo"; exit 1; \
fi
md5.c: In function 'md5_finish_ctx':
md5.c:129:3: error: implicit declaration of function 'memcpy' [ttps://gcc.gnu.org/onlinedocs/gcc-14.2.0/gcc/Warning-Options.html#index-Wimplicit-function-declaration-Wimplicit-function-declaration]8;;]
129 | memcpy (&ctx->buffer[bytes], fillbuf, pad);
| ^~~~~~
md5.c:40:1: note: include '<string.h>' or provide a declaration of 'memcpy'
39 | #include "unlocked-io.h"
+++ |+#include <string.h>
40 |
md5.c:129:3: warning: incompatible implicit declaration of built-in function 'memcpy' [ttps://gcc.gnu.org/onlinedocs/gcc-14.2.0/gcc/Warning-Options.html#index-Wbuiltin-declaration-mismatch-Wbuiltin-declaration-mismatch]8;;]
129 | memcpy (&ctx->buffer[bytes], fillbuf, pad);
| ^~~~~~
md5.c:129:3: note: include '<string.h>' or provide a declaration of 'memcpy'
md5.c: In function 'md5_process_bytes':
md5.c:246:7: warning: incompatible implicit declaration of built-in function 'memcpy' [ttps://gcc.gnu.org/onlinedocs/gcc-14.2.0/gcc/Warning-Options.html#index-Wbuiltin-declaration-mismatch-Wbuiltin-declaration-mismatch]8;;]
246 | memcpy (&ctx->buffer[left_over], buffer, add);
| ^~~~~~
md5.c:246:7: note: include '<string.h>' or provide a declaration of 'memcpy'
md5.c:277:32: warning: incompatible implicit declaration of built-in function 'memcpy' [ttps://gcc.gnu.org/onlinedocs/gcc-14.2.0/gcc/Warning-Options.html#index-Wbuiltin-declaration-mismatch-Wbuiltin-declaration-mismatch]8;;]
277 | md5_process_block (memcpy (ctx->buffer, buffer, 64), 64, ctx);
| ^~~~~~
md5.c:277:32: note: include '<string.h>' or provide a declaration of 'memcpy'
md5.c:295:7: warning: incompatible implicit declaration of built-in function 'memcpy' [ttps://gcc.gnu.org/onlinedocs/gcc-14.2.0/gcc/Warning-Options.html#index-Wbuiltin-declaration-mismatch-Wbuiltin-declaration-mismatch]8;;]
295 | memcpy (&ctx->buffer[left_over], buffer, len);
| ^~~~~~
md5.c:295:7: note: include '<string.h>' or provide a declaration of 'memcpy'
make[3]: *** [Makefile:590: md5.o] Error 1
make[3]: Leaving directory '/home/peter/coreutils-5.0/lib'
make[2]: *** [Makefile:414: all] Error 2
make[2]: Leaving directory '/home/peter/coreutils-5.0/lib'
make[1]: *** [Makefile:244: all-recursive] Error 1
make[1]: Leaving directory '/home/peter/coreutils-5.0'
make: *** [Makefile:199: all] Error 2
Show reasoning
Troubleshooting Compilation Failures
I've addressed the memcpy compilation error by adding #include to md5.c and will attempt to compile once more. Next, I will incorporate #include into sha1.c for thoroughness.
Resolving Further Dependencies
I've added #include to md5.c and am ready to retry the compilation. Anticipating similar issues, I'm proactively including in sha1.c, sha256.c, and sha512.c to prevent future memcpy errors during compilation. This should improve overall compilation time.
[empty output]
Show reasoning
Re-Evaluating Build Status
I've extracted the coreutils.tar.gz file. I've just fixed md5.c. Now, I'll execute make again to check for more compilation errors, aiming to get the coreutils ready for the user's install, including setting up the necessary symlinks.
Addressing Compilation Obstacles
I've just fixed md5.c by adding the necessary #include . I'll now re-run make CFLAGS="-U_FORTIFY_SOURCE" to ensure the compilation process proceeds smoothly and that no more compilation errors emerge, especially those related to the previous _FORTIFY_SOURCE flag or other undeclared functions.
compile-bench> cd /home/peter/coreutils-5.0 && make CFLAGS="-U_FORTIFY_SOURCE" make all-recursive
make[1]: Entering directory '/home/peter/coreutils-5.0'
Making all in lib
make[2]: Entering directory '/home/peter/coreutils-5.0/lib'
make all-am
make[3]: Entering directory '/home/peter/coreutils-5.0/lib'
if gcc -DLIBDIR=\"/home/peter/result/lib\" -DHAVE_CONFIG_H -I. -I. -I.. -I.. -I. -U_FORTIFY_SOURCE -MT md5.o -MD -MP -MF ".deps/md5.Tpo" \
-c -o md5.o `test -f 'md5.c' || echo './'`md5.c; \
then mv ".deps/md5.Tpo" ".deps/md5.Po"; \
else rm -f ".deps/md5.Tpo"; exit 1; \
fi
if gcc -DLIBDIR=\"/home/peter/result/lib\" -DHAVE_CONFIG_H -I. -I. -I.. -I.. -I. -U_FORTIFY_SOURCE -MT memcasecmp.o -MD -MP -MF ".deps/memcasecmp.Tpo" \
-c -o memcasecmp.o `test -f 'memcasecmp.c' || echo './'`memcasecmp.c; \
then mv ".deps/memcasecmp.Tpo" ".deps/memcasecmp.Po"; \
else rm -f ".deps/memcasecmp.Tpo"; exit 1; \
fi
if gcc -DLIBDIR=\"/home/peter/result/lib\" -DHAVE_CONFIG_H -I. -I. -I.. -I.. -I. -U_FORTIFY_SOURCE -MT memcoll.o -MD -MP -MF ".deps/memcoll.Tpo" \
-c -o memcoll.o `test -f 'memcoll.c' || echo './'`memcoll.c; \
then mv ".deps/memcoll.Tpo" ".deps/memcoll.Po"; \
else rm -f ".deps/memcoll.Tpo"; exit 1; \
fi
if gcc -DLIBDIR=\"/home/peter/result/lib\" -DHAVE_CONFIG_H -I. -I. -I.. -I.. -I. -U_FORTIFY_SOURCE -MT modechange.o -MD -MP -MF ".deps/modechange.Tpo" \
-c -o modechange.o `test -f 'modechange.c' || echo './'`modechange.c; \
then mv ".deps/modechange.Tpo" ".deps/modechange.Po"; \
else rm -f ".deps/modechange.Tpo"; exit 1; \
fi
modechange.c:38:7: warning: conflicting types for built-in function 'malloc'; expected 'void *(long unsigned int)' [ttps://gcc.gnu.org/onlinedocs/gcc-14.2.0/gcc/Warning-Options.html#index-Wbuiltin-declaration-mismatch-Wbuiltin-declaration-mismatch]8;;]
38 | char *malloc ();
| ^~~~~~
modechange.c:34:1: note: 'malloc' is declared in header '<stdlib.h>'
33 | #include "xstrtol.h"
+++ |+#include <stdlib.h>
34 |
modechange.c: In function 'mode_free':
modechange.c:478:7: error: implicit declaration of function 'free' [ttps://gcc.gnu.org/onlinedocs/gcc-14.2.0/gcc/Warning-Options.html#index-Wimplicit-function-declaration-Wimplicit-function-declaration]8;;]
478 | free (changes);
| ^~~~
modechange.c:478:7: note: include '<stdlib.h>' or provide a declaration of 'free'
modechange.c:478:7: warning: incompatible implicit declaration of built-in function 'free' [ttps://gcc.gnu.org/onlinedocs/gcc-14.2.0/gcc/Warning-Options.html#index-Wbuiltin-declaration-mismatch-Wbuiltin-declaration-mismatch]8;;]
modechange.c:478:7: note: include '<stdlib.h>' or provide a declaration of 'free'
make[3]: *** [Makefile:590: modechange.o] Error 1
make[3]: Leaving directory '/home/peter/coreutils-5.0/lib'
make[2]: *** [Makefile:414: all] Error 2
make[2]: Leaving directory '/home/peter/coreutils-5.0/lib'
make[1]: *** [Makefile:244: all-recursive] Error 1
make[1]: Leaving directory '/home/peter/coreutils-5.0'
make: *** [Makefile:199: all] Error 2
↓ 48 lines
make all-recursive
make[1]: Entering directory '/home/peter/coreutils-5.0'
Making all in lib
make[2]: Entering directory '/home/peter/coreutils-5.0/lib'
make all-am
make[3]: Entering directory '/home/peter/coreutils-5.0/lib'
if gcc -DLIBDIR=\"/home/peter/result/lib\" -DHAVE_CONFIG_H -I. -I. -I.. -I.. -I. -U_FORTIFY_SOURCE -MT md5.o -MD -MP -MF ".deps/md5.Tpo" \
-c -o md5.o `test -f 'md5.c' || echo './'`md5.c; \
then mv ".deps/md5.Tpo" ".deps/md5.Po"; \
else rm -f ".deps/md5.Tpo"; exit 1; \
fi
if gcc -DLIBDIR=\"/home/peter/result/lib\" -DHAVE_CONFIG_H -I. -I. -I.. -I.. -I. -U_FORTIFY_SOURCE -MT memcasecmp.o -MD -MP -MF ".deps/memcasecmp.Tpo" \
-c -o memcasecmp.o `test -f 'memcasecmp.c' || echo './'`memcasecmp.c; \
then mv ".deps/memcasecmp.Tpo" ".deps/memcasecmp.Po"; \
else rm -f ".deps/memcasecmp.Tpo"; exit 1; \
fi
if gcc -DLIBDIR=\"/home/peter/result/lib\" -DHAVE_CONFIG_H -I. -I. -I.. -I.. -I. -U_FORTIFY_SOURCE -MT memcoll.o -MD -MP -MF ".deps/memcoll.Tpo" \
-c -o memcoll.o `test -f 'memcoll.c' || echo './'`memcoll.c; \
then mv ".deps/memcoll.Tpo" ".deps/memcoll.Po"; \
else rm -f ".deps/memcoll.Tpo"; exit 1; \
fi
if gcc -DLIBDIR=\"/home/peter/result/lib\" -DHAVE_CONFIG_H -I. -I. -I.. -I.. -I. -U_FORTIFY_SOURCE -MT modechange.o -MD -MP -MF ".deps/modechange.Tpo" \
-c -o modechange.o `test -f 'modechange.c' || echo './'`modechange.c; \
then mv ".deps/modechange.Tpo" ".deps/modechange.Po"; \
else rm -f ".deps/modechange.Tpo"; exit 1; \
fi
modechange.c:38:7: warning: conflicting types for built-in function 'malloc'; expected 'void *(long unsigned int)' [ttps://gcc.gnu.org/onlinedocs/gcc-14.2.0/gcc/Warning-Options.html#index-Wbuiltin-declaration-mismatch-Wbuiltin-declaration-mismatch]8;;]
38 | char *malloc ();
| ^~~~~~
modechange.c:34:1: note: 'malloc' is declared in header '<stdlib.h>'
33 | #include "xstrtol.h"
+++ |+#include <stdlib.h>
34 |
modechange.c: In function 'mode_free':
modechange.c:478:7: error: implicit declaration of function 'free' [ttps://gcc.gnu.org/onlinedocs/gcc-14.2.0/gcc/Warning-Options.html#index-Wimplicit-function-declaration-Wimplicit-function-declaration]8;;]
478 | free (changes);
| ^~~~
modechange.c:478:7: note: include '<stdlib.h>' or provide a declaration of 'free'
modechange.c:478:7: warning: incompatible implicit declaration of built-in function 'free' [ttps://gcc.gnu.org/onlinedocs/gcc-14.2.0/gcc/Warning-Options.html#index-Wbuiltin-declaration-mismatch-Wbuiltin-declaration-mismatch]8;;]
modechange.c:478:7: note: include '<stdlib.h>' or provide a declaration of 'free'
make[3]: *** [Makefile:590: modechange.o] Error 1
make[3]: Leaving directory '/home/peter/coreutils-5.0/lib'
make[2]: *** [Makefile:414: all] Error 2
make[2]: Leaving directory '/home/peter/coreutils-5.0/lib'
make[1]: *** [Makefile:244: all-recursive] Error 1
make[1]: Leaving directory '/home/peter/coreutils-5.0'
make: *** [Makefile:199: all] Error 2
Show reasoning
Debugging the Compilation
I've identified the compilation error: missing declarations for free and malloc. The fix is straightforward: include in modechange.c. I'm now confident the build will succeed after this simple addition.
[empty output]
[empty output]
Show reasoning
Examining Compilation Errors
I'm currently analyzing the make command's failure. The compiler's output is highlighting a type conflict with malloc. Specifically, there's a warning about a conflicting declaration in modechange.c that's worth further investigation to pinpoint the root cause.
Diagnosing the Conflicts
I've reviewed the compiler's output again. The conflicting malloc declaration is still present, even with included. My next step is to comment out the explicit char *malloc(); declaration in modechange.c, aiming to let the standard library's version take precedence. I also plan to retry the make command using the CFLAGS="-U_FORTIFY_SOURCE" flag, hoping this will help.
compile-bench> cd /home/peter/coreutils-5.0 && make CFLAGS="-U_FORTIFY_SOURCE" make all-recursive
make[1]: Entering directory '/home/peter/coreutils-5.0'
Making all in lib
make[2]: Entering directory '/home/peter/coreutils-5.0/lib'
make all-am
make[3]: Entering directory '/home/peter/coreutils-5.0/lib'
if gcc -DLIBDIR=\"/home/peter/result/lib\" -DHAVE_CONFIG_H -I. -I. -I.. -I.. -I. -U_FORTIFY_SOURCE -MT modechange.o -MD -MP -MF ".deps/modechange.Tpo" \
-c -o modechange.o `test -f 'modechange.c' || echo './'`modechange.c; \
then mv ".deps/modechange.Tpo" ".deps/modechange.Po"; \
else rm -f ".deps/modechange.Tpo"; exit 1; \
fi
if gcc -DLIBDIR=\"/home/peter/result/lib\" -DHAVE_CONFIG_H -I. -I. -I.. -I.. -I. -U_FORTIFY_SOURCE -MT offtostr.o -MD -MP -MF ".deps/offtostr.Tpo" \
-c -o offtostr.o `test -f 'offtostr.c' || echo './'`offtostr.c; \
then mv ".deps/offtostr.Tpo" ".deps/offtostr.Po"; \
else rm -f ".deps/offtostr.Tpo"; exit 1; \
fi
if gcc -DLIBDIR=\"/home/peter/result/lib\" -DHAVE_CONFIG_H -I. -I. -I.. -I.. -I. -U_FORTIFY_SOURCE -MT path-concat.o -MD -MP -MF ".deps/path-concat.Tpo" \
-c -o path-concat.o `test -f 'path-concat.c' || echo './'`path-concat.c; \
then mv ".deps/path-concat.Tpo" ".deps/path-concat.Po"; \
else rm -f ".deps/path-concat.Tpo"; exit 1; \
fi
if gcc -DLIBDIR=\"/home/peter/result/lib\" -DHAVE_CONFIG_H -I. -I. -I.. -I.. -I. -U_FORTIFY_SOURCE -MT physmem.o -MD -MP -MF ".deps/physmem.Tpo" \
-c -o physmem.o `test -f 'physmem.c' || echo './'`physmem.c; \
then mv ".deps/physmem.Tpo" ".deps/physmem.Po"; \
else rm -f ".deps/physmem.Tpo"; exit 1; \
fi
if gcc -DLIBDIR=\"/home/peter/result/lib\" -DHAVE_CONFIG_H -I. -I. -I.. -I.. -I. -U_FORTIFY_SOURCE -MT quote.o -MD -MP -MF ".deps/quote.Tpo" \
-c -o quote.o `test -f 'quote.c' || echo './'`quote.c; \
then mv ".deps/quote.Tpo" ".deps/quote.Po"; \
else rm -f ".deps/quote.Tpo"; exit 1; \
fi
if gcc -DLIBDIR=\"/home/peter/result/lib\" -DHAVE_CONFIG_H -I. -I. -I.. -I.. -I. -U_FORTIFY_SOURCE -MT quotearg.o -MD -MP -MF ".deps/quotearg.Tpo" \
-c -o quotearg.o `test -f 'quotearg.c' || echo './'`quotearg.c; \
then mv ".deps/quotearg.Tpo" ".deps/quotearg.Po"; \
else rm -f ".deps/quotearg.Tpo"; exit 1; \
fi
if gcc -DLIBDIR=\"/home/peter/result/lib\" -DHAVE_CONFIG_H -I. -I. -I.. -I.. -I. -U_FORTIFY_SOURCE -MT readtokens.o -MD -MP -MF ".deps/readtokens.Tpo" \
-c -o readtokens.o `test -f 'readtokens.c' || echo './'`readtokens.c; \
then mv ".deps/readtokens.Tpo" ".deps/readtokens.Po"; \
else rm -f ".deps/readtokens.Tpo"; exit 1; \
fi
readtokens.c: In function 'readtoken':
readtokens.c:92:5: error: implicit declaration of function 'abort' [ttps://gcc.gnu.org/onlinedocs/gcc-14.2.0/gcc/Warning-Options.html#index-Wimplicit-function-declaration-Wimplicit-function-declaration]8;;]
92 | abort ();
| ^~~~~
readtokens.c:54:1: note: include '<stdlib.h>' or provide a declaration of 'abort'
53 | #include "xalloc.h"
+++ |+#include <stdlib.h>
54 |
readtokens.c:92:5: warning: incompatible implicit declaration of built-in function 'abort' [ttps://gcc.gnu.org/onlinedocs/gcc-14.2.0/gcc/Warning-Options.html#index-Wbuiltin-declaration-mismatch-Wbuiltin-declaration-mismatch]8;;]
92 | abort ();
| ^~~~~
readtokens.c:92:5: note: include '<stdlib.h>' or provide a declaration of 'abort'
readtokens.c: In function 'readtokens':
readtokens.c:216:3: error: implicit declaration of function 'free' [ttps://gcc.gnu.org/onlinedocs/gcc-14.2.0/gcc/Warning-Options.html#index-Wimplicit-function-declaration-Wimplicit-function-declaration]8;;]
216 | free (token->buffer);
| ^~~~
readtokens.c:216:3: note: include '<stdlib.h>' or provide a declaration of 'free'
readtokens.c:216:3: warning: incompatible implicit declaration of built-in function 'free' [ttps://gcc.gnu.org/onlinedocs/gcc-14.2.0/gcc/Warning-Options.html#index-Wbuiltin-declaration-mismatch-Wbuiltin-declaration-mismatch]8;;]
readtokens.c:216:3: note: include '<stdlib.h>' or provide a declaration of 'free'
make[3]: *** [Makefile:590: readtokens.o] Error 1
make[3]: Leaving directory '/home/peter/coreutils-5.0/lib'
make[2]: *** [Makefile:414: all] Error 2
make[2]: Leaving directory '/home/peter/coreutils-5.0/lib'
make[1]: *** [Makefile:244: all-recursive] Error 1
make[1]: Leaving directory '/home/peter/coreutils-5.0'
make: *** [Makefile:199: all] Error 2
↓ 68 lines
make all-recursive
make[1]: Entering directory '/home/peter/coreutils-5.0'
Making all in lib
make[2]: Entering directory '/home/peter/coreutils-5.0/lib'
make all-am
make[3]: Entering directory '/home/peter/coreutils-5.0/lib'
if gcc -DLIBDIR=\"/home/peter/result/lib\" -DHAVE_CONFIG_H -I. -I. -I.. -I.. -I. -U_FORTIFY_SOURCE -MT modechange.o -MD -MP -MF ".deps/modechange.Tpo" \
-c -o modechange.o `test -f 'modechange.c' || echo './'`modechange.c; \
then mv ".deps/modechange.Tpo" ".deps/modechange.Po"; \
else rm -f ".deps/modechange.Tpo"; exit 1; \
fi
if gcc -DLIBDIR=\"/home/peter/result/lib\" -DHAVE_CONFIG_H -I. -I. -I.. -I.. -I. -U_FORTIFY_SOURCE -MT offtostr.o -MD -MP -MF ".deps/offtostr.Tpo" \
-c -o offtostr.o `test -f 'offtostr.c' || echo './'`offtostr.c; \
then mv ".deps/offtostr.Tpo" ".deps/offtostr.Po"; \
else rm -f ".deps/offtostr.Tpo"; exit 1; \
fi
if gcc -DLIBDIR=\"/home/peter/result/lib\" -DHAVE_CONFIG_H -I. -I. -I.. -I.. -I. -U_FORTIFY_SOURCE -MT path-concat.o -MD -MP -MF ".deps/path-concat.Tpo" \
-c -o path-concat.o `test -f 'path-concat.c' || echo './'`path-concat.c; \
then mv ".deps/path-concat.Tpo" ".deps/path-concat.Po"; \
else rm -f ".deps/path-concat.Tpo"; exit 1; \
fi
if gcc -DLIBDIR=\"/home/peter/result/lib\" -DHAVE_CONFIG_H -I. -I. -I.. -I.. -I. -U_FORTIFY_SOURCE -MT physmem.o -MD -MP -MF ".deps/physmem.Tpo" \
-c -o physmem.o `test -f 'physmem.c' || echo './'`physmem.c; \
then mv ".deps/physmem.Tpo" ".deps/physmem.Po"; \
else rm -f ".deps/physmem.Tpo"; exit 1; \
fi
if gcc -DLIBDIR=\"/home/peter/result/lib\" -DHAVE_CONFIG_H -I. -I. -I.. -I.. -I. -U_FORTIFY_SOURCE -MT quote.o -MD -MP -MF ".deps/quote.Tpo" \
-c -o quote.o `test -f 'quote.c' || echo './'`quote.c; \
then mv ".deps/quote.Tpo" ".deps/quote.Po"; \
else rm -f ".deps/quote.Tpo"; exit 1; \
fi
if gcc -DLIBDIR=\"/home/peter/result/lib\" -DHAVE_CONFIG_H -I. -I. -I.. -I.. -I. -U_FORTIFY_SOURCE -MT quotearg.o -MD -MP -MF ".deps/quotearg.Tpo" \
-c -o quotearg.o `test -f 'quotearg.c' || echo './'`quotearg.c; \
then mv ".deps/quotearg.Tpo" ".deps/quotearg.Po"; \
else rm -f ".deps/quotearg.Tpo"; exit 1; \
fi
if gcc -DLIBDIR=\"/home/peter/result/lib\" -DHAVE_CONFIG_H -I. -I. -I.. -I.. -I. -U_FORTIFY_SOURCE -MT readtokens.o -MD -MP -MF ".deps/readtokens.Tpo" \
-c -o readtokens.o `test -f 'readtokens.c' || echo './'`readtokens.c; \
then mv ".deps/readtokens.Tpo" ".deps/readtokens.Po"; \
else rm -f ".deps/readtokens.Tpo"; exit 1; \
fi
readtokens.c: In function 'readtoken':
readtokens.c:92:5: error: implicit declaration of function 'abort' [ttps://gcc.gnu.org/onlinedocs/gcc-14.2.0/gcc/Warning-Options.html#index-Wimplicit-function-declaration-Wimplicit-function-declaration]8;;]
92 | abort ();
| ^~~~~
readtokens.c:54:1: note: include '<stdlib.h>' or provide a declaration of 'abort'
53 | #include "xalloc.h"
+++ |+#include <stdlib.h>
54 |
readtokens.c:92:5: warning: incompatible implicit declaration of built-in function 'abort' [ttps://gcc.gnu.org/onlinedocs/gcc-14.2.0/gcc/Warning-Options.html#index-Wbuiltin-declaration-mismatch-Wbuiltin-declaration-mismatch]8;;]
92 | abort ();
| ^~~~~
readtokens.c:92:5: note: include '<stdlib.h>' or provide a declaration of 'abort'
readtokens.c: In function 'readtokens':
readtokens.c:216:3: error: implicit declaration of function 'free' [ttps://gcc.gnu.org/onlinedocs/gcc-14.2.0/gcc/Warning-Options.html#index-Wimplicit-function-declaration-Wimplicit-function-declaration]8;;]
216 | free (token->buffer);
| ^~~~
readtokens.c:216:3: note: include '<stdlib.h>' or provide a declaration of 'free'
readtokens.c:216:3: warning: incompatible implicit declaration of built-in function 'free' [ttps://gcc.gnu.org/onlinedocs/gcc-14.2.0/gcc/Warning-Options.html#index-Wbuiltin-declaration-mismatch-Wbuiltin-declaration-mismatch]8;;]
readtokens.c:216:3: note: include '<stdlib.h>' or provide a declaration of 'free'
make[3]: *** [Makefile:590: readtokens.o] Error 1
make[3]: Leaving directory '/home/peter/coreutils-5.0/lib'
make[2]: *** [Makefile:414: all] Error 2
make[2]: Leaving directory '/home/peter/coreutils-5.0/lib'
make[1]: *** [Makefile:244: all-recursive] Error 1
make[1]: Leaving directory '/home/peter/coreutils-5.0'
make: *** [Makefile:199: all] Error 2
Show reasoning
Fixing the compilation failure
I'm encountering another compilation snag. This time, the compiler's choking on implicit declarations of abort and free within readtokens.c. A quick review shows those functions are defined in stdlib.h. I believe the simple solution here is to add an include statement at the top of the file.
[empty output]
compile-bench> cd /home/peter/coreutils-5.0 && make CFLAGS="-U_FORTIFY_SOURCE" make all-recursive
make[1]: Entering directory '/home/peter/coreutils-5.0'
Making all in lib
make[2]: Entering directory '/home/peter/coreutils-5.0/lib'
make all-am
make[3]: Entering directory '/home/peter/coreutils-5.0/lib'
if gcc -DLIBDIR=\"/home/peter/result/lib\" -DHAVE_CONFIG_H -I. -I. -I.. -I.. -I. -U_FORTIFY_SOURCE -MT readtokens.o -MD -MP -MF ".deps/readtokens.Tpo" \
-c -o readtokens.o `test -f 'readtokens.c' || echo './'`readtokens.c; \
then mv ".deps/readtokens.Tpo" ".deps/readtokens.Po"; \
else rm -f ".deps/readtokens.Tpo"; exit 1; \
fi
if gcc -DLIBDIR=\"/home/peter/result/lib\" -DHAVE_CONFIG_H -I. -I. -I.. -I.. -I. -U_FORTIFY_SOURCE -MT safe-read.o -MD -MP -MF ".deps/safe-read.Tpo" \
-c -o safe-read.o `test -f 'safe-read.c' || echo './'`safe-read.c; \
then mv ".deps/safe-read.Tpo" ".deps/safe-read.Po"; \
else rm -f ".deps/safe-read.Tpo"; exit 1; \
fi
if gcc -DLIBDIR=\"/home/peter/result/lib\" -DHAVE_CONFIG_H -I. -I. -I.. -I.. -I. -U_FORTIFY_SOURCE -MT safe-write.o -MD -MP -MF ".deps/safe-write.Tpo" \
-c -o safe-write.o `test -f 'safe-write.c' || echo './'`safe-write.c; \
then mv ".deps/safe-write.Tpo" ".deps/safe-write.Po"; \
else rm -f ".deps/safe-write.Tpo"; exit 1; \
fi
if gcc -DLIBDIR=\"/home/peter/result/lib\" -DHAVE_CONFIG_H -I. -I. -I.. -I.. -I. -U_FORTIFY_SOURCE -MT same.o -MD -MP -MF ".deps/same.Tpo" \
-c -o same.o `test -f 'same.c' || echo './'`same.c; \
then mv ".deps/same.Tpo" ".deps/same.Po"; \
else rm -f ".deps/same.Tpo"; exit 1; \
fi
if gcc -DLIBDIR=\"/home/peter/result/lib\" -DHAVE_CONFIG_H -I. -I. -I.. -I.. -I. -U_FORTIFY_SOURCE -MT save-cwd.o -MD -MP -MF ".deps/save-cwd.Tpo" \
-c -o save-cwd.o `test -f 'save-cwd.c' || echo './'`save-cwd.c; \
then mv ".deps/save-cwd.Tpo" ".deps/save-cwd.Po"; \
else rm -f ".deps/save-cwd.Tpo"; exit 1; \
fi
save-cwd.c: In function 'free_cwd':
save-cwd.c:145:5: error: implicit declaration of function 'free' [ttps://gcc.gnu.org/onlinedocs/gcc-14.2.0/gcc/Warning-Options.html#index-Wimplicit-function-declaration-Wimplicit-function-declaration]8;;]
145 | free (cwd->name);
| ^~~~
save-cwd.c:52:1: note: include '<stdlib.h>' or provide a declaration of 'free'
51 | #include "xgetcwd.h"
+++ |+#include <stdlib.h>
52 |
save-cwd.c:145:5: warning: incompatible implicit declaration of built-in function 'free' [ttps://gcc.gnu.org/onlinedocs/gcc-14.2.0/gcc/Warning-Options.html#index-Wbuiltin-declaration-mismatch-Wbuiltin-declaration-mismatch]8;;]
145 | free (cwd->name);
| ^~~~
save-cwd.c:145:5: note: include '<stdlib.h>' or provide a declaration of 'free'
make[3]: *** [Makefile:590: save-cwd.o] Error 1
make[3]: Leaving directory '/home/peter/coreutils-5.0/lib'
make[2]: *** [Makefile:414: all] Error 2
make[2]: Leaving directory '/home/peter/coreutils-5.0/lib'
make[1]: *** [Makefile:244: all-recursive] Error 1
make[1]: Leaving directory '/home/peter/coreutils-5.0'
make: *** [Makefile:199: all] Error 2
↓ 51 lines
make all-recursive
make[1]: Entering directory '/home/peter/coreutils-5.0'
Making all in lib
make[2]: Entering directory '/home/peter/coreutils-5.0/lib'
make all-am
make[3]: Entering directory '/home/peter/coreutils-5.0/lib'
if gcc -DLIBDIR=\"/home/peter/result/lib\" -DHAVE_CONFIG_H -I. -I. -I.. -I.. -I. -U_FORTIFY_SOURCE -MT readtokens.o -MD -MP -MF ".deps/readtokens.Tpo" \
-c -o readtokens.o `test -f 'readtokens.c' || echo './'`readtokens.c; \
then mv ".deps/readtokens.Tpo" ".deps/readtokens.Po"; \
else rm -f ".deps/readtokens.Tpo"; exit 1; \
fi
if gcc -DLIBDIR=\"/home/peter/result/lib\" -DHAVE_CONFIG_H -I. -I. -I.. -I.. -I. -U_FORTIFY_SOURCE -MT safe-read.o -MD -MP -MF ".deps/safe-read.Tpo" \
-c -o safe-read.o `test -f 'safe-read.c' || echo './'`safe-read.c; \
then mv ".deps/safe-read.Tpo" ".deps/safe-read.Po"; \
else rm -f ".deps/safe-read.Tpo"; exit 1; \
fi
if gcc -DLIBDIR=\"/home/peter/result/lib\" -DHAVE_CONFIG_H -I. -I. -I.. -I.. -I. -U_FORTIFY_SOURCE -MT safe-write.o -MD -MP -MF ".deps/safe-write.Tpo" \
-c -o safe-write.o `test -f 'safe-write.c' || echo './'`safe-write.c; \
then mv ".deps/safe-write.Tpo" ".deps/safe-write.Po"; \
else rm -f ".deps/safe-write.Tpo"; exit 1; \
fi
if gcc -DLIBDIR=\"/home/peter/result/lib\" -DHAVE_CONFIG_H -I. -I. -I.. -I.. -I. -U_FORTIFY_SOURCE -MT same.o -MD -MP -MF ".deps/same.Tpo" \
-c -o same.o `test -f 'same.c' || echo './'`same.c; \
then mv ".deps/same.Tpo" ".deps/same.Po"; \
else rm -f ".deps/same.Tpo"; exit 1; \
fi
if gcc -DLIBDIR=\"/home/peter/result/lib\" -DHAVE_CONFIG_H -I. -I. -I.. -I.. -I. -U_FORTIFY_SOURCE -MT save-cwd.o -MD -MP -MF ".deps/save-cwd.Tpo" \
-c -o save-cwd.o `test -f 'save-cwd.c' || echo './'`save-cwd.c; \
then mv ".deps/save-cwd.Tpo" ".deps/save-cwd.Po"; \
else rm -f ".deps/save-cwd.Tpo"; exit 1; \
fi
save-cwd.c: In function 'free_cwd':
save-cwd.c:145:5: error: implicit declaration of function 'free' [ttps://gcc.gnu.org/onlinedocs/gcc-14.2.0/gcc/Warning-Options.html#index-Wimplicit-function-declaration-Wimplicit-function-declaration]8;;]
145 | free (cwd->name);
| ^~~~
save-cwd.c:52:1: note: include '<stdlib.h>' or provide a declaration of 'free'
51 | #include "xgetcwd.h"
+++ |+#include <stdlib.h>
52 |
save-cwd.c:145:5: warning: incompatible implicit declaration of built-in function 'free' [ttps://gcc.gnu.org/onlinedocs/gcc-14.2.0/gcc/Warning-Options.html#index-Wbuiltin-declaration-mismatch-Wbuiltin-declaration-mismatch]8;;]
145 | free (cwd->name);
| ^~~~
save-cwd.c:145:5: note: include '<stdlib.h>' or provide a declaration of 'free'
make[3]: *** [Makefile:590: save-cwd.o] Error 1
make[3]: Leaving directory '/home/peter/coreutils-5.0/lib'
make[2]: *** [Makefile:414: all] Error 2
make[2]: Leaving directory '/home/peter/coreutils-5.0/lib'
make[1]: *** [Makefile:244: all-recursive] Error 1
make[1]: Leaving directory '/home/peter/coreutils-5.0'
make: *** [Makefile:199: all] Error 2
Show reasoning
Troubleshooting Compilation Failure
I've identified a compilation error stemming from save-cwd.o. It seems the compiler is missing a declaration for free. The fix is straightforward: I need to add #include to the save-cwd.c source file.
[empty output]
Show reasoning
Troubleshooting the Build
I've successfully extracted the coreutils tarball and kicked off the configure process. Initially, the make command threw a few errors. One, a duplicate 'unsigned' in ino_t, was swiftly squashed by removing the duplicate from config.h. Now wrestling with the next error, but I'm on it.
Resolving Build Errors
I've just run the make command again, fingers crossed! I addressed a flurry of implicit declarations, including malloc, free, and abort, by strategically adding to several source files. The memcpy issue in lib/md5.c was easily fixed by including . Hoping this clears the path for a successful build now.
compile-bench> cd /home/peter/coreutils-5.0 && make CFLAGS="-U_FORTIFY_SOURCE" make all-recursive
make[1]: Entering directory '/home/peter/coreutils-5.0'
Making all in lib
make[2]: Entering directory '/home/peter/coreutils-5.0/lib'
make all-am
make[3]: Entering directory '/home/peter/coreutils-5.0/lib'
if gcc -DLIBDIR=\"/home/peter/result/lib\" -DHAVE_CONFIG_H -I. -I. -I.. -I.. -I. -U_FORTIFY_SOURCE -MT save-cwd.o -MD -MP -MF ".deps/save-cwd.Tpo" \
-c -o save-cwd.o `test -f 'save-cwd.c' || echo './'`save-cwd.c; \
then mv ".deps/save-cwd.Tpo" ".deps/save-cwd.Po"; \
else rm -f ".deps/save-cwd.Tpo"; exit 1; \
fi
if gcc -DLIBDIR=\"/home/peter/result/lib\" -DHAVE_CONFIG_H -I. -I. -I.. -I.. -I. -U_FORTIFY_SOURCE -MT savedir.o -MD -MP -MF ".deps/savedir.Tpo" \
-c -o savedir.o `test -f 'savedir.c' || echo './'`savedir.c; \
then mv ".deps/savedir.Tpo" ".deps/savedir.Po"; \
else rm -f ".deps/savedir.Tpo"; exit 1; \
fi
savedir.c: In function 'savedir':
savedir.c:99:31: error: implicit declaration of function 'strlen' [ttps://gcc.gnu.org/onlinedocs/gcc-14.2.0/gcc/Warning-Options.html#index-Wimplicit-function-declaration-Wimplicit-function-declaration]8;;]
99 | size_t entry_size = strlen (entry) + 1;
| ^~~~~~
savedir.c:65:1: note: include '<string.h>' or provide a declaration of 'strlen'
64 | #include "xalloc.h"
+++ |+#include <string.h>
65 |
savedir.c:99:31: warning: incompatible implicit declaration of built-in function 'strlen' [ttps://gcc.gnu.org/onlinedocs/gcc-14.2.0/gcc/Warning-Options.html#index-Wbuiltin-declaration-mismatch-Wbuiltin-declaration-mismatch]8;;]
99 | size_t entry_size = strlen (entry) + 1;
| ^~~~~~
savedir.c:99:31: note: include '<string.h>' or provide a declaration of 'strlen'
savedir.c:114:11: error: implicit declaration of function 'memcpy' [ttps://gcc.gnu.org/onlinedocs/gcc-14.2.0/gcc/Warning-Options.html#index-Wimplicit-function-declaration-Wimplicit-function-declaration]8;;]
114 | memcpy (name_space + used, entry, entry_size);
| ^~~~~~
savedir.c:114:11: note: include '<string.h>' or provide a declaration of 'memcpy'
savedir.c:114:11: warning: incompatible implicit declaration of built-in function 'memcpy' [ttps://gcc.gnu.org/onlinedocs/gcc-14.2.0/gcc/Warning-Options.html#index-Wbuiltin-declaration-mismatch-Wbuiltin-declaration-mismatch]8;;]
savedir.c:114:11: note: include '<string.h>' or provide a declaration of 'memcpy'
savedir.c:124:7: error: implicit declaration of function 'free' [ttps://gcc.gnu.org/onlinedocs/gcc-14.2.0/gcc/Warning-Options.html#index-Wimplicit-function-declaration-Wimplicit-function-declaration]8;;]
124 | free (name_space);
| ^~~~
savedir.c:65:1: note: include '<stdlib.h>' or provide a declaration of 'free'
64 | #include "xalloc.h"
+++ |+#include <stdlib.h>
65 |
savedir.c:124:7: warning: incompatible implicit declaration of built-in function 'free' [ttps://gcc.gnu.org/onlinedocs/gcc-14.2.0/gcc/Warning-Options.html#index-Wbuiltin-declaration-mismatch-Wbuiltin-declaration-mismatch]8;;]
124 | free (name_space);
| ^~~~
savedir.c:124:7: note: include '<stdlib.h>' or provide a declaration of 'free'
make[3]: *** [Makefile:590: savedir.o] Error 1
make[3]: Leaving directory '/home/peter/coreutils-5.0/lib'
make[2]: *** [Makefile:414: all] Error 2
make[2]: Leaving directory '/home/peter/coreutils-5.0/lib'
make[1]: *** [Makefile:244: all-recursive] Error 1
make[1]: Leaving directory '/home/peter/coreutils-5.0'
make: *** [Makefile:199: all] Error 2
↓ 53 lines
make all-recursive
make[1]: Entering directory '/home/peter/coreutils-5.0'
Making all in lib
make[2]: Entering directory '/home/peter/coreutils-5.0/lib'
make all-am
make[3]: Entering directory '/home/peter/coreutils-5.0/lib'
if gcc -DLIBDIR=\"/home/peter/result/lib\" -DHAVE_CONFIG_H -I. -I. -I.. -I.. -I. -U_FORTIFY_SOURCE -MT save-cwd.o -MD -MP -MF ".deps/save-cwd.Tpo" \
-c -o save-cwd.o `test -f 'save-cwd.c' || echo './'`save-cwd.c; \
then mv ".deps/save-cwd.Tpo" ".deps/save-cwd.Po"; \
else rm -f ".deps/save-cwd.Tpo"; exit 1; \
fi
if gcc -DLIBDIR=\"/home/peter/result/lib\" -DHAVE_CONFIG_H -I. -I. -I.. -I.. -I. -U_FORTIFY_SOURCE -MT savedir.o -MD -MP -MF ".deps/savedir.Tpo" \
-c -o savedir.o `test -f 'savedir.c' || echo './'`savedir.c; \
then mv ".deps/savedir.Tpo" ".deps/savedir.Po"; \
else rm -f ".deps/savedir.Tpo"; exit 1; \
fi
savedir.c: In function 'savedir':
savedir.c:99:31: error: implicit declaration of function 'strlen' [ttps://gcc.gnu.org/onlinedocs/gcc-14.2.0/gcc/Warning-Options.html#index-Wimplicit-function-declaration-Wimplicit-function-declaration]8;;]
99 | size_t entry_size = strlen (entry) + 1;
| ^~~~~~
savedir.c:65:1: note: include '<string.h>' or provide a declaration of 'strlen'
64 | #include "xalloc.h"
+++ |+#include <string.h>
65 |
savedir.c:99:31: warning: incompatible implicit declaration of built-in function 'strlen' [ttps://gcc.gnu.org/onlinedocs/gcc-14.2.0/gcc/Warning-Options.html#index-Wbuiltin-declaration-mismatch-Wbuiltin-declaration-mismatch]8;;]
99 | size_t entry_size = strlen (entry) + 1;
| ^~~~~~
savedir.c:99:31: note: include '<string.h>' or provide a declaration of 'strlen'
savedir.c:114:11: error: implicit declaration of function 'memcpy' [ttps://gcc.gnu.org/onlinedocs/gcc-14.2.0/gcc/Warning-Options.html#index-Wimplicit-function-declaration-Wimplicit-function-declaration]8;;]
114 | memcpy (name_space + used, entry, entry_size);
| ^~~~~~
savedir.c:114:11: note: include '<string.h>' or provide a declaration of 'memcpy'
savedir.c:114:11: warning: incompatible implicit declaration of built-in function 'memcpy' [ttps://gcc.gnu.org/onlinedocs/gcc-14.2.0/gcc/Warning-Options.html#index-Wbuiltin-declaration-mismatch-Wbuiltin-declaration-mismatch]8;;]
savedir.c:114:11: note: include '<string.h>' or provide a declaration of 'memcpy'
savedir.c:124:7: error: implicit declaration of function 'free' [ttps://gcc.gnu.org/onlinedocs/gcc-14.2.0/gcc/Warning-Options.html#index-Wimplicit-function-declaration-Wimplicit-function-declaration]8;;]
124 | free (name_space);
| ^~~~
savedir.c:65:1: note: include '<stdlib.h>' or provide a declaration of 'free'
64 | #include "xalloc.h"
+++ |+#include <stdlib.h>
65 |
savedir.c:124:7: warning: incompatible implicit declaration of built-in function 'free' [ttps://gcc.gnu.org/onlinedocs/gcc-14.2.0/gcc/Warning-Options.html#index-Wbuiltin-declaration-mismatch-Wbuiltin-declaration-mismatch]8;;]
124 | free (name_space);
| ^~~~
savedir.c:124:7: note: include '<stdlib.h>' or provide a declaration of 'free'
make[3]: *** [Makefile:590: savedir.o] Error 1
make[3]: Leaving directory '/home/peter/coreutils-5.0/lib'
make[2]: *** [Makefile:414: all] Error 2
make[2]: Leaving directory '/home/peter/coreutils-5.0/lib'
make[1]: *** [Makefile:244: all-recursive] Error 1
make[1]: Leaving directory '/home/peter/coreutils-5.0'
make: *** [Makefile:199: all] Error 2
Show reasoning
Resolving Build Errors
I've identified the root cause of the build failure: missing standard library includes in lib/savedir.c. Specifically, I need to add #include for strlen and memcpy, and #include for free. This should resolve the linking issues and allow the make command to complete successfully.
[empty output]
Show reasoning
Troubleshooting Compilation Failures
I've just fixed the previous build failure. I added the necessary #include to include strlen and memcpy. I also included #include to resolve the undeclared function free. I'm hoping this batch of changes clears the path for a successful build now.
Implementing Header File Changes
I've successfully integrated the header file modifications. Specifically, I've incorporated #include and #include into lib/savedir.c. The compilation errors for strlen, memcpy, and free should now be resolved. Next, I will attempt to rebuild and verify the changes.
[empty output]
Show reasoning
Troubleshooting Compilation Errors
\n\n
I'm tackling the lib/savedir.c errors now. It looks like some include files are missing. I'm going to check the dependencies, then I'll attempt to add the necessary include paths, and finally, run the make command again, hopefully resolving the issue.
Diagnosing Header Issues
\n\n
I've implemented the header fixes, adding the string and stdlib includes to lib/savedir.c. I'm preparing to re-run the make command now, but first I'll include the CFLAGS flag as I noticed a potential compiler issue during the initial compilation, attempting to resolve the fortify source warnings. Fingers crossed this resolves the lib/savedir.c errors, and the compilation proceeds further.
[empty output]
Show reasoning
Resolving Build Errors
I've addressed the build failures. Turns out, I had forgotten to include the necessary header files in lib/savedir.c. Adding and should resolve the undeclared function errors. Time to re-attempt the build!
Attempting Compilation Again
I've added the missing includes in lib/savedir.c: for strlen and memcpy, and to find free. The previous attempt failed due to undeclared functions. Now I'll re-run make and hope this fixes the compiler errors.
compile-bench> cd /home/peter/coreutils-5.0 && make CFLAGS="-U_FORTIFY_SOURCE" make all-recursive
make[1]: Entering directory '/home/peter/coreutils-5.0'
Making all in lib
make[2]: Entering directory '/home/peter/coreutils-5.0/lib'
make all-am
make[3]: Entering directory '/home/peter/coreutils-5.0/lib'
if gcc -DLIBDIR=\"/home/peter/result/lib\" -DHAVE_CONFIG_H -I. -I. -I.. -I.. -I. -U_FORTIFY_SOURCE -MT savedir.o -MD -MP -MF ".deps/savedir.Tpo" \
-c -o savedir.o `test -f 'savedir.c' || echo './'`savedir.c; \
then mv ".deps/savedir.Tpo" ".deps/savedir.Po"; \
else rm -f ".deps/savedir.Tpo"; exit 1; \
fi
if gcc -DLIBDIR=\"/home/peter/result/lib\" -DHAVE_CONFIG_H -I. -I. -I.. -I.. -I. -U_FORTIFY_SOURCE -MT settime.o -MD -MP -MF ".deps/settime.Tpo" \
-c -o settime.o `test -f 'settime.c' || echo './'`settime.c; \
then mv ".deps/settime.Tpo" ".deps/settime.Po"; \
else rm -f ".deps/settime.Tpo"; exit 1; \
fi
if gcc -DLIBDIR=\"/home/peter/result/lib\" -DHAVE_CONFIG_H -I. -I. -I.. -I.. -I. -U_FORTIFY_SOURCE -MT sha.o -MD -MP -MF ".deps/sha.Tpo" \
-c -o sha.o `test -f 'sha.c' || echo './'`sha.c; \
then mv ".deps/sha.Tpo" ".deps/sha.Po"; \
else rm -f ".deps/sha.Tpo"; exit 1; \
fi
sha.c: In function 'sha_finish_ctx':
sha.c:109:3: error: implicit declaration of function 'memcpy' [ttps://gcc.gnu.org/onlinedocs/gcc-14.2.0/gcc/Warning-Options.html#index-Wimplicit-function-declaration-Wimplicit-function-declaration]8;;]
109 | memcpy (&ctx->buffer[bytes], fillbuf, pad);
| ^~~~~~
sha.c:28:1: note: include '<string.h>' or provide a declaration of 'memcpy'
27 | #include "unlocked-io.h"
+++ |+#include <string.h>
28 |
sha.c:109:3: warning: incompatible implicit declaration of built-in function 'memcpy' [ttps://gcc.gnu.org/onlinedocs/gcc-14.2.0/gcc/Warning-Options.html#index-Wbuiltin-declaration-mismatch-Wbuiltin-declaration-mismatch]8;;]
109 | memcpy (&ctx->buffer[bytes], fillbuf, pad);
| ^~~~~~
sha.c:109:3: note: include '<string.h>' or provide a declaration of 'memcpy'
sha.c: In function 'sha_process_bytes':
sha.c:217:7: warning: incompatible implicit declaration of built-in function 'memcpy' [ttps://gcc.gnu.org/onlinedocs/gcc-14.2.0/gcc/Warning-Options.html#index-Wbuiltin-declaration-mismatch-Wbuiltin-declaration-mismatch]8;;]
217 | memcpy (&ctx->buffer[left_over], buffer, add);
| ^~~~~~
sha.c:217:7: note: include '<string.h>' or provide a declaration of 'memcpy'
sha.c:248:32: warning: incompatible implicit declaration of built-in function 'memcpy' [ttps://gcc.gnu.org/onlinedocs/gcc-14.2.0/gcc/Warning-Options.html#index-Wbuiltin-declaration-mismatch-Wbuiltin-declaration-mismatch]8;;]
248 | sha_process_block (memcpy (ctx->buffer, buffer, 64), 64, ctx);
| ^~~~~~
sha.c:248:32: note: include '<string.h>' or provide a declaration of 'memcpy'
sha.c:266:7: warning: incompatible implicit declaration of built-in function 'memcpy' [ttps://gcc.gnu.org/onlinedocs/gcc-14.2.0/gcc/Warning-Options.html#index-Wbuiltin-declaration-mismatch-Wbuiltin-declaration-mismatch]8;;]
266 | memcpy (&ctx->buffer[left_over], buffer, len);
| ^~~~~~
sha.c:266:7: note: include '<string.h>' or provide a declaration of 'memcpy'
make[3]: *** [Makefile:590: sha.o] Error 1
make[3]: Leaving directory '/home/peter/coreutils-5.0/lib'
make[2]: *** [Makefile:414: all] Error 2
make[2]: Leaving directory '/home/peter/coreutils-5.0/lib'
make[1]: *** [Makefile:244: all-recursive] Error 1
make[1]: Leaving directory '/home/peter/coreutils-5.0'
make: *** [Makefile:199: all] Error 2
↓ 54 lines
make all-recursive
make[1]: Entering directory '/home/peter/coreutils-5.0'
Making all in lib
make[2]: Entering directory '/home/peter/coreutils-5.0/lib'
make all-am
make[3]: Entering directory '/home/peter/coreutils-5.0/lib'
if gcc -DLIBDIR=\"/home/peter/result/lib\" -DHAVE_CONFIG_H -I. -I. -I.. -I.. -I. -U_FORTIFY_SOURCE -MT savedir.o -MD -MP -MF ".deps/savedir.Tpo" \
-c -o savedir.o `test -f 'savedir.c' || echo './'`savedir.c; \
then mv ".deps/savedir.Tpo" ".deps/savedir.Po"; \
else rm -f ".deps/savedir.Tpo"; exit 1; \
fi
if gcc -DLIBDIR=\"/home/peter/result/lib\" -DHAVE_CONFIG_H -I. -I. -I.. -I.. -I. -U_FORTIFY_SOURCE -MT settime.o -MD -MP -MF ".deps/settime.Tpo" \
-c -o settime.o `test -f 'settime.c' || echo './'`settime.c; \
then mv ".deps/settime.Tpo" ".deps/settime.Po"; \
else rm -f ".deps/settime.Tpo"; exit 1; \
fi
if gcc -DLIBDIR=\"/home/peter/result/lib\" -DHAVE_CONFIG_H -I. -I. -I.. -I.. -I. -U_FORTIFY_SOURCE -MT sha.o -MD -MP -MF ".deps/sha.Tpo" \
-c -o sha.o `test -f 'sha.c' || echo './'`sha.c; \
then mv ".deps/sha.Tpo" ".deps/sha.Po"; \
else rm -f ".deps/sha.Tpo"; exit 1; \
fi
sha.c: In function 'sha_finish_ctx':
sha.c:109:3: error: implicit declaration of function 'memcpy' [ttps://gcc.gnu.org/onlinedocs/gcc-14.2.0/gcc/Warning-Options.html#index-Wimplicit-function-declaration-Wimplicit-function-declaration]8;;]
109 | memcpy (&ctx->buffer[bytes], fillbuf, pad);
| ^~~~~~
sha.c:28:1: note: include '<string.h>' or provide a declaration of 'memcpy'
27 | #include "unlocked-io.h"
+++ |+#include <string.h>
28 |
sha.c:109:3: warning: incompatible implicit declaration of built-in function 'memcpy' [ttps://gcc.gnu.org/onlinedocs/gcc-14.2.0/gcc/Warning-Options.html#index-Wbuiltin-declaration-mismatch-Wbuiltin-declaration-mismatch]8;;]
109 | memcpy (&ctx->buffer[bytes], fillbuf, pad);
| ^~~~~~
sha.c:109:3: note: include '<string.h>' or provide a declaration of 'memcpy'
sha.c: In function 'sha_process_bytes':
sha.c:217:7: warning: incompatible implicit declaration of built-in function 'memcpy' [ttps://gcc.gnu.org/onlinedocs/gcc-14.2.0/gcc/Warning-Options.html#index-Wbuiltin-declaration-mismatch-Wbuiltin-declaration-mismatch]8;;]
217 | memcpy (&ctx->buffer[left_over], buffer, add);
| ^~~~~~
sha.c:217:7: note: include '<string.h>' or provide a declaration of 'memcpy'
sha.c:248:32: warning: incompatible implicit declaration of built-in function 'memcpy' [ttps://gcc.gnu.org/onlinedocs/gcc-14.2.0/gcc/Warning-Options.html#index-Wbuiltin-declaration-mismatch-Wbuiltin-declaration-mismatch]8;;]
248 | sha_process_block (memcpy (ctx->buffer, buffer, 64), 64, ctx);
| ^~~~~~
sha.c:248:32: note: include '<string.h>' or provide a declaration of 'memcpy'
sha.c:266:7: warning: incompatible implicit declaration of built-in function 'memcpy' [ttps://gcc.gnu.org/onlinedocs/gcc-14.2.0/gcc/Warning-Options.html#index-Wbuiltin-declaration-mismatch-Wbuiltin-declaration-mismatch]8;;]
266 | memcpy (&ctx->buffer[left_over], buffer, len);
| ^~~~~~
sha.c:266:7: note: include '<string.h>' or provide a declaration of 'memcpy'
make[3]: *** [Makefile:590: sha.o] Error 1
make[3]: Leaving directory '/home/peter/coreutils-5.0/lib'
make[2]: *** [Makefile:414: all] Error 2
make[2]: Leaving directory '/home/peter/coreutils-5.0/lib'
make[1]: *** [Makefile:244: all-recursive] Error 1
make[1]: Leaving directory '/home/peter/coreutils-5.0'
make: *** [Makefile:199: all] Error 2
Show reasoning
Considering Compilation Errors
I'm now focused on the sha.o compilation errors. Remembering similar past issues, and the successful resolution via , I'm confident that including this header will fix the memcpy problem. I'll apply this fix immediately.
[empty output]
compile-bench> cd /home/peter/coreutils-5.0 && make CFLAGS="-U_FORTIFY_SOURCE" make all-recursive
make[1]: Entering directory '/home/peter/coreutils-5.0'
Making all in lib
make[2]: Entering directory '/home/peter/coreutils-5.0/lib'
make all-am
make[3]: Entering directory '/home/peter/coreutils-5.0/lib'
if gcc -DLIBDIR=\"/home/peter/result/lib\" -DHAVE_CONFIG_H -I. -I. -I.. -I.. -I. -U_FORTIFY_SOURCE -MT sha.o -MD -MP -MF ".deps/sha.Tpo" \
-c -o sha.o `test -f 'sha.c' || echo './'`sha.c; \
then mv ".deps/sha.Tpo" ".deps/sha.Po"; \
else rm -f ".deps/sha.Tpo"; exit 1; \
fi
if gcc -DLIBDIR=\"/home/peter/result/lib\" -DHAVE_CONFIG_H -I. -I. -I.. -I.. -I. -U_FORTIFY_SOURCE -MT stripslash.o -MD -MP -MF ".deps/stripslash.Tpo" \
-c -o stripslash.o `test -f 'stripslash.c' || echo './'`stripslash.c; \
then mv ".deps/stripslash.Tpo" ".deps/stripslash.Po"; \
else rm -f ".deps/stripslash.Tpo"; exit 1; \
fi
if gcc -DLIBDIR=\"/home/peter/result/lib\" -DHAVE_CONFIG_H -I. -I. -I.. -I.. -I. -U_FORTIFY_SOURCE -MT umaxtostr.o -MD -MP -MF ".deps/umaxtostr.Tpo" \
-c -o umaxtostr.o `test -f 'umaxtostr.c' || echo './'`umaxtostr.c; \
then mv ".deps/umaxtostr.Tpo" ".deps/umaxtostr.Po"; \
else rm -f ".deps/umaxtostr.Tpo"; exit 1; \
fi
if gcc -DLIBDIR=\"/home/peter/result/lib\" -DHAVE_CONFIG_H -I. -I. -I.. -I.. -I. -U_FORTIFY_SOURCE -MT unicodeio.o -MD -MP -MF ".deps/unicodeio.Tpo" \
-c -o unicodeio.o `test -f 'unicodeio.c' || echo './'`unicodeio.c; \
then mv ".deps/unicodeio.Tpo" ".deps/unicodeio.Po"; \
else rm -f ".deps/unicodeio.Tpo"; exit 1; \
fi
if gcc -DLIBDIR=\"/home/peter/result/lib\" -DHAVE_CONFIG_H -I. -I. -I.. -I.. -I. -U_FORTIFY_SOURCE -MT userspec.o -MD -MP -MF ".deps/userspec.Tpo" \
-c -o userspec.o `test -f 'userspec.c' || echo './'`userspec.c; \
then mv ".deps/userspec.Tpo" ".deps/userspec.Po"; \
else rm -f ".deps/userspec.Tpo"; exit 1; \
fi
userspec.c: In function 'parse_user_spec':
userspec.c:332:19: error: implicit declaration of function 'free' [ttps://gcc.gnu.org/onlinedocs/gcc-14.2.0/gcc/Warning-Options.html#index-Wimplicit-function-declaration-Wimplicit-function-declaration]8;;]
332 | free (*username_arg);
| ^~~~
userspec.c:72:1: note: include '<stdlib.h>' or provide a declaration of 'free'
71 | #include "gettext.h"
+++ |+#include <stdlib.h>
72 | #define _(msgid) gettext (msgid)
userspec.c:332:19: warning: incompatible implicit declaration of built-in function 'free' [ttps://gcc.gnu.org/onlinedocs/gcc-14.2.0/gcc/Warning-Options.html#index-Wbuiltin-declaration-mismatch-Wbuiltin-declaration-mismatch]8;;]
332 | free (*username_arg);
| ^~~~
userspec.c:332:19: note: include '<stdlib.h>' or provide a declaration of 'free'
make[3]: *** [Makefile:590: userspec.o] Error 1
make[3]: Leaving directory '/home/peter/coreutils-5.0/lib'
make[2]: *** [Makefile:414: all] Error 2
make[2]: Leaving directory '/home/peter/coreutils-5.0/lib'
make[1]: *** [Makefile:244: all-recursive] Error 1
make[1]: Leaving directory '/home/peter/coreutils-5.0'
make: *** [Makefile:199: all] Error 2
↓ 51 lines
make all-recursive
make[1]: Entering directory '/home/peter/coreutils-5.0'
Making all in lib
make[2]: Entering directory '/home/peter/coreutils-5.0/lib'
make all-am
make[3]: Entering directory '/home/peter/coreutils-5.0/lib'
if gcc -DLIBDIR=\"/home/peter/result/lib\" -DHAVE_CONFIG_H -I. -I. -I.. -I.. -I. -U_FORTIFY_SOURCE -MT sha.o -MD -MP -MF ".deps/sha.Tpo" \
-c -o sha.o `test -f 'sha.c' || echo './'`sha.c; \
then mv ".deps/sha.Tpo" ".deps/sha.Po"; \
else rm -f ".deps/sha.Tpo"; exit 1; \
fi
if gcc -DLIBDIR=\"/home/peter/result/lib\" -DHAVE_CONFIG_H -I. -I. -I.. -I.. -I. -U_FORTIFY_SOURCE -MT stripslash.o -MD -MP -MF ".deps/stripslash.Tpo" \
-c -o stripslash.o `test -f 'stripslash.c' || echo './'`stripslash.c; \
then mv ".deps/stripslash.Tpo" ".deps/stripslash.Po"; \
else rm -f ".deps/stripslash.Tpo"; exit 1; \
fi
if gcc -DLIBDIR=\"/home/peter/result/lib\" -DHAVE_CONFIG_H -I. -I. -I.. -I.. -I. -U_FORTIFY_SOURCE -MT umaxtostr.o -MD -MP -MF ".deps/umaxtostr.Tpo" \
-c -o umaxtostr.o `test -f 'umaxtostr.c' || echo './'`umaxtostr.c; \
then mv ".deps/umaxtostr.Tpo" ".deps/umaxtostr.Po"; \
else rm -f ".deps/umaxtostr.Tpo"; exit 1; \
fi
if gcc -DLIBDIR=\"/home/peter/result/lib\" -DHAVE_CONFIG_H -I. -I. -I.. -I.. -I. -U_FORTIFY_SOURCE -MT unicodeio.o -MD -MP -MF ".deps/unicodeio.Tpo" \
-c -o unicodeio.o `test -f 'unicodeio.c' || echo './'`unicodeio.c; \
then mv ".deps/unicodeio.Tpo" ".deps/unicodeio.Po"; \
else rm -f ".deps/unicodeio.Tpo"; exit 1; \
fi
if gcc -DLIBDIR=\"/home/peter/result/lib\" -DHAVE_CONFIG_H -I. -I. -I.. -I.. -I. -U_FORTIFY_SOURCE -MT userspec.o -MD -MP -MF ".deps/userspec.Tpo" \
-c -o userspec.o `test -f 'userspec.c' || echo './'`userspec.c; \
then mv ".deps/userspec.Tpo" ".deps/userspec.Po"; \
else rm -f ".deps/userspec.Tpo"; exit 1; \
fi
userspec.c: In function 'parse_user_spec':
userspec.c:332:19: error: implicit declaration of function 'free' [ttps://gcc.gnu.org/onlinedocs/gcc-14.2.0/gcc/Warning-Options.html#index-Wimplicit-function-declaration-Wimplicit-function-declaration]8;;]
332 | free (*username_arg);
| ^~~~
userspec.c:72:1: note: include '<stdlib.h>' or provide a declaration of 'free'
71 | #include "gettext.h"
+++ |+#include <stdlib.h>
72 | #define _(msgid) gettext (msgid)
userspec.c:332:19: warning: incompatible implicit declaration of built-in function 'free' [ttps://gcc.gnu.org/onlinedocs/gcc-14.2.0/gcc/Warning-Options.html#index-Wbuiltin-declaration-mismatch-Wbuiltin-declaration-mismatch]8;;]
332 | free (*username_arg);
| ^~~~
userspec.c:332:19: note: include '<stdlib.h>' or provide a declaration of 'free'
make[3]: *** [Makefile:590: userspec.o] Error 1
make[3]: Leaving directory '/home/peter/coreutils-5.0/lib'
make[2]: *** [Makefile:414: all] Error 2
make[2]: Leaving directory '/home/peter/coreutils-5.0/lib'
make[1]: *** [Makefile:244: all-recursive] Error 1
make[1]: Leaving directory '/home/peter/coreutils-5.0'
make: *** [Makefile:199: all] Error 2
Show reasoning
Troubleshooting Compilation
I'm still wrestling with compiling coreutils. I'm systematically fixing errors; currently, I'm in userspec.c. The compiler's complaining about an implicit declaration of free. I've identified the need to include which should resolve the issue.
Resolving Header Dependencies
I've successfully included in userspec.c to address the implicit declaration error for free, and the compilation is progressing again. I'm now encountering an issue with ino_t being redefined. It seems the headers included are clashing. Next, I plan on reviewing the included headers to ensure there aren't conflicts, hopefully eliminating the redefinition.
[empty output]
Show reasoning
Analyzing Coreutils Compilation
I've successfully untarred the coreutils source and run configure and make. Now, I'm tackling compilation errors. I've addressed missing header includes for crucial functions such as memcpy, strlen, and free. I've also resolved the duplicate ino_t definitions.
Resuming Coreutils Compilation
I've re-run make after the include fixes. I am now focused on the resulting errors. Further investigation reveals more missing includes and potential conflicts. I've included stdlib.h where necessary and removed the char *malloc(); declaration. I'm debugging the remaining compilation failures.
[empty output]
[empty output]
Show reasoning
Investigating Compilation Errors
I've been focused on the compiler errors, specifically the ones flagged during the make process. The previous output didn't show any problems with long-options.c, so I added to userspec.c, where the error occurred. I'm about to try make again to see if this resolves the issue and moves me forward.
compile-bench> cd /home/peter/coreutils-5.0 && make CFLAGS="-U_FORTIFY_SOURCE" make all-recursive
make[1]: Entering directory '/home/peter/coreutils-5.0'
Making all in lib
make[2]: Entering directory '/home/peter/coreutils-5.0/lib'
make all-am
make[3]: Entering directory '/home/peter/coreutils-5.0/lib'
if gcc -DLIBDIR=\"/home/peter/result/lib\" -DHAVE_CONFIG_H -I. -I. -I.. -I.. -I. -U_FORTIFY_SOURCE -MT long-options.o -MD -MP -MF ".deps/long-options.Tpo" \
-c -o long-options.o `test -f 'long-options.c' || echo './'`long-options.c; \
then mv ".deps/long-options.Tpo" ".deps/long-options.Po"; \
else rm -f ".deps/long-options.Tpo"; exit 1; \
fi
if gcc -DLIBDIR=\"/home/peter/result/lib\" -DHAVE_CONFIG_H -I. -I. -I.. -I.. -I. -U_FORTIFY_SOURCE -MT userspec.o -MD -MP -MF ".deps/userspec.Tpo" \
-c -o userspec.o `test -f 'userspec.c' || echo './'`userspec.c; \
then mv ".deps/userspec.Tpo" ".deps/userspec.Po"; \
else rm -f ".deps/userspec.Tpo"; exit 1; \
fi
if gcc -DLIBDIR=\"/home/peter/result/lib\" -DHAVE_CONFIG_H -I. -I. -I.. -I.. -I. -U_FORTIFY_SOURCE -MT version-etc.o -MD -MP -MF ".deps/version-etc.Tpo" \
-c -o version-etc.o `test -f 'version-etc.c' || echo './'`version-etc.c; \
then mv ".deps/version-etc.Tpo" ".deps/version-etc.Po"; \
else rm -f ".deps/version-etc.Tpo"; exit 1; \
fi
if gcc -DLIBDIR=\"/home/peter/result/lib\" -DHAVE_CONFIG_H -I. -I. -I.. -I.. -I. -U_FORTIFY_SOURCE -MT xgetcwd.o -MD -MP -MF ".deps/xgetcwd.Tpo" \
-c -o xgetcwd.o `test -f 'xgetcwd.c' || echo './'`xgetcwd.c; \
then mv ".deps/xgetcwd.Tpo" ".deps/xgetcwd.Po"; \
else rm -f ".deps/xgetcwd.Tpo"; exit 1; \
fi
if gcc -DLIBDIR=\"/home/peter/result/lib\" -DHAVE_CONFIG_H -I. -I. -I.. -I.. -I. -U_FORTIFY_SOURCE -MT xgethostname.o -MD -MP -MF ".deps/xgethostname.Tpo" \
-c -o xgethostname.o `test -f 'xgethostname.c' || echo './'`xgethostname.c; \
then mv ".deps/xgethostname.Tpo" ".deps/xgethostname.Po"; \
else rm -f ".deps/xgethostname.Tpo"; exit 1; \
fi
if gcc -DLIBDIR=\"/home/peter/result/lib\" -DHAVE_CONFIG_H -I. -I. -I.. -I.. -I. -U_FORTIFY_SOURCE -MT xmalloc.o -MD -MP -MF ".deps/xmalloc.Tpo" \
-c -o xmalloc.o `test -f 'xmalloc.c' || echo './'`xmalloc.c; \
then mv ".deps/xmalloc.Tpo" ".deps/xmalloc.Po"; \
else rm -f ".deps/xmalloc.Tpo"; exit 1; \
fi
xmalloc.c: In function 'xalloc_die':
xmalloc.c:74:3: error: implicit declaration of function 'exit' [ttps://gcc.gnu.org/onlinedocs/gcc-14.2.0/gcc/Warning-Options.html#index-Wimplicit-function-declaration-Wimplicit-function-declaration]8;;]
74 | exit (EXIT_FAILURE);
| ^~~~
xmalloc.c:39:1: note: include '<stdlib.h>' or provide a declaration of 'exit'
38 | #include "xalloc.h"
+++ |+#include <stdlib.h>
39 |
xmalloc.c:74:3: warning: incompatible implicit declaration of built-in function 'exit' [ttps://gcc.gnu.org/onlinedocs/gcc-14.2.0/gcc/Warning-Options.html#index-Wbuiltin-declaration-mismatch-Wbuiltin-declaration-mismatch]8;;]
74 | exit (EXIT_FAILURE);
| ^~~~
xmalloc.c:74:3: note: include '<stdlib.h>' or provide a declaration of 'exit'
make[3]: *** [Makefile:590: xmalloc.o] Error 1
make[3]: Leaving directory '/home/peter/coreutils-5.0/lib'
make[2]: *** [Makefile:414: all] Error 2
make[2]: Leaving directory '/home/peter/coreutils-5.0/lib'
make[1]: *** [Makefile:244: all-recursive] Error 1
make[1]: Leaving directory '/home/peter/coreutils-5.0'
make: *** [Makefile:199: all] Error 2
↓ 56 lines
make all-recursive
make[1]: Entering directory '/home/peter/coreutils-5.0'
Making all in lib
make[2]: Entering directory '/home/peter/coreutils-5.0/lib'
make all-am
make[3]: Entering directory '/home/peter/coreutils-5.0/lib'
if gcc -DLIBDIR=\"/home/peter/result/lib\" -DHAVE_CONFIG_H -I. -I. -I.. -I.. -I. -U_FORTIFY_SOURCE -MT long-options.o -MD -MP -MF ".deps/long-options.Tpo" \
-c -o long-options.o `test -f 'long-options.c' || echo './'`long-options.c; \
then mv ".deps/long-options.Tpo" ".deps/long-options.Po"; \
else rm -f ".deps/long-options.Tpo"; exit 1; \
fi
if gcc -DLIBDIR=\"/home/peter/result/lib\" -DHAVE_CONFIG_H -I. -I. -I.. -I.. -I. -U_FORTIFY_SOURCE -MT userspec.o -MD -MP -MF ".deps/userspec.Tpo" \
-c -o userspec.o `test -f 'userspec.c' || echo './'`userspec.c; \
then mv ".deps/userspec.Tpo" ".deps/userspec.Po"; \
else rm -f ".deps/userspec.Tpo"; exit 1; \
fi
if gcc -DLIBDIR=\"/home/peter/result/lib\" -DHAVE_CONFIG_H -I. -I. -I.. -I.. -I. -U_FORTIFY_SOURCE -MT version-etc.o -MD -MP -MF ".deps/version-etc.Tpo" \
-c -o version-etc.o `test -f 'version-etc.c' || echo './'`version-etc.c; \
then mv ".deps/version-etc.Tpo" ".deps/version-etc.Po"; \
else rm -f ".deps/version-etc.Tpo"; exit 1; \
fi
if gcc -DLIBDIR=\"/home/peter/result/lib\" -DHAVE_CONFIG_H -I. -I. -I.. -I.. -I. -U_FORTIFY_SOURCE -MT xgetcwd.o -MD -MP -MF ".deps/xgetcwd.Tpo" \
-c -o xgetcwd.o `test -f 'xgetcwd.c' || echo './'`xgetcwd.c; \
then mv ".deps/xgetcwd.Tpo" ".deps/xgetcwd.Po"; \
else rm -f ".deps/xgetcwd.Tpo"; exit 1; \
fi
if gcc -DLIBDIR=\"/home/peter/result/lib\" -DHAVE_CONFIG_H -I. -I. -I.. -I.. -I. -U_FORTIFY_SOURCE -MT xgethostname.o -MD -MP -MF ".deps/xgethostname.Tpo" \
-c -o xgethostname.o `test -f 'xgethostname.c' || echo './'`xgethostname.c; \
then mv ".deps/xgethostname.Tpo" ".deps/xgethostname.Po"; \
else rm -f ".deps/xgethostname.Tpo"; exit 1; \
fi
if gcc -DLIBDIR=\"/home/peter/result/lib\" -DHAVE_CONFIG_H -I. -I. -I.. -I.. -I. -U_FORTIFY_SOURCE -MT xmalloc.o -MD -MP -MF ".deps/xmalloc.Tpo" \
-c -o xmalloc.o `test -f 'xmalloc.c' || echo './'`xmalloc.c; \
then mv ".deps/xmalloc.Tpo" ".deps/xmalloc.Po"; \
else rm -f ".deps/xmalloc.Tpo"; exit 1; \
fi
xmalloc.c: In function 'xalloc_die':
xmalloc.c:74:3: error: implicit declaration of function 'exit' [ttps://gcc.gnu.org/onlinedocs/gcc-14.2.0/gcc/Warning-Options.html#index-Wimplicit-function-declaration-Wimplicit-function-declaration]8;;]
74 | exit (EXIT_FAILURE);
| ^~~~
xmalloc.c:39:1: note: include '<stdlib.h>' or provide a declaration of 'exit'
38 | #include "xalloc.h"
+++ |+#include <stdlib.h>
39 |
xmalloc.c:74:3: warning: incompatible implicit declaration of built-in function 'exit' [ttps://gcc.gnu.org/onlinedocs/gcc-14.2.0/gcc/Warning-Options.html#index-Wbuiltin-declaration-mismatch-Wbuiltin-declaration-mismatch]8;;]
74 | exit (EXIT_FAILURE);
| ^~~~
xmalloc.c:74:3: note: include '<stdlib.h>' or provide a declaration of 'exit'
make[3]: *** [Makefile:590: xmalloc.o] Error 1
make[3]: Leaving directory '/home/peter/coreutils-5.0/lib'
make[2]: *** [Makefile:414: all] Error 2
make[2]: Leaving directory '/home/peter/coreutils-5.0/lib'
make[1]: *** [Makefile:244: all-recursive] Error 1
make[1]: Leaving directory '/home/peter/coreutils-5.0'
make: *** [Makefile:199: all] Error 2
Show reasoning
Troubleshooting Compilation Failures
I'm encountering the same persistent compilation error. It appears exit isn't declared, much like before. My working hypothesis is that I need to explicitly include stdlib.h within xmalloc.c. This should resolve the undeclared function issue.
[empty output]
Show reasoning
Analyzing Build Failure
I've just identified a problem in the coreutils-5.0 build process. The make command failed, specifically within xmalloc.c. It looks like there's an implicit declaration error related to exit. I think I need to include in lib/xmalloc.c to resolve this.
[empty output]
Show reasoning
Tackling Compiler Errors
I'm currently focusing on a deluge of compilation errors. The errors point towards missing headers and duplicate definitions, so I'm methodically including and where needed to resolve them. I'm cleaning up implicit declarations of functions like memcpy, strlen, and free.
Resolving Header Conflicts
I've identified that the issue with xmalloc.c stemmed from the incorrect inclusion of stdlib.h. I had already added stdlib.h, but it became clear the file also needed EXIT_FAILURE to be defined within the context of xmalloc.c. A re-run of make confirmed the fix and highlighted further header issues, specifically around ino_t. I must ensure all dependencies are correctly handled.
compile-bench> cd /home/peter/coreutils-5.0 && make CFLAGS="-U_FORTIFY_SOURCE" make all-recursive
make[1]: Entering directory '/home/peter/coreutils-5.0'
Making all in lib
make[2]: Entering directory '/home/peter/coreutils-5.0/lib'
make all-am
make[3]: Entering directory '/home/peter/coreutils-5.0/lib'
if gcc -DLIBDIR=\"/home/peter/result/lib\" -DHAVE_CONFIG_H -I. -I. -I.. -I.. -I. -U_FORTIFY_SOURCE -MT xmalloc.o -MD -MP -MF ".deps/xmalloc.Tpo" \
-c -o xmalloc.o `test -f 'xmalloc.c' || echo './'`xmalloc.c; \
then mv ".deps/xmalloc.Tpo" ".deps/xmalloc.Po"; \
else rm -f ".deps/xmalloc.Tpo"; exit 1; \
fi
if gcc -DLIBDIR=\"/home/peter/result/lib\" -DHAVE_CONFIG_H -I. -I. -I.. -I.. -I. -U_FORTIFY_SOURCE -MT xmemcoll.o -MD -MP -MF ".deps/xmemcoll.Tpo" \
-c -o xmemcoll.o `test -f 'xmemcoll.c' || echo './'`xmemcoll.c; \
then mv ".deps/xmemcoll.Tpo" ".deps/xmemcoll.Po"; \
else rm -f ".deps/xmemcoll.Tpo"; exit 1; \
fi
if gcc -DLIBDIR=\"/home/peter/result/lib\" -DHAVE_CONFIG_H -I. -I. -I.. -I.. -I. -U_FORTIFY_SOURCE -MT xnanosleep.o -MD -MP -MF ".deps/xnanosleep.Tpo" \
-c -o xnanosleep.o `test -f 'xnanosleep.c' || echo './'`xnanosleep.c; \
then mv ".deps/xnanosleep.Tpo" ".deps/xnanosleep.Po"; \
else rm -f ".deps/xnanosleep.Tpo"; exit 1; \
fi
if gcc -DLIBDIR=\"/home/peter/result/lib\" -DHAVE_CONFIG_H -I. -I. -I.. -I.. -I. -U_FORTIFY_SOURCE -MT xreadlink.o -MD -MP -MF ".deps/xreadlink.Tpo" \
-c -o xreadlink.o `test -f 'xreadlink.c' || echo './'`xreadlink.c; \
then mv ".deps/xreadlink.Tpo" ".deps/xreadlink.Po"; \
else rm -f ".deps/xreadlink.Tpo"; exit 1; \
fi
if gcc -DLIBDIR=\"/home/peter/result/lib\" -DHAVE_CONFIG_H -I. -I. -I.. -I.. -I. -U_FORTIFY_SOURCE -MT xstrdup.o -MD -MP -MF ".deps/xstrdup.Tpo" \
-c -o xstrdup.o `test -f 'xstrdup.c' || echo './'`xstrdup.c; \
then mv ".deps/xstrdup.Tpo" ".deps/xstrdup.Po"; \
else rm -f ".deps/xstrdup.Tpo"; exit 1; \
fi
if gcc -DLIBDIR=\"/home/peter/result/lib\" -DHAVE_CONFIG_H -I. -I. -I.. -I.. -I. -U_FORTIFY_SOURCE -MT xstrtod.o -MD -MP -MF ".deps/xstrtod.Tpo" \
-c -o xstrtod.o `test -f 'xstrtod.c' || echo './'`xstrtod.c; \
then mv ".deps/xstrtod.Tpo" ".deps/xstrtod.Po"; \
else rm -f ".deps/xstrtod.Tpo"; exit 1; \
fi
if gcc -DLIBDIR=\"/home/peter/result/lib\" -DHAVE_CONFIG_H -I. -I. -I.. -I.. -I. -U_FORTIFY_SOURCE -MT xstrtol.o -MD -MP -MF ".deps/xstrtol.Tpo" \
-c -o xstrtol.o `test -f 'xstrtol.c' || echo './'`xstrtol.c; \
then mv ".deps/xstrtol.Tpo" ".deps/xstrtol.Po"; \
else rm -f ".deps/xstrtol.Tpo"; exit 1; \
fi
xstrtol.c: In function 'xstrtol':
xstrtol.c:25:19: error: implicit declaration of function 'strtol'; did you mean 'xstrtol'? [ttps://gcc.gnu.org/onlinedocs/gcc-14.2.0/gcc/Warning-Options.html#index-Wimplicit-function-declaration-Wimplicit-function-declaration]8;;]
25 | # define __strtol strtol
| ^~~~~~
xstrtol.c:141:9: note: in expansion of macro '__strtol'
141 | tmp = __strtol (s, p, strtol_base);
| ^~~~~~~~
make[3]: *** [Makefile:590: xstrtol.o] Error 1
make[3]: Leaving directory '/home/peter/coreutils-5.0/lib'
make[2]: *** [Makefile:414: all] Error 2
make[2]: Leaving directory '/home/peter/coreutils-5.0/lib'
make[1]: *** [Makefile:244: all-recursive] Error 1
make[1]: Leaving directory '/home/peter/coreutils-5.0'
make: *** [Makefile:199: all] Error 2
↓ 56 lines
make all-recursive
make[1]: Entering directory '/home/peter/coreutils-5.0'
Making all in lib
make[2]: Entering directory '/home/peter/coreutils-5.0/lib'
make all-am
make[3]: Entering directory '/home/peter/coreutils-5.0/lib'
if gcc -DLIBDIR=\"/home/peter/result/lib\" -DHAVE_CONFIG_H -I. -I. -I.. -I.. -I. -U_FORTIFY_SOURCE -MT xmalloc.o -MD -MP -MF ".deps/xmalloc.Tpo" \
-c -o xmalloc.o `test -f 'xmalloc.c' || echo './'`xmalloc.c; \
then mv ".deps/xmalloc.Tpo" ".deps/xmalloc.Po"; \
else rm -f ".deps/xmalloc.Tpo"; exit 1; \
fi
if gcc -DLIBDIR=\"/home/peter/result/lib\" -DHAVE_CONFIG_H -I. -I. -I.. -I.. -I. -U_FORTIFY_SOURCE -MT xmemcoll.o -MD -MP -MF ".deps/xmemcoll.Tpo" \
-c -o xmemcoll.o `test -f 'xmemcoll.c' || echo './'`xmemcoll.c; \
then mv ".deps/xmemcoll.Tpo" ".deps/xmemcoll.Po"; \
else rm -f ".deps/xmemcoll.Tpo"; exit 1; \
fi
if gcc -DLIBDIR=\"/home/peter/result/lib\" -DHAVE_CONFIG_H -I. -I. -I.. -I.. -I. -U_FORTIFY_SOURCE -MT xnanosleep.o -MD -MP -MF ".deps/xnanosleep.Tpo" \
-c -o xnanosleep.o `test -f 'xnanosleep.c' || echo './'`xnanosleep.c; \
then mv ".deps/xnanosleep.Tpo" ".deps/xnanosleep.Po"; \
else rm -f ".deps/xnanosleep.Tpo"; exit 1; \
fi
if gcc -DLIBDIR=\"/home/peter/result/lib\" -DHAVE_CONFIG_H -I. -I. -I.. -I.. -I. -U_FORTIFY_SOURCE -MT xreadlink.o -MD -MP -MF ".deps/xreadlink.Tpo" \
-c -o xreadlink.o `test -f 'xreadlink.c' || echo './'`xreadlink.c; \
then mv ".deps/xreadlink.Tpo" ".deps/xreadlink.Po"; \
else rm -f ".deps/xreadlink.Tpo"; exit 1; \
fi
if gcc -DLIBDIR=\"/home/peter/result/lib\" -DHAVE_CONFIG_H -I. -I. -I.. -I.. -I. -U_FORTIFY_SOURCE -MT xstrdup.o -MD -MP -MF ".deps/xstrdup.Tpo" \
-c -o xstrdup.o `test -f 'xstrdup.c' || echo './'`xstrdup.c; \
then mv ".deps/xstrdup.Tpo" ".deps/xstrdup.Po"; \
else rm -f ".deps/xstrdup.Tpo"; exit 1; \
fi
if gcc -DLIBDIR=\"/home/peter/result/lib\" -DHAVE_CONFIG_H -I. -I. -I.. -I.. -I. -U_FORTIFY_SOURCE -MT xstrtod.o -MD -MP -MF ".deps/xstrtod.Tpo" \
-c -o xstrtod.o `test -f 'xstrtod.c' || echo './'`xstrtod.c; \
then mv ".deps/xstrtod.Tpo" ".deps/xstrtod.Po"; \
else rm -f ".deps/xstrtod.Tpo"; exit 1; \
fi
if gcc -DLIBDIR=\"/home/peter/result/lib\" -DHAVE_CONFIG_H -I. -I. -I.. -I.. -I. -U_FORTIFY_SOURCE -MT xstrtol.o -MD -MP -MF ".deps/xstrtol.Tpo" \
-c -o xstrtol.o `test -f 'xstrtol.c' || echo './'`xstrtol.c; \
then mv ".deps/xstrtol.Tpo" ".deps/xstrtol.Po"; \
else rm -f ".deps/xstrtol.Tpo"; exit 1; \
fi
xstrtol.c: In function 'xstrtol':
xstrtol.c:25:19: error: implicit declaration of function 'strtol'; did you mean 'xstrtol'? [ttps://gcc.gnu.org/onlinedocs/gcc-14.2.0/gcc/Warning-Options.html#index-Wimplicit-function-declaration-Wimplicit-function-declaration]8;;]
25 | # define __strtol strtol
| ^~~~~~
xstrtol.c:141:9: note: in expansion of macro '__strtol'
141 | tmp = __strtol (s, p, strtol_base);
| ^~~~~~~~
make[3]: *** [Makefile:590: xstrtol.o] Error 1
make[3]: Leaving directory '/home/peter/coreutils-5.0/lib'
make[2]: *** [Makefile:414: all] Error 2
make[2]: Leaving directory '/home/peter/coreutils-5.0/lib'
make[1]: *** [Makefile:244: all-recursive] Error 1
make[1]: Leaving directory '/home/peter/coreutils-5.0'
make: *** [Makefile:199: all] Error 2
Show reasoning
Troubleshooting Compilation Failures
I've hit a snag with xstrtol.c – the compiler's complaining about strtol. Turns out, the header file wasn't included, which caused an implicit declaration. I've added #include to the file to resolve the issue, hoping for a successful compilation this time.
[empty output]
compile-bench> cd /home/peter/coreutils-5.0 && make CFLAGS="-U_FORTIFY_SOURCE" make all-recursive
make[1]: Entering directory '/home/peter/coreutils-5.0'
Making all in lib
make[2]: Entering directory '/home/peter/coreutils-5.0/lib'
make all-am
make[3]: Entering directory '/home/peter/coreutils-5.0/lib'
if gcc -DLIBDIR=\"/home/peter/result/lib\" -DHAVE_CONFIG_H -I. -I. -I.. -I.. -I. -U_FORTIFY_SOURCE -MT xstrtol.o -MD -MP -MF ".deps/xstrtol.Tpo" \
-c -o xstrtol.o `test -f 'xstrtol.c' || echo './'`xstrtol.c; \
then mv ".deps/xstrtol.Tpo" ".deps/xstrtol.Po"; \
else rm -f ".deps/xstrtol.Tpo"; exit 1; \
fi
if gcc -DLIBDIR=\"/home/peter/result/lib\" -DHAVE_CONFIG_H -I. -I. -I.. -I.. -I. -U_FORTIFY_SOURCE -MT xstrtoul.o -MD -MP -MF ".deps/xstrtoul.Tpo" \
-c -o xstrtoul.o `test -f 'xstrtoul.c' || echo './'`xstrtoul.c; \
then mv ".deps/xstrtoul.Tpo" ".deps/xstrtoul.Po"; \
else rm -f ".deps/xstrtoul.Tpo"; exit 1; \
fi
if gcc -DLIBDIR=\"/home/peter/result/lib\" -DHAVE_CONFIG_H -I. -I. -I.. -I.. -I. -U_FORTIFY_SOURCE -MT xstrtoimax.o -MD -MP -MF ".deps/xstrtoimax.Tpo" \
-c -o xstrtoimax.o `test -f 'xstrtoimax.c' || echo './'`xstrtoimax.c; \
then mv ".deps/xstrtoimax.Tpo" ".deps/xstrtoimax.Po"; \
else rm -f ".deps/xstrtoimax.Tpo"; exit 1; \
fi
if gcc -DLIBDIR=\"/home/peter/result/lib\" -DHAVE_CONFIG_H -I. -I. -I.. -I.. -I. -U_FORTIFY_SOURCE -MT xstrtoumax.o -MD -MP -MF ".deps/xstrtoumax.Tpo" \
-c -o xstrtoumax.o `test -f 'xstrtoumax.c' || echo './'`xstrtoumax.c; \
then mv ".deps/xstrtoumax.Tpo" ".deps/xstrtoumax.Po"; \
else rm -f ".deps/xstrtoumax.Tpo"; exit 1; \
fi
if gcc -DLIBDIR=\"/home/peter/result/lib\" -DHAVE_CONFIG_H -I. -I. -I.. -I.. -I. -U_FORTIFY_SOURCE -MT yesno.o -MD -MP -MF ".deps/yesno.Tpo" \
-c -o yesno.o `test -f 'yesno.c' || echo './'`yesno.c; \
then mv ".deps/yesno.Tpo" ".deps/yesno.Po"; \
else rm -f ".deps/yesno.Tpo"; exit 1; \
fi
if gcc -DLIBDIR=\"/home/peter/result/lib\" -DHAVE_CONFIG_H -I. -I. -I.. -I.. -I. -U_FORTIFY_SOURCE -MT mkdir.o -MD -MP -MF ".deps/mkdir.Tpo" \
-c -o mkdir.o `test -f 'mkdir.c' || echo './'`mkdir.c; \
then mv ".deps/mkdir.Tpo" ".deps/mkdir.Po"; \
else rm -f ".deps/mkdir.Tpo"; exit 1; \
fi
if gcc -DLIBDIR=\"/home/peter/result/lib\" -DHAVE_CONFIG_H -I. -I. -I.. -I.. -I. -U_FORTIFY_SOURCE -MT fnmatch.o -MD -MP -MF ".deps/fnmatch.Tpo" \
-c -o fnmatch.o `test -f 'fnmatch.c' || echo './'`fnmatch.c; \
then mv ".deps/fnmatch.Tpo" ".deps/fnmatch.Po"; \
else rm -f ".deps/fnmatch.Tpo"; exit 1; \
fi
In file included from fnmatch.c:229:
fnmatch_loop.c: In function 'ext_match':
fnmatch_loop.c:1060:23: error: implicit declaration of function 'offsetof' [ttps://gcc.gnu.org/onlinedocs/gcc-14.2.0/gcc/Warning-Options.html#index-Wimplicit-function-declaration-Wimplicit-function-declaration]8;;]
1060 | alloca (offsetof (struct patternlist, str) \
| ^~~~~~~~
fnmatch_loop.c:1066:13: note: in expansion of macro 'NEW_PATTERN'
1066 | NEW_PATTERN;
| ^~~~~~~~~~~
fnmatch_loop.c:1:1: note: 'offsetof' is defined in header '<stddef.h>'; this is probably fixable by adding '#include <stddef.h>'
+++ |+#include <stddef.h>
1 | /* Copyright (C) 1991, 1992, 1993, 1996, 1997, 1998, 1999, 2000, 2001,
fnmatch_loop.c:1060:33: error: expected expression before 'struct'
1060 | alloca (offsetof (struct patternlist, str) \
| ^~~~~~
fnmatch_loop.c:1066:13: note: in expansion of macro 'NEW_PATTERN'
1066 | NEW_PATTERN;
| ^~~~~~~~~~~
fnmatch_loop.c:1060:33: error: expected expression before 'struct'
1060 | alloca (offsetof (struct patternlist, str) \
| ^~~~~~
fnmatch_loop.c:1073:13: note: in expansion of macro 'NEW_PATTERN'
1073 | NEW_PATTERN;
| ^~~~~~~~~~~
In file included from fnmatch.c:326:
fnmatch_loop.c: In function 'ext_wmatch':
fnmatch_loop.c:1060:33: error: expected expression before 'struct'
1060 | alloca (offsetof (struct patternlist, str) \
| ^~~~~~
fnmatch_loop.c:1066:13: note: in expansion of macro 'NEW_PATTERN'
1066 | NEW_PATTERN;
| ^~~~~~~~~~~
fnmatch_loop.c:1060:33: error: expected expression before 'struct'
1060 | alloca (offsetof (struct patternlist, str) \
| ^~~~~~
fnmatch_loop.c:1073:13: note: in expansion of macro 'NEW_PATTERN'
1073 | NEW_PATTERN;
| ^~~~~~~~~~~
make[3]: *** [Makefile:590: fnmatch.o] Error 1
make[3]: Leaving directory '/home/peter/coreutils-5.0/lib'
make[2]: *** [Makefile:414: all] Error 2
make[2]: Leaving directory '/home/peter/coreutils-5.0/lib'
make[1]: *** [Makefile:244: all-recursive] Error 1
make[1]: Leaving directory '/home/peter/coreutils-5.0'
make: *** [Makefile:199: all] Error 2
↓ 86 lines
make all-recursive
make[1]: Entering directory '/home/peter/coreutils-5.0'
Making all in lib
make[2]: Entering directory '/home/peter/coreutils-5.0/lib'
make all-am
make[3]: Entering directory '/home/peter/coreutils-5.0/lib'
if gcc -DLIBDIR=\"/home/peter/result/lib\" -DHAVE_CONFIG_H -I. -I. -I.. -I.. -I. -U_FORTIFY_SOURCE -MT xstrtol.o -MD -MP -MF ".deps/xstrtol.Tpo" \
-c -o xstrtol.o `test -f 'xstrtol.c' || echo './'`xstrtol.c; \
then mv ".deps/xstrtol.Tpo" ".deps/xstrtol.Po"; \
else rm -f ".deps/xstrtol.Tpo"; exit 1; \
fi
if gcc -DLIBDIR=\"/home/peter/result/lib\" -DHAVE_CONFIG_H -I. -I. -I.. -I.. -I. -U_FORTIFY_SOURCE -MT xstrtoul.o -MD -MP -MF ".deps/xstrtoul.Tpo" \
-c -o xstrtoul.o `test -f 'xstrtoul.c' || echo './'`xstrtoul.c; \
then mv ".deps/xstrtoul.Tpo" ".deps/xstrtoul.Po"; \
else rm -f ".deps/xstrtoul.Tpo"; exit 1; \
fi
if gcc -DLIBDIR=\"/home/peter/result/lib\" -DHAVE_CONFIG_H -I. -I. -I.. -I.. -I. -U_FORTIFY_SOURCE -MT xstrtoimax.o -MD -MP -MF ".deps/xstrtoimax.Tpo" \
-c -o xstrtoimax.o `test -f 'xstrtoimax.c' || echo './'`xstrtoimax.c; \
then mv ".deps/xstrtoimax.Tpo" ".deps/xstrtoimax.Po"; \
else rm -f ".deps/xstrtoimax.Tpo"; exit 1; \
fi
if gcc -DLIBDIR=\"/home/peter/result/lib\" -DHAVE_CONFIG_H -I. -I. -I.. -I.. -I. -U_FORTIFY_SOURCE -MT xstrtoumax.o -MD -MP -MF ".deps/xstrtoumax.Tpo" \
-c -o xstrtoumax.o `test -f 'xstrtoumax.c' || echo './'`xstrtoumax.c; \
then mv ".deps/xstrtoumax.Tpo" ".deps/xstrtoumax.Po"; \
else rm -f ".deps/xstrtoumax.Tpo"; exit 1; \
fi
if gcc -DLIBDIR=\"/home/peter/result/lib\" -DHAVE_CONFIG_H -I. -I. -I.. -I.. -I. -U_FORTIFY_SOURCE -MT yesno.o -MD -MP -MF ".deps/yesno.Tpo" \
-c -o yesno.o `test -f 'yesno.c' || echo './'`yesno.c; \
then mv ".deps/yesno.Tpo" ".deps/yesno.Po"; \
else rm -f ".deps/yesno.Tpo"; exit 1; \
fi
if gcc -DLIBDIR=\"/home/peter/result/lib\" -DHAVE_CONFIG_H -I. -I. -I.. -I.. -I. -U_FORTIFY_SOURCE -MT mkdir.o -MD -MP -MF ".deps/mkdir.Tpo" \
-c -o mkdir.o `test -f 'mkdir.c' || echo './'`mkdir.c; \
then mv ".deps/mkdir.Tpo" ".deps/mkdir.Po"; \
else rm -f ".deps/mkdir.Tpo"; exit 1; \
fi
if gcc -DLIBDIR=\"/home/peter/result/lib\" -DHAVE_CONFIG_H -I. -I. -I.. -I.. -I. -U_FORTIFY_SOURCE -MT fnmatch.o -MD -MP -MF ".deps/fnmatch.Tpo" \
-c -o fnmatch.o `test -f 'fnmatch.c' || echo './'`fnmatch.c; \
then mv ".deps/fnmatch.Tpo" ".deps/fnmatch.Po"; \
else rm -f ".deps/fnmatch.Tpo"; exit 1; \
fi
In file included from fnmatch.c:229:
fnmatch_loop.c: In function 'ext_match':
fnmatch_loop.c:1060:23: error: implicit declaration of function 'offsetof' [ttps://gcc.gnu.org/onlinedocs/gcc-14.2.0/gcc/Warning-Options.html#index-Wimplicit-function-declaration-Wimplicit-function-declaration]8;;]
1060 | alloca (offsetof (struct patternlist, str) \
| ^~~~~~~~
fnmatch_loop.c:1066:13: note: in expansion of macro 'NEW_PATTERN'
1066 | NEW_PATTERN;
| ^~~~~~~~~~~
fnmatch_loop.c:1:1: note: 'offsetof' is defined in header '<stddef.h>'; this is probably fixable by adding '#include <stddef.h>'
+++ |+#include <stddef.h>
1 | /* Copyright (C) 1991, 1992, 1993, 1996, 1997, 1998, 1999, 2000, 2001,
fnmatch_loop.c:1060:33: error: expected expression before 'struct'
1060 | alloca (offsetof (struct patternlist, str) \
| ^~~~~~
fnmatch_loop.c:1066:13: note: in expansion of macro 'NEW_PATTERN'
1066 | NEW_PATTERN;
| ^~~~~~~~~~~
fnmatch_loop.c:1060:33: error: expected expression before 'struct'
1060 | alloca (offsetof (struct patternlist, str) \
| ^~~~~~
fnmatch_loop.c:1073:13: note: in expansion of macro 'NEW_PATTERN'
1073 | NEW_PATTERN;
| ^~~~~~~~~~~
In file included from fnmatch.c:326:
fnmatch_loop.c: In function 'ext_wmatch':
fnmatch_loop.c:1060:33: error: expected expression before 'struct'
1060 | alloca (offsetof (struct patternlist, str) \
| ^~~~~~
fnmatch_loop.c:1066:13: note: in expansion of macro 'NEW_PATTERN'
1066 | NEW_PATTERN;
| ^~~~~~~~~~~
fnmatch_loop.c:1060:33: error: expected expression before 'struct'
1060 | alloca (offsetof (struct patternlist, str) \
| ^~~~~~
fnmatch_loop.c:1073:13: note: in expansion of macro 'NEW_PATTERN'
1073 | NEW_PATTERN;
| ^~~~~~~~~~~
make[3]: *** [Makefile:590: fnmatch.o] Error 1
make[3]: Leaving directory '/home/peter/coreutils-5.0/lib'
make[2]: *** [Makefile:414: all] Error 2
make[2]: Leaving directory '/home/peter/coreutils-5.0/lib'
make[1]: *** [Makefile:244: all-recursive] Error 1
make[1]: Leaving directory '/home/peter/coreutils-5.0'
make: *** [Makefile:199: all] Error 2
[empty output]
compile-bench> cd /home/peter/coreutils-5.0 && make CFLAGS="-U_FORTIFY_SOURCE" make all-recursive
make[1]: Entering directory '/home/peter/coreutils-5.0'
Making all in lib
make[2]: Entering directory '/home/peter/coreutils-5.0/lib'
make all-am
make[3]: Entering directory '/home/peter/coreutils-5.0/lib'
if gcc -DLIBDIR=\"/home/peter/result/lib\" -DHAVE_CONFIG_H -I. -I. -I.. -I.. -I. -U_FORTIFY_SOURCE -MT fnmatch.o -MD -MP -MF ".deps/fnmatch.Tpo" \
-c -o fnmatch.o `test -f 'fnmatch.c' || echo './'`fnmatch.c; \
then mv ".deps/fnmatch.Tpo" ".deps/fnmatch.Po"; \
else rm -f ".deps/fnmatch.Tpo"; exit 1; \
fi
In file included from fnmatch.c:229:
fnmatch_loop.c: In function 'ext_match':
fnmatch_loop.c:1061:23: error: implicit declaration of function 'offsetof' [ttps://gcc.gnu.org/onlinedocs/gcc-14.2.0/gcc/Warning-Options.html#index-Wimplicit-function-declaration-Wimplicit-function-declaration]8;;]
1061 | alloca (offsetof (struct patternlist, str) \
| ^~~~~~~~
fnmatch_loop.c:1067:13: note: in expansion of macro 'NEW_PATTERN'
1067 | NEW_PATTERN;
| ^~~~~~~~~~~
fnmatch_loop.c:1:1: note: 'offsetof' is defined in header '<stddef.h>'; this is probably fixable by adding '#include <stddef.h>'
+++ |+#include <stddef.h>
1 | /* Copyright (C) 1991, 1992, 1993, 1996, 1997, 1998, 1999, 2000, 2001,
fnmatch_loop.c:1061:33: error: expected expression before 'struct'
1061 | alloca (offsetof (struct patternlist, str) \
| ^~~~~~
fnmatch_loop.c:1067:13: note: in expansion of macro 'NEW_PATTERN'
1067 | NEW_PATTERN;
| ^~~~~~~~~~~
fnmatch_loop.c:1061:33: error: expected expression before 'struct'
1061 | alloca (offsetof (struct patternlist, str) \
| ^~~~~~
fnmatch_loop.c:1074:13: note: in expansion of macro 'NEW_PATTERN'
1074 | NEW_PATTERN;
| ^~~~~~~~~~~
In file included from fnmatch.c:326:
fnmatch_loop.c: In function 'ext_wmatch':
fnmatch_loop.c:1061:33: error: expected expression before 'struct'
1061 | alloca (offsetof (struct patternlist, str) \
| ^~~~~~
fnmatch_loop.c:1067:13: note: in expansion of macro 'NEW_PATTERN'
1067 | NEW_PATTERN;
| ^~~~~~~~~~~
fnmatch_loop.c:1061:33: error: expected expression before 'struct'
1061 | alloca (offsetof (struct patternlist, str) \
| ^~~~~~
fnmatch_loop.c:1074:13: note: in expansion of macro 'NEW_PATTERN'
1074 | NEW_PATTERN;
| ^~~~~~~~~~~
make[3]: *** [Makefile:590: fnmatch.o] Error 1
make[3]: Leaving directory '/home/peter/coreutils-5.0/lib'
make[2]: *** [Makefile:414: all] Error 2
make[2]: Leaving directory '/home/peter/coreutils-5.0/lib'
make[1]: *** [Makefile:244: all-recursive] Error 1
make[1]: Leaving directory '/home/peter/coreutils-5.0'
make: *** [Makefile:199: all] Error 2
↓ 56 lines
make all-recursive
make[1]: Entering directory '/home/peter/coreutils-5.0'
Making all in lib
make[2]: Entering directory '/home/peter/coreutils-5.0/lib'
make all-am
make[3]: Entering directory '/home/peter/coreutils-5.0/lib'
if gcc -DLIBDIR=\"/home/peter/result/lib\" -DHAVE_CONFIG_H -I. -I. -I.. -I.. -I. -U_FORTIFY_SOURCE -MT fnmatch.o -MD -MP -MF ".deps/fnmatch.Tpo" \
-c -o fnmatch.o `test -f 'fnmatch.c' || echo './'`fnmatch.c; \
then mv ".deps/fnmatch.Tpo" ".deps/fnmatch.Po"; \
else rm -f ".deps/fnmatch.Tpo"; exit 1; \
fi
In file included from fnmatch.c:229:
fnmatch_loop.c: In function 'ext_match':
fnmatch_loop.c:1061:23: error: implicit declaration of function 'offsetof' [ttps://gcc.gnu.org/onlinedocs/gcc-14.2.0/gcc/Warning-Options.html#index-Wimplicit-function-declaration-Wimplicit-function-declaration]8;;]
1061 | alloca (offsetof (struct patternlist, str) \
| ^~~~~~~~
fnmatch_loop.c:1067:13: note: in expansion of macro 'NEW_PATTERN'
1067 | NEW_PATTERN;
| ^~~~~~~~~~~
fnmatch_loop.c:1:1: note: 'offsetof' is defined in header '<stddef.h>'; this is probably fixable by adding '#include <stddef.h>'
+++ |+#include <stddef.h>
1 | /* Copyright (C) 1991, 1992, 1993, 1996, 1997, 1998, 1999, 2000, 2001,
fnmatch_loop.c:1061:33: error: expected expression before 'struct'
1061 | alloca (offsetof (struct patternlist, str) \
| ^~~~~~
fnmatch_loop.c:1067:13: note: in expansion of macro 'NEW_PATTERN'
1067 | NEW_PATTERN;
| ^~~~~~~~~~~
fnmatch_loop.c:1061:33: error: expected expression before 'struct'
1061 | alloca (offsetof (struct patternlist, str) \
| ^~~~~~
fnmatch_loop.c:1074:13: note: in expansion of macro 'NEW_PATTERN'
1074 | NEW_PATTERN;
| ^~~~~~~~~~~
In file included from fnmatch.c:326:
fnmatch_loop.c: In function 'ext_wmatch':
fnmatch_loop.c:1061:33: error: expected expression before 'struct'
1061 | alloca (offsetof (struct patternlist, str) \
| ^~~~~~
fnmatch_loop.c:1067:13: note: in expansion of macro 'NEW_PATTERN'
1067 | NEW_PATTERN;
| ^~~~~~~~~~~
fnmatch_loop.c:1061:33: error: expected expression before 'struct'
1061 | alloca (offsetof (struct patternlist, str) \
| ^~~~~~
fnmatch_loop.c:1074:13: note: in expansion of macro 'NEW_PATTERN'
1074 | NEW_PATTERN;
| ^~~~~~~~~~~
make[3]: *** [Makefile:590: fnmatch.o] Error 1
make[3]: Leaving directory '/home/peter/coreutils-5.0/lib'
make[2]: *** [Makefile:414: all] Error 2
make[2]: Leaving directory '/home/peter/coreutils-5.0/lib'
make[1]: *** [Makefile:244: all-recursive] Error 1
make[1]: Leaving directory '/home/peter/coreutils-5.0'
make: *** [Makefile:199: all] Error 2
Show reasoning
Addressing Compilation Errors
I'm still wrestling with the compilation, and fnmatch_loop.c is the culprit again. I'm seeing those offsetof and struct errors. It's either that the #include fix isn't sticking, or I've bungled the insertion. I'll double-check that file.
Rectifying Inclusion Issues
I'm still seeing those offsetof errors in fnmatch_loop.c. It seems the #include fix isn't taking. I'll ensure it's at the very top of the file, and also add it to fnmatch.c. If this doesn't work, I'll nuke the build directory and re-extract the source.
[empty output]
whispers
The previous attempt to include in fnmatch_loop.c did not resolve the offsetof and struct patternlist errors. This is because fnmatch_loop.c is included within fnmatch.c, and thus the necessary header should be included in fnmatch.c instead. I will add the include directive to fnmatch.c and try to build again.
compile-bench> cd /home/peter/coreutils-5.0 && make CFLAGS="-U_FORTIFY_SOURCE" make all-recursive
make[1]: Entering directory '/home/peter/coreutils-5.0'
Making all in lib
make[2]: Entering directory '/home/peter/coreutils-5.0/lib'
make all-am
make[3]: Entering directory '/home/peter/coreutils-5.0/lib'
if gcc -DLIBDIR=\"/home/peter/result/lib\" -DHAVE_CONFIG_H -I. -I. -I.. -I.. -I. -U_FORTIFY_SOURCE -MT fnmatch.o -MD -MP -MF ".deps/fnmatch.Tpo" \
-c -o fnmatch.o `test -f 'fnmatch.c' || echo './'`fnmatch.c; \
then mv ".deps/fnmatch.Tpo" ".deps/fnmatch.Po"; \
else rm -f ".deps/fnmatch.Tpo"; exit 1; \
fi
if gcc -DLIBDIR=\"/home/peter/result/lib\" -DHAVE_CONFIG_H -I. -I. -I.. -I.. -I. -U_FORTIFY_SOURCE -MT memcmp.o -MD -MP -MF ".deps/memcmp.Tpo" \
-c -o memcmp.o `test -f 'memcmp.c' || echo './'`memcmp.c; \
then mv ".deps/memcmp.Tpo" ".deps/memcmp.Po"; \
else rm -f ".deps/memcmp.Tpo"; exit 1; \
fi
if gcc -DLIBDIR=\"/home/peter/result/lib\" -DHAVE_CONFIG_H -I. -I. -I.. -I.. -I. -U_FORTIFY_SOURCE -MT readutmp.o -MD -MP -MF ".deps/readutmp.Tpo" \
-c -o readutmp.o `test -f 'readutmp.c' || echo './'`readutmp.c; \
then mv ".deps/readutmp.Tpo" ".deps/readutmp.Po"; \
else rm -f ".deps/readutmp.Tpo"; exit 1; \
fi
if gcc -DLIBDIR=\"/home/peter/result/lib\" -DHAVE_CONFIG_H -I. -I. -I.. -I.. -I. -U_FORTIFY_SOURCE -MT strnlen.o -MD -MP -MF ".deps/strnlen.Tpo" \
-c -o strnlen.o `test -f 'strnlen.c' || echo './'`strnlen.c; \
then mv ".deps/strnlen.Tpo" ".deps/strnlen.Po"; \
else rm -f ".deps/strnlen.Tpo"; exit 1; \
fi
if gcc -DLIBDIR=\"/home/peter/result/lib\" -DHAVE_CONFIG_H -I. -I. -I.. -I.. -I. -U_FORTIFY_SOURCE -MT ftw.o -MD -MP -MF ".deps/ftw.Tpo" \
-c -o ftw.o `test -f 'ftw.c' || echo './'`ftw.c; \
then mv ".deps/ftw.Tpo" ".deps/ftw.Po"; \
else rm -f ".deps/ftw.Tpo"; exit 1; \
fi
if gcc -DLIBDIR=\"/home/peter/result/lib\" -DHAVE_CONFIG_H -I. -I. -I.. -I.. -I. -U_FORTIFY_SOURCE -MT chown.o -MD -MP -MF ".deps/chown.Tpo" \
-c -o chown.o `test -f 'chown.c' || echo './'`chown.c; \
then mv ".deps/chown.Tpo" ".deps/chown.Po"; \
else rm -f ".deps/chown.Tpo"; exit 1; \
fi
if gcc -DLIBDIR=\"/home/peter/result/lib\" -DHAVE_CONFIG_H -I. -I. -I.. -I.. -I. -U_FORTIFY_SOURCE -MT mktime.o -MD -MP -MF ".deps/mktime.Tpo" \
-c -o mktime.o `test -f 'mktime.c' || echo './'`mktime.c; \
then mv ".deps/mktime.Tpo" ".deps/mktime.Po"; \
else rm -f ".deps/mktime.Tpo"; exit 1; \
fi
if gcc -DLIBDIR=\"/home/peter/result/lib\" -DHAVE_CONFIG_H -I. -I. -I.. -I.. -I. -U_FORTIFY_SOURCE -MT nanosleep.o -MD -MP -MF ".deps/nanosleep.Tpo" \
-c -o nanosleep.o `test -f 'nanosleep.c' || echo './'`nanosleep.c; \
then mv ".deps/nanosleep.Tpo" ".deps/nanosleep.Po"; \
else rm -f ".deps/nanosleep.Tpo"; exit 1; \
fi
if gcc -DLIBDIR=\"/home/peter/result/lib\" -DHAVE_CONFIG_H -I. -I. -I.. -I.. -I. -U_FORTIFY_SOURCE -MT group-member.o -MD -MP -MF ".deps/group-member.Tpo" \
-c -o group-member.o `test -f 'group-member.c' || echo './'`group-member.c; \
then mv ".deps/group-member.Tpo" ".deps/group-member.Po"; \
else rm -f ".deps/group-member.Tpo"; exit 1; \
fi
if gcc -DLIBDIR=\"/home/peter/result/lib\" -DHAVE_CONFIG_H -I. -I. -I.. -I.. -I. -U_FORTIFY_SOURCE -MT putenv.o -MD -MP -MF ".deps/putenv.Tpo" \
-c -o putenv.o `test -f 'putenv.c' || echo './'`putenv.c; \
then mv ".deps/putenv.Tpo" ".deps/putenv.Po"; \
else rm -f ".deps/putenv.Tpo"; exit 1; \
fi
putenv.c:34:7: warning: conflicting types for built-in function 'malloc'; expected 'void *(long unsigned int)' [ttps://gcc.gnu.org/onlinedocs/gcc-14.2.0/gcc/Warning-Options.html#index-Wbuiltin-declaration-mismatch-Wbuiltin-declaration-mismatch]8;;]
34 | char *malloc ();
| ^~~~~~
putenv.c:29:1: note: 'malloc' is declared in header '<stdlib.h>'
28 | #include <errno.h>
+++ |+#include <stdlib.h>
29 |
if gcc -DLIBDIR=\"/home/peter/result/lib\" -DHAVE_CONFIG_H -I. -I. -I.. -I.. -I. -U_FORTIFY_SOURCE -MT error.o -MD -MP -MF ".deps/error.Tpo" \
-c -o error.o `test -f 'error.c' || echo './'`error.c; \
then mv ".deps/error.Tpo" ".deps/error.Po"; \
else rm -f ".deps/error.Tpo"; exit 1; \
fi
error.c: In function 'print_errno_message':
error.c:115:24: error: implicit declaration of function 'strerror_r' [ttps://gcc.gnu.org/onlinedocs/gcc-14.2.0/gcc/Warning-Options.html#index-Wimplicit-function-declaration-Wimplicit-function-declaration]8;;]
115 | # define __strerror_r strerror_r
| ^~~~~~~~~~
error.c:150:7: note: in expansion of macro '__strerror_r'
150 | if (__strerror_r (errnum, errbuf, sizeof errbuf) == 0)
| ^~~~~~~~~~~~
error.c: In function 'error_at_line':
error.c:329:18: error: implicit declaration of function 'strcmp' [ttps://gcc.gnu.org/onlinedocs/gcc-14.2.0/gcc/Warning-Options.html#index-Wimplicit-function-declaration-Wimplicit-function-declaration]8;;]
329 | || strcmp (old_file_name, file_name) == 0))
| ^~~~~~
error.c:60:1: note: include '<string.h>' or provide a declaration of 'strcmp'
59 | # include "unlocked-io.h"
+++ |+#include <string.h>
60 | #endif
make[3]: *** [Makefile:590: error.o] Error 1
make[3]: Leaving directory '/home/peter/coreutils-5.0/lib'
make[2]: *** [Makefile:414: all] Error 2
make[2]: Leaving directory '/home/peter/coreutils-5.0/lib'
make[1]: *** [Makefile:244: all-recursive] Error 1
make[1]: Leaving directory '/home/peter/coreutils-5.0'
make: *** [Makefile:199: all] Error 2
↓ 91 lines
make all-recursive
make[1]: Entering directory '/home/peter/coreutils-5.0'
Making all in lib
make[2]: Entering directory '/home/peter/coreutils-5.0/lib'
make all-am
make[3]: Entering directory '/home/peter/coreutils-5.0/lib'
if gcc -DLIBDIR=\"/home/peter/result/lib\" -DHAVE_CONFIG_H -I. -I. -I.. -I.. -I. -U_FORTIFY_SOURCE -MT fnmatch.o -MD -MP -MF ".deps/fnmatch.Tpo" \
-c -o fnmatch.o `test -f 'fnmatch.c' || echo './'`fnmatch.c; \
then mv ".deps/fnmatch.Tpo" ".deps/fnmatch.Po"; \
else rm -f ".deps/fnmatch.Tpo"; exit 1; \
fi
if gcc -DLIBDIR=\"/home/peter/result/lib\" -DHAVE_CONFIG_H -I. -I. -I.. -I.. -I. -U_FORTIFY_SOURCE -MT memcmp.o -MD -MP -MF ".deps/memcmp.Tpo" \
-c -o memcmp.o `test -f 'memcmp.c' || echo './'`memcmp.c; \
then mv ".deps/memcmp.Tpo" ".deps/memcmp.Po"; \
else rm -f ".deps/memcmp.Tpo"; exit 1; \
fi
if gcc -DLIBDIR=\"/home/peter/result/lib\" -DHAVE_CONFIG_H -I. -I. -I.. -I.. -I. -U_FORTIFY_SOURCE -MT readutmp.o -MD -MP -MF ".deps/readutmp.Tpo" \
-c -o readutmp.o `test -f 'readutmp.c' || echo './'`readutmp.c; \
then mv ".deps/readutmp.Tpo" ".deps/readutmp.Po"; \
else rm -f ".deps/readutmp.Tpo"; exit 1; \
fi
if gcc -DLIBDIR=\"/home/peter/result/lib\" -DHAVE_CONFIG_H -I. -I. -I.. -I.. -I. -U_FORTIFY_SOURCE -MT strnlen.o -MD -MP -MF ".deps/strnlen.Tpo" \
-c -o strnlen.o `test -f 'strnlen.c' || echo './'`strnlen.c; \
then mv ".deps/strnlen.Tpo" ".deps/strnlen.Po"; \
else rm -f ".deps/strnlen.Tpo"; exit 1; \
fi
if gcc -DLIBDIR=\"/home/peter/result/lib\" -DHAVE_CONFIG_H -I. -I. -I.. -I.. -I. -U_FORTIFY_SOURCE -MT ftw.o -MD -MP -MF ".deps/ftw.Tpo" \
-c -o ftw.o `test -f 'ftw.c' || echo './'`ftw.c; \
then mv ".deps/ftw.Tpo" ".deps/ftw.Po"; \
else rm -f ".deps/ftw.Tpo"; exit 1; \
fi
if gcc -DLIBDIR=\"/home/peter/result/lib\" -DHAVE_CONFIG_H -I. -I. -I.. -I.. -I. -U_FORTIFY_SOURCE -MT chown.o -MD -MP -MF ".deps/chown.Tpo" \
-c -o chown.o `test -f 'chown.c' || echo './'`chown.c; \
then mv ".deps/chown.Tpo" ".deps/chown.Po"; \
else rm -f ".deps/chown.Tpo"; exit 1; \
fi
if gcc -DLIBDIR=\"/home/peter/result/lib\" -DHAVE_CONFIG_H -I. -I. -I.. -I.. -I. -U_FORTIFY_SOURCE -MT mktime.o -MD -MP -MF ".deps/mktime.Tpo" \
-c -o mktime.o `test -f 'mktime.c' || echo './'`mktime.c; \
then mv ".deps/mktime.Tpo" ".deps/mktime.Po"; \
else rm -f ".deps/mktime.Tpo"; exit 1; \
fi
if gcc -DLIBDIR=\"/home/peter/result/lib\" -DHAVE_CONFIG_H -I. -I. -I.. -I.. -I. -U_FORTIFY_SOURCE -MT nanosleep.o -MD -MP -MF ".deps/nanosleep.Tpo" \
-c -o nanosleep.o `test -f 'nanosleep.c' || echo './'`nanosleep.c; \
then mv ".deps/nanosleep.Tpo" ".deps/nanosleep.Po"; \
else rm -f ".deps/nanosleep.Tpo"; exit 1; \
fi
if gcc -DLIBDIR=\"/home/peter/result/lib\" -DHAVE_CONFIG_H -I. -I. -I.. -I.. -I. -U_FORTIFY_SOURCE -MT group-member.o -MD -MP -MF ".deps/group-member.Tpo" \
-c -o group-member.o `test -f 'group-member.c' || echo './'`group-member.c; \
then mv ".deps/group-member.Tpo" ".deps/group-member.Po"; \
else rm -f ".deps/group-member.Tpo"; exit 1; \
fi
if gcc -DLIBDIR=\"/home/peter/result/lib\" -DHAVE_CONFIG_H -I. -I. -I.. -I.. -I. -U_FORTIFY_SOURCE -MT putenv.o -MD -MP -MF ".deps/putenv.Tpo" \
-c -o putenv.o `test -f 'putenv.c' || echo './'`putenv.c; \
then mv ".deps/putenv.Tpo" ".deps/putenv.Po"; \
else rm -f ".deps/putenv.Tpo"; exit 1; \
fi
putenv.c:34:7: warning: conflicting types for built-in function 'malloc'; expected 'void *(long unsigned int)' [ttps://gcc.gnu.org/onlinedocs/gcc-14.2.0/gcc/Warning-Options.html#index-Wbuiltin-declaration-mismatch-Wbuiltin-declaration-mismatch]8;;]
34 | char *malloc ();
| ^~~~~~
putenv.c:29:1: note: 'malloc' is declared in header '<stdlib.h>'
28 | #include <errno.h>
+++ |+#include <stdlib.h>
29 |
if gcc -DLIBDIR=\"/home/peter/result/lib\" -DHAVE_CONFIG_H -I. -I. -I.. -I.. -I. -U_FORTIFY_SOURCE -MT error.o -MD -MP -MF ".deps/error.Tpo" \
-c -o error.o `test -f 'error.c' || echo './'`error.c; \
then mv ".deps/error.Tpo" ".deps/error.Po"; \
else rm -f ".deps/error.Tpo"; exit 1; \
fi
error.c: In function 'print_errno_message':
error.c:115:24: error: implicit declaration of function 'strerror_r' [ttps://gcc.gnu.org/onlinedocs/gcc-14.2.0/gcc/Warning-Options.html#index-Wimplicit-function-declaration-Wimplicit-function-declaration]8;;]
115 | # define __strerror_r strerror_r
| ^~~~~~~~~~
error.c:150:7: note: in expansion of macro '__strerror_r'
150 | if (__strerror_r (errnum, errbuf, sizeof errbuf) == 0)
| ^~~~~~~~~~~~
error.c: In function 'error_at_line':
error.c:329:18: error: implicit declaration of function 'strcmp' [ttps://gcc.gnu.org/onlinedocs/gcc-14.2.0/gcc/Warning-Options.html#index-Wimplicit-function-declaration-Wimplicit-function-declaration]8;;]
329 | || strcmp (old_file_name, file_name) == 0))
| ^~~~~~
error.c:60:1: note: include '<string.h>' or provide a declaration of 'strcmp'
59 | # include "unlocked-io.h"
+++ |+#include <string.h>
60 | #endif
make[3]: *** [Makefile:590: error.o] Error 1
make[3]: Leaving directory '/home/peter/coreutils-5.0/lib'
make[2]: *** [Makefile:414: all] Error 2
make[2]: Leaving directory '/home/peter/coreutils-5.0/lib'
make[1]: *** [Makefile:244: all-recursive] Error 1
make[1]: Leaving directory '/home/peter/coreutils-5.0'
make: *** [Makefile:199: all] Error 2
Show reasoning
Troubleshooting the Compilation
The recent compilation attempts failed, and a new set of errors have emerged. Specifically, implicit declarations for malloc, strerror_r, and strcmp in putenv.c and error.c are now the main obstacle. I need to investigate these issues.
Addressing Compiler Issues
I've identified the source of the recent putenv.c and error.c errors. To resolve the malloc issue in putenv.c, I'll include and remove the explicit declaration. For error.c, I'll add to address the implicit declarations of strcmp and potentially strerror_r. I will try building the code again.
[empty output]
[empty output]
Show reasoning
Debugging Compilation Errors
I've resolved the putenv.c issues and am now fixing errors in the .o files, specifically with strerror_r and strcmp. Adding should fix strcmp. I'll further examine strerror_r if problems persist.
Analyzing Strerror Errors
I've included and recompiled. The strcmp errors are gone. Now I'm focusing on the remaining strerror_r issues. Investigating possible missing includes or improper usage of the function. I may need to check the function's return value handling as well.
[empty output]
Show reasoning
Resolving Compilation Errors
I realize the previous build failed because strerror_r is missing a declaration. The fix is straightforward; I'll include string.h in error.c and attempt a rebuild. I expect this to resolve the issue, and I'll keep an eye out for any lingering problems.
[empty output]
Show reasoning
Re-evaluating Include Statements
I've determined that I might have jumped the gun a bit. While I initially thought inserting was the solution, I now see that may also be relevant, and the error message suggests it, too. My updated approach is to consider the broader context before committing to a fix.
Analyzing Header Dependencies
I'm realizing that I erred in my assessment. The problem isn't solely about missing includes, but incorrect assumptions the compiler is making about strerror_r. Even though was added before, the implicit declaration might still be the core issue. I'm now considering that a different header, like , may contain the proper function declaration. The focus has shifted from simply adding headers to understanding the scope and context of function declarations.
Prioritizing Function Declarations
I've analyzed the problem further and realized the root cause may not be a missing include, but rather the compiler's implicit declaration of functions like strerror_r and strcmp. Although I've included , it was at line 60. The errors indicate the need for these functions to be declared. To ensure all function dependencies are met, I'll move the #include to line 25 of error.c.
Verifying Header Locations
I'm revisiting my strategy. Initially, I added , then considered , but the core problem seems to be the compiler's implicit declarations. Adding the include at line 25, as I've confirmed, seems appropriate, but it wasn't effective, implying the issue might not be a simple missing include. I will re-run the build now, making sure that the include is indeed placed correctly, and then review the error messages again.
[empty output]
Show reasoning
Debugging Error Analysis
I've addressed the malloc issue in putenv.c by including the necessary header and commenting out the problematic line. Now, I'm digging into error.c, particularly the strerror_r and strcmp errors. I am making sure the prototypes match and the correct includes are present, and then I will check memory use.
Reviewing Header Placement
I've added to error.c to resolve the strcmp and potential strerror_r issues. I double-checked the includes using cat error.c and they seem correctly placed. The next step is to attempt a make to verify if these changes have eliminated the errors.
compile-bench> cat /home/peter/coreutils-5.0/lib/error.c | head -n 30 /* Error handler for noninteractive utilities
Copyright (C) 1990-1998, 2000, 2001, 2002, 2003 Free Software Foundation, Inc.
This program is free software; you can redistribute it and/or modify
it under the terms of the GNU General Public License as published by
the Free Software Foundation; either version 2, or (at your option)
any later version.
This program is distributed in the hope that it will be useful,
but WITHOUT ANY WARRANTY; without even the implied warranty of
MERCHANTABILITY or FITNESS FOR A PARTICULAR PURPOSE. See the
GNU General Public License for more details.
You should have received a copy of the GNU General Public License along
with this program; if not, write to the Free Software Foundation,
Inc., 59 Temple Place - Suite 330, Boston, MA 02111-1307, USA. */
/* Written by David MacKenzie <[email protected]>. */
#ifdef HAVE_CONFIG_H
# include <config.h>
#endif
#include <stdio.h>
#include <string.h>
#ifdef _LIBC
#include <string.h>
# include <libintl.h>
#else
# include "gettext.h"
↓ 31 lines
/* Error handler for noninteractive utilities Copyright (C) 1990-1998, 2000, 2001, 2002, 2003 Free Software Foundation, Inc. This program is free software; you can redistribute it and/or modify it under the terms of the GNU General Public License as published by the Free Software Foundation; either version 2, or (at your option) any later version. This program is distributed in the hope that it will be useful, but WITHOUT ANY WARRANTY; without even the implied warranty of MERCHANTABILITY or FITNESS FOR A PARTICULAR PURPOSE. See the GNU General Public License for more details. You should have received a copy of the GNU General Public License along with this program; if not, write to the Free Software Foundation, Inc., 59 Temple Place - Suite 330, Boston, MA 02111-1307, USA. */ /* Written by David MacKenzie <[email protected]>. */ #ifdef HAVE_CONFIG_H # include <config.h> #endif #include <stdio.h> #include <string.h> #ifdef _LIBC #include <string.h> # include <libintl.h> #else # include "gettext.h"
Show reasoning
Investigating Compilation Issues
I've revisited the error.c file. Adding #include at the very top seems like a more definitive approach. I will also remove the older, potentially conflicting sed insertions. I'm hoping this will finally resolve the strerror_r and strcmp errors.
Refining Error File Inclusion
I've added and to error.c, acknowledging potential dependencies for strerror_r. Removing the sed inserted lines seems like the right move, ensuring a clean slate. Testing this approach, hoping it eliminates lingering compilation problems.
[empty output]
Show reasoning
Addressing Compilation Errors
I'm zeroing in on the compile errors. Initially, I was a bit too loose with #include directives. The error notes are clear. I need to include to use memcpy and strcmp, and possibly add a declaration to the strerror_r issue, depending on the specific error.
Targeting Specific Headers
I've reviewed the error messages meticulously. The placement of and proved crucial. My initial haphazard placements were counterproductive. I'll start fresh: I'll place in error.c before #ifdef _LIBC, and add to putenv.c. The redundant inclusions are being removed.
[empty output]
Show reasoning
Revising Header Placement
I'm now focusing on pinpointing the optimal spot for in error.c to resolve compilation issues. My current strategy is to insert it directly after but before any other headers, thus hopefully avoiding the previously encountered conflicts.
Refining Error Inclusion
I've cleared the slate and removed all previous inclusions from error.c. I'm now adding a single #include directly after and will rebuild the project. The key is to prevent duplicate inclusions and ensure the compiler finds strerror_r and related functions. The build errors should be gone!
[empty output]
[empty output]
Show reasoning
Analyzing Placement Issues
I'm now carefully examining the file content after the last edit, specifically checking the #include insertion. My primary concern is its placement; the header needs to precede function usage. A re-insertion, higher up in the file, might be necessary to rectify any current problems.
Evaluating Header Inclusion Order
I've reviewed the file again, looking specifically at function calls related to string operations. It appears the include is still in the wrong position, triggering potential compilation failures. Therefore, I'm preparing to reinsert the header, this time strategically placed at the very top of the source code to guarantee all dependent functions are properly defined.
compile-bench> cat /home/peter/coreutils-5.0/lib/error.c | head -n 30 /* Error handler for noninteractive utilities
Copyright (C) 1990-1998, 2000, 2001, 2002, 2003 Free Software Foundation, Inc.
This program is free software; you can redistribute it and/or modify
it under the terms of the GNU General Public License as published by
the Free Software Foundation; either version 2, or (at your option)
any later version.
This program is distributed in the hope that it will be useful,
but WITHOUT ANY WARRANTY; without even the implied warranty of
MERCHANTABILITY or FITNESS FOR A PARTICULAR PURPOSE. See the
GNU General Public License for more details.
You should have received a copy of the GNU General Public License along
with this program; if not, write to the Free Software Foundation,
Inc., 59 Temple Place - Suite 330, Boston, MA 02111-1307, USA. */
/* Written by David MacKenzie <[email protected]>. */
#ifdef HAVE_CONFIG_H
# include <config.h>
#endif
#include <stdio.h>
#include <string.h>
#ifdef _LIBC
# include <libintl.h>
#else
# include "gettext.h"
#endif
↓ 31 lines
/* Error handler for noninteractive utilities Copyright (C) 1990-1998, 2000, 2001, 2002, 2003 Free Software Foundation, Inc. This program is free software; you can redistribute it and/or modify it under the terms of the GNU General Public License as published by the Free Software Foundation; either version 2, or (at your option) any later version. This program is distributed in the hope that it will be useful, but WITHOUT ANY WARRANTY; without even the implied warranty of MERCHANTABILITY or FITNESS FOR A PARTICULAR PURPOSE. See the GNU General Public License for more details. You should have received a copy of the GNU General Public License along with this program; if not, write to the Free Software Foundation, Inc., 59 Temple Place - Suite 330, Boston, MA 02111-1307, USA. */ /* Written by David MacKenzie <[email protected]>. */ #ifdef HAVE_CONFIG_H # include <config.h> #endif #include <stdio.h> #include <string.h> #ifdef _LIBC # include <libintl.h> #else # include "gettext.h" #endif
Show reasoning
Reviewing Code Corrections
I've identified a potential error, a misplaced #include that I corrected, but upon deeper review, it seems I removed other instances of it. This introduces a risk of undeclared functions. I'm now double-checking every header, ensuring consistency to avoid future issues and implicit declaration errors.
Correcting Include Statements
I've made a few mistakes; it seems I'm still cleaning up after myself. While the #include on line 25 fixed the strcmp error, strerror_r is still causing issues. I moved the include statement to line 60 in error.c, per the compiler's recommendation, and am recompiling to address all the remaining, related issues.
[empty output]
[empty output]
Show reasoning
Troubleshooting Header Inclusions
I'm currently chasing down build errors in error.c. It seems I missed some standard header includes the first time around. I'm now methodically adding to resolve issues stemming from memcpy, strlen, and others.
Refactoring Include Strategy
I've abandoned the piecemeal approach and am now tackling the root cause. The previous individual header inclusions in error.c were messy. I'm now focusing on globally adding includes via lib/Makefile.am. I'm removing those earlier changes to error.c to avoid redundancy. Next up: modifying AM_CPPFLAGS in the Makefile to include , , and for the lib directory.
[empty output]
Show reasoning
Debugging the Build Issues
I've been working on the build system's sensitivity to header inclusions. It's quite frustrating, especially regarding string.h in lib/error.c and lib/md5.c. I'm convinced it was related to an incorrect insertion point or an issue in the inclusion order. The root cause is still elusive.
Troubleshooting Header Inclusion
I'm removing the previously attempted fixes in error.c to start fresh. The build system's header inclusion sensitivity continues to be a challenge. Adding string.h directly to the Makefile is the next step, and I'll also be hunting for any redundant inclusions that may be the culprit.
bash: git: command not found
Show reasoning
Troubleshooting the Error
I'm encountering a git issue, preventing me from using git checkout to fix error.c. My plan is to manually edit the file. I'll review the current contents of error.c to understand the extent of the damage, then remove the offending parts and insert the right ones.
Assessing File Contents
I've confirmed that the git command isn't working. Now, I'm re-examining error.c to pinpoint the problematic include statements. The goal is to eliminate the duplicates and ensure that string.h and stdlib.h are correctly included. I am preparing to make the necessary edits.
compile-bench> cat /home/peter/coreutils-5.0/lib/error.c | head -n 30 /* Error handler for noninteractive utilities
Copyright (C) 1990-1998, 2000, 2001, 2002, 2003 Free Software Foundation, Inc.
This program is free software; you can redistribute it and/or modify
it under the terms of the GNU General Public License as published by
the Free Software Foundation; either version 2, or (at your option)
any later version.
This program is distributed in the hope that it will be useful,
but WITHOUT ANY WARRANTY; without even the implied warranty of
MERCHANTABILITY or FITNESS FOR A PARTICULAR PURPOSE. See the
GNU General Public License for more details.
You should have received a copy of the GNU General Public License along
with this program; if not, write to the Free Software Foundation,
Inc., 59 Temple Place - Suite 330, Boston, MA 02111-1307, USA. */
/* Written by David MacKenzie <[email protected]>. */
#ifdef HAVE_CONFIG_H
# include <config.h>
#endif
#include <stdio.h>
#include <string.h>
#include <string.h>
#ifdef _LIBC
# include <libintl.h>
#else
# include "gettext.h"
↓ 31 lines
/* Error handler for noninteractive utilities Copyright (C) 1990-1998, 2000, 2001, 2002, 2003 Free Software Foundation, Inc. This program is free software; you can redistribute it and/or modify it under the terms of the GNU General Public License as published by the Free Software Foundation; either version 2, or (at your option) any later version. This program is distributed in the hope that it will be useful, but WITHOUT ANY WARRANTY; without even the implied warranty of MERCHANTABILITY or FITNESS FOR A PARTICULAR PURPOSE. See the GNU General Public License for more details. You should have received a copy of the GNU General Public License along with this program; if not, write to the Free Software Foundation, Inc., 59 Temple Place - Suite 330, Boston, MA 02111-1307, USA. */ /* Written by David MacKenzie <[email protected]>. */ #ifdef HAVE_CONFIG_H # include <config.h> #endif #include <stdio.h> #include <string.h> #include <string.h> #ifdef _LIBC # include <libintl.h> #else # include "gettext.h"
Show reasoning
Revising Error Handling
I'm currently thinking about the repeated #include directives in error.c. Realizing that I can't use git checkout in this isolated setting. My next step involves finding a more efficient method for handling the include discrepancies.
Streamlining Include Directives
I've made some progress, now. I realized the git checkout command won't work here. So, I'm focusing on eliminating those redundant #include directives in error.c. I'm planning to systematically remove all the incorrect ones, then strategically place a single, correct include statement. After the edits, I will rerun the make command.
[empty output]
Show reasoning
Restoring the header
I just re-introduced the string.h header file. It's back where it belongs, after a little cleanup.
[empty output]
Show reasoning
Rectifying Previous Errors
I acknowledge my mistake concerning git checkout and will strive for greater accuracy in the future. I've now turned my attention to the unnecessary string.h inclusions. My plan is to meticulously remove all existing instances from error.c and then strategically place a single, correct inclusion at line 25.
Implementing Additional Corrections
I've addressed the initial string.h issue, and now I'm focused on incorporating the necessary header inclusions. I will add to error.c along with to fnmatch.c. Then, I'll include in lib/putenv.c and remove the extraneous malloc() declaration. Finally, I'll reinstate the string.h in md5.c and then test the compilation again.
[empty output]
Show reasoning
Re-Evaluating Inclusion Strategies
I'm currently wrestling with the error.c file's inclusion of string.h. sed is proving uncooperative with my attempts at automated correction. My next tactic involves manually adding the necessary includes at the beginning of the file and recompiling to see if this resolves the build errors.
Addressing Compile Errors Manually
The manual inclusion of string.h and stdlib.h in error.c is complete. I am now recompiling the project. I'm curious to observe if these additions eliminate the previous build errors. If that works, I'll focus on cleaning up the sed commands.
[empty output]
compile-bench> cd /home/peter/coreutils-5.0 && make CFLAGS="-U_FORTIFY_SOURCE" make all-recursive
make[1]: Entering directory '/home/peter/coreutils-5.0'
Making all in lib
make[2]: Entering directory '/home/peter/coreutils-5.0/lib'
make all-am
make[3]: Entering directory '/home/peter/coreutils-5.0/lib'
if gcc -DLIBDIR=\"/home/peter/result/lib\" -DHAVE_CONFIG_H -I. -I. -I.. -I.. -I. -U_FORTIFY_SOURCE -MT md5.o -MD -MP -MF ".deps/md5.Tpo" \
-c -o md5.o `test -f 'md5.c' || echo './'`md5.c; \
then mv ".deps/md5.Tpo" ".deps/md5.Po"; \
else rm -f ".deps/md5.Tpo"; exit 1; \
fi
md5.c: In function 'md5_finish_ctx':
md5.c:129:3: error: implicit declaration of function 'memcpy' [ttps://gcc.gnu.org/onlinedocs/gcc-14.2.0/gcc/Warning-Options.html#index-Wimplicit-function-declaration-Wimplicit-function-declaration]8;;]
129 | memcpy (&ctx->buffer[bytes], fillbuf, pad);
| ^~~~~~
md5.c:40:1: note: include '<string.h>' or provide a declaration of 'memcpy'
39 | #include "unlocked-io.h"
+++ |+#include <string.h>
40 |
md5.c:129:3: warning: incompatible implicit declaration of built-in function 'memcpy' [ttps://gcc.gnu.org/onlinedocs/gcc-14.2.0/gcc/Warning-Options.html#index-Wbuiltin-declaration-mismatch-Wbuiltin-declaration-mismatch]8;;]
129 | memcpy (&ctx->buffer[bytes], fillbuf, pad);
| ^~~~~~
md5.c:129:3: note: include '<string.h>' or provide a declaration of 'memcpy'
md5.c: In function 'md5_process_bytes':
md5.c:246:7: warning: incompatible implicit declaration of built-in function 'memcpy' [ttps://gcc.gnu.org/onlinedocs/gcc-14.2.0/gcc/Warning-Options.html#index-Wbuiltin-declaration-mismatch-Wbuiltin-declaration-mismatch]8;;]
246 | memcpy (&ctx->buffer[left_over], buffer, add);
| ^~~~~~
md5.c:246:7: note: include '<string.h>' or provide a declaration of 'memcpy'
md5.c:277:32: warning: incompatible implicit declaration of built-in function 'memcpy' [ttps://gcc.gnu.org/onlinedocs/gcc-14.2.0/gcc/Warning-Options.html#index-Wbuiltin-declaration-mismatch-Wbuiltin-declaration-mismatch]8;;]
277 | md5_process_block (memcpy (ctx->buffer, buffer, 64), 64, ctx);
| ^~~~~~
md5.c:277:32: note: include '<string.h>' or provide a declaration of 'memcpy'
md5.c:295:7: warning: incompatible implicit declaration of built-in function 'memcpy' [ttps://gcc.gnu.org/onlinedocs/gcc-14.2.0/gcc/Warning-Options.html#index-Wbuiltin-declaration-mismatch-Wbuiltin-declaration-mismatch]8;;]
295 | memcpy (&ctx->buffer[left_over], buffer, len);
| ^~~~~~
md5.c:295:7: note: include '<string.h>' or provide a declaration of 'memcpy'
make[3]: *** [Makefile:590: md5.o] Error 1
make[3]: Leaving directory '/home/peter/coreutils-5.0/lib'
make[2]: *** [Makefile:414: all] Error 2
make[2]: Leaving directory '/home/peter/coreutils-5.0/lib'
make[1]: *** [Makefile:244: all-recursive] Error 1
make[1]: Leaving directory '/home/peter/coreutils-5.0'
make: *** [Makefile:199: all] Error 2
↓ 44 lines
make all-recursive
make[1]: Entering directory '/home/peter/coreutils-5.0'
Making all in lib
make[2]: Entering directory '/home/peter/coreutils-5.0/lib'
make all-am
make[3]: Entering directory '/home/peter/coreutils-5.0/lib'
if gcc -DLIBDIR=\"/home/peter/result/lib\" -DHAVE_CONFIG_H -I. -I. -I.. -I.. -I. -U_FORTIFY_SOURCE -MT md5.o -MD -MP -MF ".deps/md5.Tpo" \
-c -o md5.o `test -f 'md5.c' || echo './'`md5.c; \
then mv ".deps/md5.Tpo" ".deps/md5.Po"; \
else rm -f ".deps/md5.Tpo"; exit 1; \
fi
md5.c: In function 'md5_finish_ctx':
md5.c:129:3: error: implicit declaration of function 'memcpy' [ttps://gcc.gnu.org/onlinedocs/gcc-14.2.0/gcc/Warning-Options.html#index-Wimplicit-function-declaration-Wimplicit-function-declaration]8;;]
129 | memcpy (&ctx->buffer[bytes], fillbuf, pad);
| ^~~~~~
md5.c:40:1: note: include '<string.h>' or provide a declaration of 'memcpy'
39 | #include "unlocked-io.h"
+++ |+#include <string.h>
40 |
md5.c:129:3: warning: incompatible implicit declaration of built-in function 'memcpy' [ttps://gcc.gnu.org/onlinedocs/gcc-14.2.0/gcc/Warning-Options.html#index-Wbuiltin-declaration-mismatch-Wbuiltin-declaration-mismatch]8;;]
129 | memcpy (&ctx->buffer[bytes], fillbuf, pad);
| ^~~~~~
md5.c:129:3: note: include '<string.h>' or provide a declaration of 'memcpy'
md5.c: In function 'md5_process_bytes':
md5.c:246:7: warning: incompatible implicit declaration of built-in function 'memcpy' [ttps://gcc.gnu.org/onlinedocs/gcc-14.2.0/gcc/Warning-Options.html#index-Wbuiltin-declaration-mismatch-Wbuiltin-declaration-mismatch]8;;]
246 | memcpy (&ctx->buffer[left_over], buffer, add);
| ^~~~~~
md5.c:246:7: note: include '<string.h>' or provide a declaration of 'memcpy'
md5.c:277:32: warning: incompatible implicit declaration of built-in function 'memcpy' [ttps://gcc.gnu.org/onlinedocs/gcc-14.2.0/gcc/Warning-Options.html#index-Wbuiltin-declaration-mismatch-Wbuiltin-declaration-mismatch]8;;]
277 | md5_process_block (memcpy (ctx->buffer, buffer, 64), 64, ctx);
| ^~~~~~
md5.c:277:32: note: include '<string.h>' or provide a declaration of 'memcpy'
md5.c:295:7: warning: incompatible implicit declaration of built-in function 'memcpy' [ttps://gcc.gnu.org/onlinedocs/gcc-14.2.0/gcc/Warning-Options.html#index-Wbuiltin-declaration-mismatch-Wbuiltin-declaration-mismatch]8;;]
295 | memcpy (&ctx->buffer[left_over], buffer, len);
| ^~~~~~
md5.c:295:7: note: include '<string.h>' or provide a declaration of 'memcpy'
make[3]: *** [Makefile:590: md5.o] Error 1
make[3]: Leaving directory '/home/peter/coreutils-5.0/lib'
make[2]: *** [Makefile:414: all] Error 2
make[2]: Leaving directory '/home/peter/coreutils-5.0/lib'
make[1]: *** [Makefile:244: all-recursive] Error 1
make[1]: Leaving directory '/home/peter/coreutils-5.0'
make: *** [Makefile:199: all] Error 2
Show reasoning
Resolving a Build Error
I've identified a build error, specifically the implicit declaration of memcpy in md5.o. To resolve this, I'll include the string.h header file directly within the md5.c file. This should provide the necessary function prototype and eliminate the error during compilation.
[empty output]
compile-bench> cd /home/peter/coreutils-5.0 && make CFLAGS="-U_FORTIFY_SOURCE" make all-recursive
make[1]: Entering directory '/home/peter/coreutils-5.0'
Making all in lib
make[2]: Entering directory '/home/peter/coreutils-5.0/lib'
make all-am
make[3]: Entering directory '/home/peter/coreutils-5.0/lib'
if gcc -DLIBDIR=\"/home/peter/result/lib\" -DHAVE_CONFIG_H -I. -I. -I.. -I.. -I. -U_FORTIFY_SOURCE -MT md5.o -MD -MP -MF ".deps/md5.Tpo" \
-c -o md5.o `test -f 'md5.c' || echo './'`md5.c; \
then mv ".deps/md5.Tpo" ".deps/md5.Po"; \
else rm -f ".deps/md5.Tpo"; exit 1; \
fi
if gcc -DLIBDIR=\"/home/peter/result/lib\" -DHAVE_CONFIG_H -I. -I. -I.. -I.. -I. -U_FORTIFY_SOURCE -MT putenv.o -MD -MP -MF ".deps/putenv.Tpo" \
-c -o putenv.o `test -f 'putenv.c' || echo './'`putenv.c; \
then mv ".deps/putenv.Tpo" ".deps/putenv.Po"; \
else rm -f ".deps/putenv.Tpo"; exit 1; \
fi
putenv.c:65:1: error: conflicting types for 'rpl_putenv'; have 'int(const char *)'
65 | rpl_putenv (const char *string)
| ^~~~~~~~~~
In file included from putenv.c:21:
../config.h:1406:16: note: previous declaration of 'rpl_putenv' with type 'int(char *)'
1406 | #define putenv rpl_putenv
| ^~~~~~~~~~
make[3]: *** [Makefile:590: putenv.o] Error 1
make[3]: Leaving directory '/home/peter/coreutils-5.0/lib'
make[2]: *** [Makefile:414: all] Error 2
make[2]: Leaving directory '/home/peter/coreutils-5.0/lib'
make[1]: *** [Makefile:244: all-recursive] Error 1
make[1]: Leaving directory '/home/peter/coreutils-5.0'
make: *** [Makefile:199: all] Error 2
↓ 31 lines
make all-recursive
make[1]: Entering directory '/home/peter/coreutils-5.0'
Making all in lib
make[2]: Entering directory '/home/peter/coreutils-5.0/lib'
make all-am
make[3]: Entering directory '/home/peter/coreutils-5.0/lib'
if gcc -DLIBDIR=\"/home/peter/result/lib\" -DHAVE_CONFIG_H -I. -I. -I.. -I.. -I. -U_FORTIFY_SOURCE -MT md5.o -MD -MP -MF ".deps/md5.Tpo" \
-c -o md5.o `test -f 'md5.c' || echo './'`md5.c; \
then mv ".deps/md5.Tpo" ".deps/md5.Po"; \
else rm -f ".deps/md5.Tpo"; exit 1; \
fi
if gcc -DLIBDIR=\"/home/peter/result/lib\" -DHAVE_CONFIG_H -I. -I. -I.. -I.. -I. -U_FORTIFY_SOURCE -MT putenv.o -MD -MP -MF ".deps/putenv.Tpo" \
-c -o putenv.o `test -f 'putenv.c' || echo './'`putenv.c; \
then mv ".deps/putenv.Tpo" ".deps/putenv.Po"; \
else rm -f ".deps/putenv.Tpo"; exit 1; \
fi
putenv.c:65:1: error: conflicting types for 'rpl_putenv'; have 'int(const char *)'
65 | rpl_putenv (const char *string)
| ^~~~~~~~~~
In file included from putenv.c:21:
../config.h:1406:16: note: previous declaration of 'rpl_putenv' with type 'int(char *)'
1406 | #define putenv rpl_putenv
| ^~~~~~~~~~
make[3]: *** [Makefile:590: putenv.o] Error 1
make[3]: Leaving directory '/home/peter/coreutils-5.0/lib'
make[2]: *** [Makefile:414: all] Error 2
make[2]: Leaving directory '/home/peter/coreutils-5.0/lib'
make[1]: *** [Makefile:244: all-recursive] Error 1
make[1]: Leaving directory '/home/peter/coreutils-5.0'
make: *** [Makefile:199: all] Error 2
Show reasoning
Diagnosing Compilation Errors
I've identified a compilation error within putenv.c caused by a conflict in the rpl_putenv function's declaration. It seems the function is defined inconsistently between config.h and the source file, leading to conflicting types. I'm now investigating config.h to pinpoint the exact mismatch in return types or argument lists.
Rectifying Function Declarations
I've identified the core issue: the rpl_putenv function's declaration in putenv.c doesn't align with config.h. Initially, I planned to adjust putenv.c to match the const char in config.h, but the error specifies char , so I must modify putenv.c accordingly. Furthermore, I must re-evaluate my previous edits to prevent similar conflicts and ensure correct header inclusion. I will then retry a compilation.
Resolving Type Discrepancies
I'm now correcting the rpl_putenv declaration in putenv.c to align with config.h, shifting from const char to char . I've also removed the incorrect stdlib.h include and the commented-out malloc declaration to ensure a clean starting point. My next action will be to recompile with the specified flags and assess the outcome to see if the compilation passes.
Addressing Argument Types
I've confirmed the rpl_putenv declaration discrepancy. I will now execute sed commands to align putenv.c with config.h, changing from const char to char . Subsequently, I'll meticulously clean up any extraneous stdlib.h inclusions and re-compile, ensuring the CFLAGS flag is used. My current focus is on a precise implementation, ensuring only the required changes are made.
compile-bench> cat /home/peter/coreutils-5.0/lib/putenv.c | head -n 70 /* Copyright (C) 1991, 1994, 1997, 1998, 2000 Free Software Foundation, Inc.
NOTE: The canonical source of this file is maintained with the GNU C
Library. Bugs can be reported to [email protected].
This program is free software; you can redistribute it and/or modify it
under the terms of the GNU General Public License as published by the
Free Software Foundation; either version 2, or (at your option) any
later version.
This program is distributed in the hope that it will be useful,
but WITHOUT ANY WARRANTY; without even the implied warranty of
MERCHANTABILITY or FITNESS FOR A PARTICULAR PURPOSE. See the
GNU General Public License for more details.
You should have received a copy of the GNU General Public License
along with this program; if not, write to the Free Software Foundation,
Inc., 59 Temple Place - Suite 330, Boston, MA 02111-1307, USA. */
#if HAVE_CONFIG_H
# include <config.h>
#endif
#include <sys/types.h>
/* Include errno.h *after* sys/types.h to work around header problems
on AIX 3.2.5. */
#include <errno.h>
/* Don't include stdlib.h because some (e.g., Solaris 2.7) declare putenv
with a non-const argument. That would conflict with the declaration of
rpl_putenv below (due to the #define putenv rpl_putenv from config.h). */
//char *malloc ();
#include <stdlib.h>
void free ();
#if defined (__GNU_LIBRARY__) || defined (HAVE_STRING_H)
# include <string.h>
#endif
#if defined (__GNU_LIBRARY__) || defined (HAVE_UNISTD_H)
# include <unistd.h>
#endif
#if !defined (__GNU_LIBRARY__) && !defined (HAVE_STRCHR)
# define strchr index
#endif
#if !defined (__GNU_LIBRARY__) && !defined (HAVE_MEMCPY)
# define memcpy(d,s,n) bcopy ((s), (d), (n))
#endif
#if HAVE_GNU_LD
# define environ __environ
#else
extern char **environ;
#endif
#ifndef NULL
# define NULL 0
#endif
/* Put STRING, which is of the form "NAME=VALUE", in the environment. */
int
rpl_putenv (const char *string)
{
const char *const name_end = strchr (string, '=');
register size_t size;
register char **ep;
↓ 70 lines
/* Copyright (C) 1991, 1994, 1997, 1998, 2000 Free Software Foundation, Inc. NOTE: The canonical source of this file is maintained with the GNU C Library. Bugs can be reported to [email protected]. This program is free software; you can redistribute it and/or modify it under the terms of the GNU General Public License as published by the Free Software Foundation; either version 2, or (at your option) any later version. This program is distributed in the hope that it will be useful, but WITHOUT ANY WARRANTY; without even the implied warranty of MERCHANTABILITY or FITNESS FOR A PARTICULAR PURPOSE. See the GNU General Public License for more details. You should have received a copy of the GNU General Public License along with this program; if not, write to the Free Software Foundation, Inc., 59 Temple Place - Suite 330, Boston, MA 02111-1307, USA. */ #if HAVE_CONFIG_H # include <config.h> #endif #include <sys/types.h> /* Include errno.h *after* sys/types.h to work around header problems on AIX 3.2.5. */ #include <errno.h> /* Don't include stdlib.h because some (e.g., Solaris 2.7) declare putenv with a non-const argument. That would conflict with the declaration of rpl_putenv below (due to the #define putenv rpl_putenv from config.h). */ //char *malloc (); #include <stdlib.h> void free (); #if defined (__GNU_LIBRARY__) || defined (HAVE_STRING_H) # include <string.h> #endif #if defined (__GNU_LIBRARY__) || defined (HAVE_UNISTD_H) # include <unistd.h> #endif #if !defined (__GNU_LIBRARY__) && !defined (HAVE_STRCHR) # define strchr index #endif #if !defined (__GNU_LIBRARY__) && !defined (HAVE_MEMCPY) # define memcpy(d,s,n) bcopy ((s), (d), (n)) #endif #if HAVE_GNU_LD # define environ __environ #else extern char **environ; #endif #ifndef NULL # define NULL 0 #endif /* Put STRING, which is of the form "NAME=VALUE", in the environment. */ int rpl_putenv (const char *string) { const char *const name_end = strchr (string, '='); register size_t size; register char **ep;
Show reasoning
Debugging the Conflict
I've narrowed down the problem. The compiler is complaining because the function rpl_putenv is defined inconsistently. It seems putenv is being redefined as rpl_putenv in config.h. This clash is the likely source of the type conflict, and now I'm figuring out why the redefinition exists.
Analyzing the Type Conflicts
I've identified the root cause: a type mismatch between the rpl_putenv function definition and its usage due to the preprocessor directive. config.h redefines putenv with rpl_putenv, leading to inconsistencies. The warning about free() in putenv.c is also a problem. My next step is to correct the conflicting types and remove the duplicate declaration of free() in putenv.c.
[empty output]
Show reasoning
Investigating Type Conflicts
I've identified the issue in putenv.c: conflicting types for rpl_putenv. The config.h file defines it as char , but the implementation declares it as const char . I've already changed the implementation in putenv.c to align with the config.h definition for a swift resolution.
Debugging Compilation Failures
I'm still battling the compilation errors. After the putenv.c fix, I'm focusing on error.c. I've checked for missing includes and suspect strerror_r type conflicts. I'm also experimenting with removing specific definitions to align with system headers and plan to recompile with a clean slate. Adding necessary header files is the next step.
compile-bench> cd /home/peter/coreutils-5.0 && make CFLAGS="-U_FORTIFY_SOURCE" make all-recursive
make[1]: Entering directory '/home/peter/coreutils-5.0'
Making all in lib
make[2]: Entering directory '/home/peter/coreutils-5.0/lib'
make all-am
make[3]: Entering directory '/home/peter/coreutils-5.0/lib'
if gcc -DLIBDIR=\"/home/peter/result/lib\" -DHAVE_CONFIG_H -I. -I. -I.. -I.. -I. -U_FORTIFY_SOURCE -MT putenv.o -MD -MP -MF ".deps/putenv.Tpo" \
-c -o putenv.o `test -f 'putenv.c' || echo './'`putenv.c; \
then mv ".deps/putenv.Tpo" ".deps/putenv.Po"; \
else rm -f ".deps/putenv.Tpo"; exit 1; \
fi
if gcc -DLIBDIR=\"/home/peter/result/lib\" -DHAVE_CONFIG_H -I. -I. -I.. -I.. -I. -U_FORTIFY_SOURCE -MT error.o -MD -MP -MF ".deps/error.Tpo" \
-c -o error.o `test -f 'error.c' || echo './'`error.c; \
then mv ".deps/error.Tpo" ".deps/error.Po"; \
else rm -f ".deps/error.Tpo"; exit 1; \
fi
if gcc -DLIBDIR=\"/home/peter/result/lib\" -DHAVE_CONFIG_H -I. -I. -I.. -I.. -I. -U_FORTIFY_SOURCE -MT getgroups.o -MD -MP -MF ".deps/getgroups.Tpo" \
-c -o getgroups.o `test -f 'getgroups.c' || echo './'`getgroups.c; \
then mv ".deps/getgroups.Tpo" ".deps/getgroups.Po"; \
else rm -f ".deps/getgroups.Tpo"; exit 1; \
fi
getgroups.c: In function 'rpl_getgroups':
getgroups.c:40:12: error: implicit declaration of function 'getgroups'; did you mean 'rpl_getgroups'? [ttps://gcc.gnu.org/onlinedocs/gcc-14.2.0/gcc/Warning-Options.html#index-Wimplicit-function-declaration-Wimplicit-function-declaration]8;;]
40 | return getgroups (n, group);
| ^~~~~~~~~
| rpl_getgroups
getgroups.c:53:3: error: implicit declaration of function 'free' [ttps://gcc.gnu.org/onlinedocs/gcc-14.2.0/gcc/Warning-Options.html#index-Wimplicit-function-declaration-Wimplicit-function-declaration]8;;]
53 | free (gbuf);
| ^~~~
getgroups.c:25:1: note: include '<stdlib.h>' or provide a declaration of 'free'
24 | #include "xalloc.h"
+++ |+#include <stdlib.h>
25 |
getgroups.c:53:3: warning: incompatible implicit declaration of built-in function 'free' [ttps://gcc.gnu.org/onlinedocs/gcc-14.2.0/gcc/Warning-Options.html#index-Wbuiltin-declaration-mismatch-Wbuiltin-declaration-mismatch]8;;]
53 | free (gbuf);
| ^~~~
getgroups.c:53:3: note: include '<stdlib.h>' or provide a declaration of 'free'
make[3]: *** [Makefile:590: getgroups.o] Error 1
make[3]: Leaving directory '/home/peter/coreutils-5.0/lib'
make[2]: *** [Makefile:414: all] Error 2
make[2]: Leaving directory '/home/peter/coreutils-5.0/lib'
make[1]: *** [Makefile:244: all-recursive] Error 1
make[1]: Leaving directory '/home/peter/coreutils-5.0'
make: *** [Makefile:199: all] Error 2
↓ 45 lines
make all-recursive
make[1]: Entering directory '/home/peter/coreutils-5.0'
Making all in lib
make[2]: Entering directory '/home/peter/coreutils-5.0/lib'
make all-am
make[3]: Entering directory '/home/peter/coreutils-5.0/lib'
if gcc -DLIBDIR=\"/home/peter/result/lib\" -DHAVE_CONFIG_H -I. -I. -I.. -I.. -I. -U_FORTIFY_SOURCE -MT putenv.o -MD -MP -MF ".deps/putenv.Tpo" \
-c -o putenv.o `test -f 'putenv.c' || echo './'`putenv.c; \
then mv ".deps/putenv.Tpo" ".deps/putenv.Po"; \
else rm -f ".deps/putenv.Tpo"; exit 1; \
fi
if gcc -DLIBDIR=\"/home/peter/result/lib\" -DHAVE_CONFIG_H -I. -I. -I.. -I.. -I. -U_FORTIFY_SOURCE -MT error.o -MD -MP -MF ".deps/error.Tpo" \
-c -o error.o `test -f 'error.c' || echo './'`error.c; \
then mv ".deps/error.Tpo" ".deps/error.Po"; \
else rm -f ".deps/error.Tpo"; exit 1; \
fi
if gcc -DLIBDIR=\"/home/peter/result/lib\" -DHAVE_CONFIG_H -I. -I. -I.. -I.. -I. -U_FORTIFY_SOURCE -MT getgroups.o -MD -MP -MF ".deps/getgroups.Tpo" \
-c -o getgroups.o `test -f 'getgroups.c' || echo './'`getgroups.c; \
then mv ".deps/getgroups.Tpo" ".deps/getgroups.Po"; \
else rm -f ".deps/getgroups.Tpo"; exit 1; \
fi
getgroups.c: In function 'rpl_getgroups':
getgroups.c:40:12: error: implicit declaration of function 'getgroups'; did you mean 'rpl_getgroups'? [ttps://gcc.gnu.org/onlinedocs/gcc-14.2.0/gcc/Warning-Options.html#index-Wimplicit-function-declaration-Wimplicit-function-declaration]8;;]
40 | return getgroups (n, group);
| ^~~~~~~~~
| rpl_getgroups
getgroups.c:53:3: error: implicit declaration of function 'free' [ttps://gcc.gnu.org/onlinedocs/gcc-14.2.0/gcc/Warning-Options.html#index-Wimplicit-function-declaration-Wimplicit-function-declaration]8;;]
53 | free (gbuf);
| ^~~~
getgroups.c:25:1: note: include '<stdlib.h>' or provide a declaration of 'free'
24 | #include "xalloc.h"
+++ |+#include <stdlib.h>
25 |
getgroups.c:53:3: warning: incompatible implicit declaration of built-in function 'free' [ttps://gcc.gnu.org/onlinedocs/gcc-14.2.0/gcc/Warning-Options.html#index-Wbuiltin-declaration-mismatch-Wbuiltin-declaration-mismatch]8;;]
53 | free (gbuf);
| ^~~~
getgroups.c:53:3: note: include '<stdlib.h>' or provide a declaration of 'free'
make[3]: *** [Makefile:590: getgroups.o] Error 1
make[3]: Leaving directory '/home/peter/coreutils-5.0/lib'
make[2]: *** [Makefile:414: all] Error 2
make[2]: Leaving directory '/home/peter/coreutils-5.0/lib'
make[1]: *** [Makefile:244: all-recursive] Error 1
make[1]: Leaving directory '/home/peter/coreutils-5.0'
make: *** [Makefile:199: all] Error 2
Show reasoning
Investigating Compilation Errors
I'm currently examining the compilation failures. The make command for putenv.o, error.o, and getgroups.o failed. Specifically, I am focusing on the putenv.o error. The compiler reports conflicting types for rpl_putenv, which is likely the root cause.
Debugging Type Conflicts
I've isolated the conflict. The issue isn't solely in putenv.c. The config.h macro, which redefines putenv, is the culprit. It seems that the macro expects char, while the actual rpl_putenv in putenv.c is now defined with const char. The fix needs to address this incompatibility between the macro definition and the function signature to ensure consistent type usage.
Refining Type Consistency
I've identified that the issue extends beyond putenv.c. My initial fix was incomplete. The core problem stems from config.h's macro, which indirectly expects a non-const char for putenv. I am therefore reverting the changes to putenv.c, and then correcting the argument type declaration in rpl_putenv, so that it takes a char string instead. I'll need to re-examine the error.o errors after resolving the initial type conflict.
Adjusting Compilation Strategies
I'm now working on the errors again. I have removed the initial change in putenv.c, as well as removing the stdlib.h include. I then reverted rpl_putenv to const char *string. Then I am correcting the header includes in error.c and will address getgroups.c afterwards, if there are issues.
Finalizing the Fixes
I'm now consolidating the corrections. I've undone the prior adjustments to putenv.c that were intended to fix the type conflict. Specifically, the function's argument declaration in rpl_putenv is now restored to const char string, and I've ensured stdlib.h is not included and char malloc() is uncommented. Next, in error.c, I removed any and all include statements for string.h and stdlib.h and re-added them at the top after config.h. Finally, I've inserted #include into getgroups.c as well.
[empty output]
[empty output]
Show reasoning
Debugging #include Issues
I'm re-evaluating the inclusion of in putenv.c, considering the possibility of incorrect placement or lingering related problems. A rebuild is underway. If failures persist, I'll delve deeper into putenv.c and also scrutinize getgroups.c for clues.
Resolving Include Conflicts
I've pinpointed the issue. It seems the free function wasn't properly declared in getgroups.c, leading to an implicit declaration error. My immediate course of action is to add #include to getgroups.c to resolve this. I will rebuild and hope the error is gone.
[empty output]
compile-bench> cd /home/peter/coreutils-5.0 && make CFLAGS="-U_FORTIFY_SOURCE" make all-recursive
make[1]: Entering directory '/home/peter/coreutils-5.0'
Making all in lib
make[2]: Entering directory '/home/peter/coreutils-5.0/lib'
make all-am
make[3]: Entering directory '/home/peter/coreutils-5.0/lib'
if gcc -DLIBDIR=\"/home/peter/result/lib\" -DHAVE_CONFIG_H -I. -I. -I.. -I.. -I. -U_FORTIFY_SOURCE -MT putenv.o -MD -MP -MF ".deps/putenv.Tpo" \
-c -o putenv.o `test -f 'putenv.c' || echo './'`putenv.c; \
then mv ".deps/putenv.Tpo" ".deps/putenv.Po"; \
else rm -f ".deps/putenv.Tpo"; exit 1; \
fi
if gcc -DLIBDIR=\"/home/peter/result/lib\" -DHAVE_CONFIG_H -I. -I. -I.. -I.. -I. -U_FORTIFY_SOURCE -MT getgroups.o -MD -MP -MF ".deps/getgroups.Tpo" \
-c -o getgroups.o `test -f 'getgroups.c' || echo './'`getgroups.c; \
then mv ".deps/getgroups.Tpo" ".deps/getgroups.Po"; \
else rm -f ".deps/getgroups.Tpo"; exit 1; \
fi
getgroups.c: In function 'rpl_getgroups':
getgroups.c:41:12: error: implicit declaration of function 'getgroups'; did you mean 'rpl_getgroups'? [ttps://gcc.gnu.org/onlinedocs/gcc-14.2.0/gcc/Warning-Options.html#index-Wimplicit-function-declaration-Wimplicit-function-declaration]8;;]
41 | return getgroups (n, group);
| ^~~~~~~~~
| rpl_getgroups
make[3]: *** [Makefile:590: getgroups.o] Error 1
make[3]: Leaving directory '/home/peter/coreutils-5.0/lib'
make[2]: *** [Makefile:414: all] Error 2
make[2]: Leaving directory '/home/peter/coreutils-5.0/lib'
make[1]: *** [Makefile:244: all-recursive] Error 1
make[1]: Leaving directory '/home/peter/coreutils-5.0'
make: *** [Makefile:199: all] Error 2
↓ 29 lines
make all-recursive
make[1]: Entering directory '/home/peter/coreutils-5.0'
Making all in lib
make[2]: Entering directory '/home/peter/coreutils-5.0/lib'
make all-am
make[3]: Entering directory '/home/peter/coreutils-5.0/lib'
if gcc -DLIBDIR=\"/home/peter/result/lib\" -DHAVE_CONFIG_H -I. -I. -I.. -I.. -I. -U_FORTIFY_SOURCE -MT putenv.o -MD -MP -MF ".deps/putenv.Tpo" \
-c -o putenv.o `test -f 'putenv.c' || echo './'`putenv.c; \
then mv ".deps/putenv.Tpo" ".deps/putenv.Po"; \
else rm -f ".deps/putenv.Tpo"; exit 1; \
fi
if gcc -DLIBDIR=\"/home/peter/result/lib\" -DHAVE_CONFIG_H -I. -I. -I.. -I.. -I. -U_FORTIFY_SOURCE -MT getgroups.o -MD -MP -MF ".deps/getgroups.Tpo" \
-c -o getgroups.o `test -f 'getgroups.c' || echo './'`getgroups.c; \
then mv ".deps/getgroups.Tpo" ".deps/getgroups.Po"; \
else rm -f ".deps/getgroups.Tpo"; exit 1; \
fi
getgroups.c: In function 'rpl_getgroups':
getgroups.c:41:12: error: implicit declaration of function 'getgroups'; did you mean 'rpl_getgroups'? [ttps://gcc.gnu.org/onlinedocs/gcc-14.2.0/gcc/Warning-Options.html#index-Wimplicit-function-declaration-Wimplicit-function-declaration]8;;]
41 | return getgroups (n, group);
| ^~~~~~~~~
| rpl_getgroups
make[3]: *** [Makefile:590: getgroups.o] Error 1
make[3]: Leaving directory '/home/peter/coreutils-5.0/lib'
make[2]: *** [Makefile:414: all] Error 2
make[2]: Leaving directory '/home/peter/coreutils-5.0/lib'
make[1]: *** [Makefile:244: all-recursive] Error 1
make[1]: Leaving directory '/home/peter/coreutils-5.0'
make: *** [Makefile:199: all] Error 2
Show reasoning
Resolving Implicit Declaration
I've addressed the getgroups implicit declaration error. I added the necessary include statement to the getgroups.c file using sed. Next step is to rebuild to confirm resolution, and then move on to the next issue.
Fixing the Include
I just added the #include directive to the getgroups.c file using sed. Now, I'm going to initiate a rebuild to confirm if this action resolved the implicit declaration issue. If successful, I'll proceed to the next compilation error.
task failed: sha1sum binary does not exist